Онтология на сектора на DPP - Съвместим с ESPR за текстил
type: Ontology
version info: v2
source: Based on 'Preparatory study on textiles for product policy instruments (3rd milestone)' by the European Commission Joint Research Centre (JRC), 2024. Licensed under CC BY 4.0 (https://creativecommons.org/licenses/by/4.0/).
title: DPP Sector Ontology - Textile ESPR Compliant @en
title: Ontologie odvětví DPP - V souladu s ESPR pro textil @cs
title: DPP-sektorontologi - I overensstemmelse med ESPR for tekstiler @da
title: DPP-Sektor-Ontologie - ESPR-konform für Textilien @de
title: Οντολογία Τομέα DPP - Συμβατή με ESPR για κλωστοϋφαντουργικά προϊόντα @el
title: Ontología del Sector DPP - Cumple con ESPR para textiles @es
title: DPP sektori ontoloogia - Tekstiilide ESPR-iga ühilduv @et
title: DPP-sektoriontologia - Yhteensopiva tekstiilien ESPR:n kanssa @fi
title: Ontologie sectorielle DPP - Conforme à l'ESPR pour les textiles @fr
title: Ointeolaíocht Earnála DPP - Comhlíontach le ESPR do Theicstílí @ga
title: Ontologija sektora DPP - U skladu s ESPR-om za tekstil @hr
title: DPP ágazati ontológia - ESPR-kompatibilis textíliákhoz @hu
title: Ontologia del settore DPP - Conforme all'ESPR per i tessili @it
title: DPP sektoriaus ontologija - Suderinama su ESPR tekstilės gaminiams @lt
title: DPP nozares ontoloģija - Atbilst ESPR prasībām tekstilizstrādājumiem @lv
title: Ontoloġija tas-Settur DPP - Konformi mal-ESPR għat-Tessuti @mt
title: DPP Sectorontologie - Voldoet aan ESPR voor textiel @nl
title: Ontologia sektora DPP - Zgodna z ESPR dla tekstyliów @pl
title: Ontologia do Setor DPP - Em conformidade com o ESPR para têxteis @pt
title: Ontologia sectorului DPP - Conform cu ESPR pentru textile @ro
title: Ontológia sektora DPP - V súlade s ESPR pre textil @sk
title: Sektorska ontologija DPP - V skladu z ESPR za tekstil @sl
title: DPP-sektorontologi - Överensstämmer med ESPR för textilier @sv
description: Defines sector-specific concepts compliant with the upcoming ESPR Delegated Act for Textiles. @en
description: Определя специфични за сектора концепции, съвместими с предстоящия Делегиран акт на ESPR за текстила.
description: Definuje koncepty specifické pro dané odvětví v souladu s nadcházejícím aktem v přenesené pravomoci ESPR pro textil. @cs
description: Definerer sektorspecifikke koncepter i overensstemmelse med den kommende delegerede retsakt fra ESPR for tekstiler. @da
description: Definiert sektorspezifische Konzepte, die dem kommenden delegierten Rechtsakt des ESPR für Textilien entsprechen. @de
description: Καθορίζει έννοιες ειδικές για τον τομέα που συμμορφώνονται με την επερχόμενη κατ' εξουσιοδότηση πράξη ESPR για τα κλωστοϋφαντουργικά προϊόντα. @el
description: Define conceptos específicos del sector que cumplen con el próximo Acto Delegado del ESPR para textiles. @es
description: Määratleb sektoripõhised kontseptsioonid, mis on kooskõlas eelseisva tekstiiltoodete ESPR delegeeritud õigusaktiga. @et
description: Määrittää alakohtaisia käsitteitä, jotka ovat yhteensopivia tulevan tekstiilejä koskevan ESPR:n delegoidun säädöksen kanssa. @fi
description: Définit des concepts spécifiques au secteur conformes au prochain acte délégué de l'ESPR pour les textiles. @fr
description: Sainmhínítear coincheapa a bhaineann go sonrach leis an earnáil agus atá i gcomhréir le Gníomh Tarmligthe ESPR do Theicstílí atá le teacht. @ga
description: Definira koncepte specifične za sektor u skladu s nadolazećim delegiranim aktom ESPR-a za tekstil. @hr
description: Meghatározza az ágazatspecifikus fogalmakat, amelyek megfelelnek a textilekre vonatkozó közelgő ESPR felhatalmazáson alapuló jogi aktusnak. @hu
description: Definisce concetti specifici del settore conformi al prossimo atto delegato dell'ESPR per i tessili. @it
description: Apibrėžia konkrečiam sektoriui skirtas sąvokas, atitinkančias būsimą ESPR deleguotąjį aktą dėl tekstilės gaminių. @lt
description: Nosaka nozarei specifiskus jēdzienus, kas atbilst gaidāmajam ESPR deleģētajam aktam par tekstilizstrādājumiem. @lv
description: Jiddefinixxi kunċetti speċifiċi għas-settur li huma konformi mal-Att Delegat li jmiss tal-ESPR għat-Tessuti. @mt
description: Definieert sectorspecifieke concepten die voldoen aan de komende gedelegeerde handeling van de ESPR voor textiel. @nl
description: Definiuje pojęcia specyficzne dla sektora, zgodne z nadchodzącym aktem delegowanym ESPR dotyczącym tekstyliów. @pl
description: Define conceitos específicos do setor em conformidade com o próximo Ato Delegado do ESPR para os têxteis. @pt
description: Definește concepte specifice sectorului, conforme cu viitorul act delegat al ESPR pentru textile. @ro
description: Definuje koncepty špecifické pre dané odvetvie v súlade s pripravovaným delegovaným aktom ESPR pre textil. @sk
description: Določa koncepte, specifične za posamezne sektorje, ki so v skladu s prihajajočim delegiranim aktom ESPR za tekstil. @sl
description: Definierar branschspecifika koncept som överensstämmer med den kommande delegerade akten från ESPR för textilier. @sv
imports: Compliance.jsonld
imports: EUApparelSizeSystem.jsonld

Текстилен продукт
type: Class
label: Textile Product @en
label: Textilní výrobek @cs
label: Tekstilprodukt @da
label: Textilerzeugnis @de
label: Κλωστοϋφαντουργικό προϊόν @el
label: Producto textil @es
label: Tekstiiltoode @et
label: Tekstiilituote @fi
label: Produit textile @fr
label: Táirge teicstíle @ga
label: Tekstilni proizvod @hr
label: Textiltermék @hu
label: Prodotto tessile @it
label: Tekstilės gaminys @lt
label: Tekstilizstrādājums @lv
label: Prodott tat-tessuti @mt
label: Textielproduct @nl
label: Produkt włókienniczy @pl
label: Produto têxtil @pt
label: Produs textil @ro
label: Textilný výrobok @sk
label: Tekstilni izdelek @sl
label: Textilprodukt @sv
comment: Any raw, semi-worked, or worked product which is exclusively composed of textile fibres, regardless of the mixing or assembly process employed. @en
comment: Всеки суров, полуобработен или обработен продукт, който е съставен изключително от текстилни влакна, независимо от използвания процес на смесване или сглобяване.
comment: Jakýkoli surový, polozpracovaný nebo zpracovaný výrobek, který je výlučně složen z textilních vláken, bez ohledu na použitý proces mísení nebo montáže. @cs
comment: Ethvert råt, halvforarbejdet eller forarbejdet produkt, der udelukkende består af tekstilfibre, uanset hvilken blandings- eller samleproces der anvendes. @da
comment: Jedes rohe, halbbearbeitete oder bearbeitete Erzeugnis, das ausschließlich aus Textilfasern besteht, unabhängig vom angewandten Misch- oder Montageverfahren. @de
comment: Κάθε ακατέργαστο, ημικατεργασμένο ή κατεργασμένο προϊόν το οποίο αποτελείται αποκλειστικά από υφαντικές ίνες, ανεξάρτητα από τη διαδικασία ανάμειξης ή συναρμολόγησης που χρησιμοποιείται. @el
comment: Todo producto en bruto, semielaborado o elaborado que esté compuesto exclusivamente por fibras textiles, independientemente del proceso de mezcla o ensamblaje empleado. @es
comment: Mis tahes toor-, pooltoode või töödeldud toode, mis koosneb eranditult tekstiilkiududest, sõltumata kasutatud segamis- või kokkupanemisprotsessist. @et
comment: Kaikki raa'at, puolivalmisteet tai valmisteet, jotka koostuvat yksinomaan tekstiilikuiduista, riippumatta käytetystä sekoitus- tai kokoonpanoprosessista. @fi
comment: Tout produit brut, semi-ouvré ou ouvré qui est exclusivement composé de fibres textiles, quel que soit le processus de mélange ou d'assemblage employé. @fr
comment: Aon táirge amh, leath-oibrithe nó oibrithe atá comhdhéanta go heisiach de shnáithíní teicstíle, is cuma cén próiseas measctha nó cóimeála a úsáidtear. @ga
comment: Bilo koji sirovi, poluobrađeni ili obrađeni proizvod koji se isključivo sastoji od tekstilnih vlakana, bez obzira na upotrijebljeni proces miješanja ili sastavljanja. @hr
comment: Bármely nyers, félkész vagy késztermék, amely kizárólag textilszálakból áll, függetlenül az alkalmazott keverési vagy összeszerelési eljárástól. @hu
comment: Qualsiasi prodotto grezzo, semilavorato o lavorato che è composto esclusivamente da fibre tessili, indipendentemente dal processo di miscelazione o assemblaggio impiegato. @it
comment: Bet koks žalias, pusgaminis ar apdorotas gaminys, kuris yra išimtinai sudarytas iš tekstilės pluoštų, neatsižvelgiant į naudojamą maišymo ar surinkimo procesą. @lt
comment: Jebkurš neapstrādāts, daļēji apstrādāts vai apstrādāts izstrādājums, kas sastāv tikai no tekstilšķiedrām neatkarīgi no izmantotā sajaukšanas vai montāžas procesa. @lv
comment: Kwalunkwe prodott mhux maħdum, nofsu maħdum, jew maħdum li huwa kompost esklussivament minn fibri tat-tessuti, irrispettivament mill-proċess ta' taħlit jew assemblaġġ impjegat. @mt
comment: Elk rauw, halfbewerkt of bewerkt product dat uitsluitend bestaat uit textielvezels, ongeacht het gebruikte meng- of assemblageproces. @nl
comment: Każdy surowy, półprodukt lub gotowy produkt, który składa się wyłącznie z włókien tekstylnych, niezależnie od zastosowanego procesu mieszania lub montażu. @pl
comment: Qualquer produto em bruto, semitrabalhado ou trabalhado que seja exclusivamente composto por fibras têxteis, independentemente do processo de mistura ou montagem utilizado. @pt
comment: Orice produs brut, semiprelucrat sau prelucrat care este compus exclusiv din fibre textile, indiferent de procesul de amestecare sau asamblare utilizat. @ro
comment: Akýkoľvek surový, polotovar alebo hotový výrobok, ktorý je výlučne zložený z textilných vlákien, bez ohľadu na použitý proces miešania alebo montáže. @sk
comment: Kateri koli surov, polizdelan ali izdelan izdelek, ki je izključno sestavljen iz tekstilnih vlaken, ne glede na uporabljeni postopek mešanja ali sestavljanja. @sl
comment: Varje rå, halvbearbetad eller bearbetad produkt som uteslutande består av textilfibrer, oavsett vilken blandnings- eller monteringsprocess som används. @sv
source: Source: ESPR - Annex III (a)
subclass of: Product
subclass of: Clothing

Source: ESPR - Annex III (a)
label: Regulation (EU) No 1007/2011 (Textile Fibre Names) @en
label: Регламент (ЕС) № 1007/2011 (Наименования на текстилните влакна)
label: Nařízení (EU) č. 1007/2011 (Názvy textilních vláken) @cs
label: Forordning (EU) nr. 1007/2011 (Tekstilfibernavne) @da
label: Verordnung (EU) Nr. 1007/2011 (Textilfaserbezeichnungen) @de
label: Κανονισμός (ΕΕ) αριθ. 1007/2011 (Ονομασίες υφαντικών ινών) @el
label: Reglamento (UE) nº 1007/2011 (Denominaciones de las fibras textiles) @es
label: Määrus (EL) nr 1007/2011 (Tekstiilkiudude nimetused) @et
label: Asetus (EU) N:o 1007/2011 (Tekstiilikuitujen nimitykset) @fi
label: Règlement (UE) n° 1007/2011 (Dénominations des fibres textiles) @fr
label: Rialachán (AE) Uimh. 1007/2011 (Ainmneacha Snáithíní Teicstíle) @ga
label: Uredba (EU) br. 1007/2011 (Nazivi tekstilnih vlakana) @hr
label: 1007/2011/EU rendelet (Textilszálak elnevezése) @hu
label: Regolamento (UE) n. 1007/2011 (Denominazioni delle fibre tessili) @it
label: Reglamentas (ES) Nr. 1007/2011 (Tekstilės pluoštų pavadinimai) @lt
label: Regula (ES) Nr. 1007/2011 (Tekstilšķiedru nosaukumi) @lv
label: Regolament (UE) Nru 1007/2011 (Ismijiet tal-fibri tat-tessuti) @mt
label: Verordening (EU) nr. 1007/2011 (Textielvezelbenamingen) @nl
label: Rozporządzenie (UE) nr 1007/2011 (Nazwy włókien tekstylnych) @pl
label: Regulamento (UE) n.º 1007/2011 (Denominações das fibras têxteis) @pt
label: Regulamentul (UE) nr. 1007/2011 (Denumirile fibrelor textile) @ro
label: Nariadenie (EÚ) č. 1007/2011 (Názvy textilných vlákien) @sk
label: Uredba (EU) št. 1007/2011 (Imena tekstilnih vlaken) @sl
label: Förordning (EU) nr 1007/2011 (Textilfibernamn) @sv
label: Source: ESPR - Annex III(e)

Категория PEFCR
type: ObjectProperty
governed by: Apparel and Footwear PEFCR v3.1
source: Source: ESPR - Article 7(2)(b), Annex I(a)
label: PEFCR Category @en
label: Kategorie PEFCR @cs
label: PEFCR-kategori @da
label: PEFCR-Kategorie @de
label: Κατηγορία PEFCR @el
label: Categoría PEFCR @es
label: PEFCR-kategooria @et
label: PEFCR-luokka @fi
label: Catégorie PEFCR @fr
label: Catagóir PEFCR @ga
label: Kategorija PEFCR @hr
label: PEFCR-kategória @hu
label: Categoria PEFCR @it
label: PEFCR kategorija @lt
label: PEFCR-categorie @nl
label: Kategoria PEFCR @pl
label: Kategória PEFCR @sk
comment: The Product Environmental Footprint Category Rules (PEFCR) category to which the product belongs. @en
comment: Категорията на правилата за продуктовия отпечатък върху околната среда (PEFCR), към която принадлежи продуктът.
comment: Kategorie pravidel pro environmentální stopu produktu (PEFCR), do které produkt patří. @cs
comment: Kategorien for produktets miljøaftryk (PEFCR), som produktet tilhører. @da
comment: Die Kategorie der Product Environmental Footprint Category Rules (PEFCR), zu der das Produkt gehört. @de
comment: Η κατηγορία των κανόνων κατηγορίας περιβαλλοντικού αποτυπώματος προϊόντος (PEFCR) στην οποία ανήκει το προϊόν. @el
comment: La categoría de las Reglas de Categoría de Huella Ambiental de Producto (PEFCR) a la que pertenece el producto. @es
comment: Toote keskkonnajalajälje kategooria reeglite (PEFCR) kategooria, millesse toode kuulub. @et
comment: Tuotteen ympäristöjalanjäljen luokkasääntöjen (PEFCR) luokka, johon tuote kuuluu. @fi
comment: La catégorie des règles de catégorie d'empreinte environnementale de produit (PEFCR) à laquelle le produit appartient. @fr
comment: Catagóir Rialacha Catagóir Lorg Comhshaoil ​​Táirge (PEFCR) a mbaineann an táirge léi. @ga
comment: Kategorija pravila o ekološkom otisku proizvoda (PEFCR) kojoj proizvod pripada. @hr
comment: A termék környezeti lábnyomára vonatkozó kategóriaszabályok (PEFCR) szerinti kategória, amelybe a termék tartozik. @hu
comment: La categoria delle regole di categoria dell'impronta ambientale di prodotto (PEFCR) a cui appartiene il prodotto. @it
comment: Produkto aplinkosauginio pėdsako kategorijos taisyklių (PEFCR) kategorija, kuriai priklauso produktas. @lt
comment: Produkta vidiskās pēdas kategorijas noteikumu (PEFCR) kategorija, kurai produkts pieder. @lv
comment: Il-kategorija tar-Regoli tal-Kategorija tal-Impronta Ambjentali tal-Prodott (PEFCR) li għaliha jappartjeni l-prodott. @mt
comment: De categorie van de Product Environmental Footprint Category Rules (PEFCR) waartoe het product behoort. @nl
comment: Kategoria zasad obliczania śladu środowiskowego produktu (PEFCR), do której należy produkt. @pl
comment: A categoria das Regras de Categoria de Pegada Ambiental de Produto (PEFCR) à qual o produto pertence. @pt
comment: Categoria Regulilor privind amprenta de mediu a produsului (PEFCR) din care face parte produsul. @ro
comment: Kategória pravidiel pre environmentálnu stopu výrobku (PEFCR), do ktorej výrobok patrí. @sk
comment: Kategorija pravil za okoljski odtis izdelka (PEFCR), v katero izdelek spada. @sl
comment: Den kategori i reglerna för produktens miljöavtryck (PEFCR) som produkten tillhör. @sv
visibility: Public
domain: Текстилен продукт
range: Стойност на категорията PEFCR

Source: ESPR - Article 7(2)(b), Annex I(a)
label: Source: ESPR - Scope of the DA @en
label: Източник: ESPR - Обхват на ДА
label: Zdroj: ESPR - Oblast působnosti DA @cs
label: Kilde: ESPR - DA's anvendelsesområde @da
label: Quelle: ESPR - Geltungsbereich der DA @de
label: Πηγή: ESPR - Πεδίο εφαρμογής της πράξης @el
label: Fuente: ESPR - Ámbito de aplicación del AD @es
label: Allikas: ESPR - DA kohaldamisala @et
label: Lähde: ESPR - Delegoidun säädöksen soveltamisala @fi
label: Source : ESPR - Champ d'application de l'AD @fr
label: Foinse: ESPR - Scóip an DA @ga
label: Izvor: ESPR - Područje primjene DA @hr
label: Forrás: ESPR - A DA hatálya @hu
label: Fonte: ESPR - Ambito di applicazione dell'AD @it
label: Šaltinis: ESPR - DA taikymo sritis @lt
label: Avots: ESPR - DA darbības joma @lv
label: Sors: ESPR - Ambitu tad-DA @mt
label: Bron: ESPR - Toepassingsgebied van de DA @nl
label: Źródło: ESPR - Zakres DA @pl
label: Fonte: ESPR - Âmbito de aplicação do AD @pt
label: Sursă: ESPR - Domeniul de aplicare al AD @ro
label: Zdroj: ESPR - Pôsobnosť DA @sk
label: Vir: ESPR - Področje uporabe DA @sl
label: Källa: ESPR - Tillämpningsområde för DA @sv
label: Source: ESPR - Annex III(e)
label: Източник: ESPR - Приложение III(д)
label: Zdroj: ESPR - Příloha III písm. e) @cs
label: Kilde: ESPR - Bilag III, litra e) @da
label: Quelle: ESPR - Anhang III Buchstabe e @de
label: Πηγή: ESPR - Παράρτημα ΙΙΙ(ε) @el
label: Fuente: ESPR - Anexo III, letra e) @es
label: Allikas: ESPR - III lisa punkt e @et
label: Lähde: ESPR - Liitteen III e kohta @fi
label: Source : ESPR - Annexe III(e) @fr
label: Foinse: ESPR - Iarscríbhinn III(e) @ga
label: Izvor: ESPR - Prilog III.(e) @hr
label: Forrás: ESPR - III. melléklet e) pont @hu
label: Fonte: ESPR - Allegato III(e) @it
label: Šaltinis: ESPR - III priedo e punktas @lt
label: Avots: ESPR - III pielikums e) punkts @lv
label: Sors: ESPR - Anness III(e) @mt
label: Bron: ESPR - Bijlage III(e) @nl
label: Źródło: ESPR - Załącznik III lit. e) @pl
label: Fonte: ESPR - Anexo III(e) @pt
label: Sursă: ESPR - Anexa III litera (e) @ro
label: Zdroj: ESPR - Príloha III písm. e) @sk
label: Vir: ESPR - Priloga III(e) @sl
label: Källa: ESPR - Bilaga III e @sv
label: Source: ESPR - Annex I(n), III(e)
label: Източник: ESPR - Приложение I(н), III(д)
label: Zdroj: ESPR - Příloha I písm. n), Příloha III písm. e) @cs
label: Kilde: ESPR - Bilag I, litra n), Bilag III, litra e) @da
label: Quelle: ESPR - Anhang I Buchstabe n, Anhang III Buchstabe e @de
label: Πηγή: ESPR - Παράρτημα Ι(ν), ΙΙΙ(ε) @el
label: Fuente: ESPR - Anexo I, letra n), Anexo III, letra e) @es
label: Allikas: ESPR - I lisa punkt n, III lisa punkt e @et
label: Lähde: ESPR - Liitteen I n kohta, Liitteen III e kohta @fi
label: Source : ESPR - Annexe I(n), Annexe III(e) @fr
label: Foinse: ESPR - Iarscríbhinn I(n), Iarscríbhinn III(e) @ga
label: Izvor: ESPR - Prilog I.(n), Prilog III.(e) @hr
label: Forrás: ESPR - I. melléklet n) pont, III. melléklet e) pont @hu
label: Fonte: ESPR - Allegato I(n), Allegato III(e) @it
label: Šaltinis: ESPR - I priedo n punktas, III priedo e punktas @lt
label: Avots: ESPR - I pielikums n) punkts, III pielikums e) punkts @lv
label: Sors: ESPR - Anness I(n), Anness III(e) @mt
label: Bron: ESPR - Bijlage I(n), Bijlage III(e) @nl
label: Source: ESPR - Annex I(n)
label: Източник: ESPR - Приложение I(н)
label: Source: ESPR - Annex I(d), III(a)
label: Source: ESPR - Article 7(2)(b), Annex I(a), III(e)
label: Source: ESPR - Annex III (a)
label: Source: ESPR - Annex III (e)
label: Source: ESPR - Annex I(h)
label: Source: ESPR - Annex I(h), III(e)
label: Източник: ESPR - Annex I(h)
label: Източник: ESPR - Annex I(h), III(e)
label: Източник: ESPR - Annex III(a)(f)
label: Източник: ESPR - Art 7(5), Annex I(f)
label: Източник: ESPR - Article 7(2)(b), Annex I(b)
label: Източник: ESPR - Annex I(d), Annex III(a)

Стойност на категорията PEFCR
type: Class
label: PEFCR Category Value @en
label: Hodnota kategorie PEFCR @cs
label: PEFCR-kategoriværdi @da
label: PEFCR-Kategoriewert @de
label: Τιμή κατηγορίας PEFCR @el
label: Valor de la categoría PEFCR @es
label: PEFCR-kategooria väärtus @et
label: PEFCR-luokan arvo @fi
label: Valeur de la catégorie PEFCR @fr
label: Luach Catagóir PEFCR @ga
label: Vrijednost kategorije PEFCR @hr
label: PEFCR kategóriaérték @hu
label: Valore della categoria PEFCR @it
label: PEFCR kategorijos vertė @lt
label: PEFCR kategorijas vērtība @lv
label: Valur tal-Kategorija PEFCR @mt
label: PEFCR-categoriewaarde @nl
label: Wartość kategorii PEFCR @pl
label: Valor da Categoria PEFCR @pt
label: Valoarea categoriei PEFCR @ro
label: Hodnota kategórie PEFCR @sk
label: Vrednost kategorije PEFCR @sl
label: PEFCR-kategorivärde @sv
comment: An enumeration of the allowed PEFCR categories for apparel and footwear. @en
comment: Изброяване на разрешените категории PEFCR за облекло и обувки.
comment: Výčet povolených kategorií PEFCR pro oděvy a obuv. @cs
comment: En opregning af de tilladte PEFCR-kategorier for beklædning og fodtøj. @da
comment: Eine Aufzählung der zulässigen PEFCR-Kategorien für Bekleidung und Schuhe. @de
comment: Μια απαρίθμηση των επιτρεπόμενων κατηγοριών PEFCR για ένδυση και υπόδηση. @el
comment: Una enumeración de las categorías PEFCR permitidas para prendas de vestir y calzado. @es
comment: Rõivaste ja jalatsite lubatud PEFCR-kategooriate loetelu. @et
comment: Luettelo sallituista PEFCR-luokista vaatteille ja jalkineille. @fi
comment: Une énumération des catégories PEFCR autorisées pour les vêtements et les chaussures. @fr
comment: Liosta de na catagóirí PEFCR atá ceadaithe le haghaidh éadaí agus coisbheart. @ga
comment: Popis dopuštenih kategorija PEFCR za odjeću i obuću. @hr
comment: A ruházati és lábbelitermékek engedélyezett PEFCR-kategóriáinak felsorolása. @hu
comment: Un'enumerazione delle categorie PEFCR consentite per abbigliamento e calzature. @it
comment: Leidžiamų drabužių ir avalynės PEFCR kategorijų sąrašas. @lt
comment: Atļauto PEFCR kategoriju uzskaitījums apģērbiem un apaviem. @lv
comment: Enumerazzjoni tal-kategoriji PEFCR permessi għall-ilbies u x-xedd tas-saqajn. @mt
comment: Een opsomming van de toegestane PEFCR-categorieën voor kleding en schoeisel. @nl
comment: Wyliczenie dozwolonych kategorii PEFCR dla odzieży i obuwia. @pl
comment: Uma enumeração das categorias PEFCR permitidas para vestuário e calçado. @pt
comment: O enumerare a categoriilor PEFCR permise pentru îmbrăcăminte și încălțăminte. @ro
comment: Výpočet povolených kategórií PEFCR pre odevy a obuv. @sk
comment: Naštevanje dovoljenih kategorij PEFCR za oblačila in obutev. @sl
comment: En uppräkning av de tillåtna PEFCR-kategorierna för kläder och skor. @sv
subclass of: Resource
one of: Тениски
one of: Ризи и блузи
one of: Пуловери и средни слоеве
one of: Якета и палта
one of: Панталони и къси панталони
one of: Рокли, поли и гащеризони
one of: Клинове, чорапи, чорапогащи и къси чорапи
one of: Бельо
one of: Бански костюми
one of: Аксесоари за облекло
one of: Обувки с отворени пръсти
one of: Обувки със затворени пръсти
one of: Ботуши

Тениски
type: Стойност на категорията PEFCR
label: T-shirts @en
label: Trička @cs
label: T-Shirts @de
label: Μπλουζάκια @el
label: Camisetas @es
label: T-särgid @et
label: T-paidat @fi
label: T-léinte @ga
label: Majice kratkih rukava @hr
label: Pólók @hu
label: T-shirt @it
label: Marškinėliai @lt
label: T-krekli @lv
label: T-shirty @pl
label: Tricouri @ro
label: Tričká @sk
label: T-majice @sl
comment: Garment to cover the upper body to the elbow. Typical products included: Singlets, t-shirts, polo shirts, other short-sleeved shirts. @en
comment: Дреха, която покрива горната част на тялото до лактите. Типични включени продукти: Потници, тениски, поло тениски, други ризи с къс ръкав.
comment: Oděv pokrývající horní část těla po loket. Typické zahrnuté produkty: Tílka, trička, polokošile, jiné košile s krátkým rukávem. @cs
comment: Beklædningsgenstand til at dække overkroppen til albuen. Typiske produkter inkluderet: Undertrøjer, t-shirts, poloshirts, andre kortærmede skjorter. @da
comment: Kleidungsstück, das den Oberkörper bis zum Ellbogen bedeckt. Typische Produkte: Unterhemden, T-Shirts, Poloshirts, andere kurzärmelige Hemden. @de
comment: Ένδυμα που καλύπτει το πάνω μέρος του σώματος μέχρι τον αγκώνα. Τυπικά προϊόντα που περιλαμβάνονται: Φανελάκια, t-shirts, μπλούζες πόλο, άλλα κοντομάνικα πουκάμισα. @el
comment: Prenda para cubrir la parte superior del cuerpo hasta el codo. Productos típicos incluidos: Camisetas de tirantes, camisetas, polos, otras camisas de manga corta. @es
comment: Rõivaese, mis katab ülakeha kuni küünarnukini. Tüüpilised tooted on: Särgid, t-särgid, polosärgid, muud lühikeste varrukatega särgid. @et
comment: Vaate, joka peittää ylävartalon kyynärpäähän asti. Tyypilliset tuotteet: Aluspaidat, t-paidat, pikeepaidat, muut lyhythihaiset paidat. @fi
comment: Vêtement couvrant le haut du corps jusqu'au coude. Produits typiques inclus : Maillots de corps, t-shirts, polos, autres chemises à manches courtes. @fr
comment: Éadaí chun corp uachtarach a chlúdach don uillinn. Táirgí tipiciúla a chuirtear san áireamh: Singiléid, t-léinte, léinte póló, léinte gearr-mhuinchille eile. @ga
comment: Odjevni predmet koji prekriva gornji dio tijela do lakta. Tipični uključeni proizvodi: Potkošulje, majice kratkih rukava, polo majice, ostale košulje kratkih rukava. @hr
comment: A felsőtestet a könyékig fedő ruhadarab. Jellemző termékek: Trikók, pólók, galléros pólók, egyéb rövid ujjú ingek. @hu
comment: Indumento che copre la parte superiore del corpo fino al gomito. Prodotti tipici inclusi: Canottiere, magliette, polo, altre camicie a maniche corte. @it
comment: Drabužis, dengiantis viršutinę kūno dalį iki alkūnės. Tipiški produktai: Berankoviai marškinėliai, marškinėliai, polo marškinėliai, kiti marškinėliai trumpomis rankovėmis. @lt
comment: Apģērbs, kas nosedz ķermeņa augšdaļu līdz elkonim. Tipiski iekļautie produkti: Krekliņi, t-krekli, polo krekli, citi krekli ar īsām piedurknēm. @lv
comment: Ilbies biex jgħatti l-parti ta 'fuq tal-ġisem sal-minkeb. Prodotti tipiċi jinkludu: Flokkijiet, t-shirts, polo shirts, qomos oħra bi kmiem qosra. @mt
comment: Kledingstuk om het bovenlichaam tot aan de elleboog te bedekken. Typische inbegrepen producten: Hemden, t-shirts, poloshirts, andere shirts met korte mouwen. @nl
comment: Odzież zakrywająca górną część ciała do łokcia. Typowe produkty: Podkoszulki, t-shirty, koszulki polo, inne koszule z krótkim rękawem. @pl
comment: Peça de vestuário para cobrir a parte superior do corpo até o cotovelo. Produtos típicos incluídos: Camisolas interiores, t-shirts, polos, outras camisas de manga curta. @pt
comment: Îmbrăcăminte pentru a acoperi partea superioară a corpului până la cot. Produse tipice incluse: Maiouri, tricouri, tricouri polo, alte cămăși cu mâneci scurte. @ro
comment: Odev zakrývajúci hornú časť tela po lakeť. Typické zahrnuté produkty: Tielka, tričká, polokošele, iné košele s krátkym rukávom. @sk
comment: Oblačilo, ki prekriva zgornji del telesa do komolca. Tipični vključeni izdelki: Spodnje majice, t-majice, polo majice, druge srajce s kratkimi rokavi. @sl
comment: Plagg som täcker överkroppen till armbågen. Typiska produkter som ingår: Linnen, t-shirts, pikétröjor, andra kortärmade skjortor. @sv

Ризи и блузи
type: Стойност на категорията PEFCR
label: Shirts and blouses @en
label: Košile a halenky @cs
label: Skjorter og bluser @da
label: Hemden und Blusen @de
label: Πουκάμισα και μπλούζες @el
label: Camisas y blusas @es
label: Särgid ja pluusid @et
label: Paidat ja puserot @fi
label: Chemises et chemisiers @fr
label: Léinte agus blúsléinte @ga
label: Košulje i bluze @hr
label: Ingek és blúzok @hu
label: Camicie e camicette @it
label: Marškiniai ir palaidinės @lt
label: Krekli un blūzes @lv
label: Qomos u blużi @mt
label: Overhemden en blouses @nl
label: Koszule i bluzki @pl
label: Camisas e blusas @pt
label: Cămăși și bluze @ro
label: Košele a blúzky @sk
label: Srajce in bluze @sl
label: Skjortor och blusar @sv
comment: Garment to cover the upper body including the entire arm. Typical products included: Long-sleeved shirts, blouses, tunics, base layers. @en
comment: Дреха, която покрива горната част на тялото, включително цялата ръка. Типични включени продукти: Ризи с дълъг ръкав, блузи, туники, основни слоеве.
comment: Oděv pokrývající horní část těla včetně celé paže. Typické zahrnuté produkty: Košile s dlouhým rukávem, halenky, tuniky, základní vrstvy. @cs
comment: Beklædningsgenstand til at dække overkroppen inklusive hele armen. Typiske produkter inkluderet: Langærmede skjorter, bluser, tunikaer, basislag. @da
comment: Kleidungsstück, das den Oberkörper einschließlich des gesamten Arms bedeckt. Typische Produkte: Langärmelige Hemden, Blusen, Tuniken, Baselayer. @de
comment: Ένδυμα που καλύπτει το πάνω μέρος του σώματος συμπεριλαμβανομένου ολόκληρου του βραχίονα. Τυπικά προϊόντα που περιλαμβάνονται: Πουκάμισα με μακριά μανίκια, μπλούζες, τουνίκ, ισοθερμικά. @el
comment: Prenda para cubrir la parte superior del cuerpo, incluido todo el brazo. Productos típicos incluidos: Camisas de manga larga, blusas, túnicas, capas base. @es
comment: Rõivaese, mis katab ülakeha ja kogu käe. Tüüpilised tooted on: Pikkade varrukatega särgid, pluusid, tuunikad, aluskihid. @et
comment: Vaate, joka peittää ylävartalon koko käsivarsi mukaan lukien. Tyypilliset tuotteet: Pitkähihaiset paidat, puserot, tunikat, aluskerrastot. @fi
comment: Vêtement couvrant le haut du corps, y compris tout le bras. Produits typiques inclus : Chemises à manches longues, chemisiers, tuniques, couches de base. @fr
comment: Éadaí chun an corp uachtarach a chlúdach, an lámh ar fad san áireamh. Táirgí tipiciúla a chuirtear san áireamh: Léinte fada-mhuinchille, blúsléinte, tiúnicí, bunteagmhálacha. @ga
comment: Odjevni predmet koji prekriva gornji dio tijela uključujući cijelu ruku. Tipični uključeni proizvodi: Košulje dugih rukava, bluze, tunike, osnovni slojevi. @hr
comment: A felsőtestet és a teljes kart fedő ruhadarab. Jellemző termékek: Hosszú ujjú ingek, blúzok, tunikák, aláöltözetek. @hu
comment: Indumento che copre la parte superiore del corpo includendo l'intero braccio. Prodotti tipici inclusi: Camicie a maniche lunghe, camicette, tuniche, strati base. @it
comment: Drabužis, dengiantis viršutinę kūno dalį, įskaitant visą ranką. Tipiški produktai: Marškiniai ilgomis rankovėmis, palaidinės, tunikos, apatiniai sluoksniai. @lt
comment: Apģērbs, kas nosedz ķermeņa augšdaļu, ieskaitot visu roku. Tipiski iekļautie produkti: Krekli ar garām piedurknēm, blūzes, tunikas, bāzes slāņi. @lv
comment: Ilbies biex jgħatti l-parti ta 'fuq tal-ġisem inkluż id-driegħ kollu. Prodotti tipiċi jinkludu: Qomos bil-kmiem twal, blużi, tuniċi, saffi bażi. @mt
comment: Kledingstuk om het bovenlichaam te bedekken, inclusief de hele arm. Typische inbegrepen producten: Shirts met lange mouwen, blouses, tunieken, basislagen. @nl
comment: Odzież zakrywająca górną część ciała wraz z całą ręką. Typowe produkty: Koszule z długim rękawem, bluzki, tuniki, warstwy podstawowe. @pl
comment: Peça de vestuário para cobrir a parte superior do corpo, incluindo todo o braço. Produtos típicos incluídos: Camisas de manga comprida, blusas, túnicas, camadas base. @pt
comment: Îmbrăcăminte pentru a acoperi partea superioară a corpului, inclusiv întregul braț. Produse tipice incluse: Cămăși cu mâneci lungi, bluze, tunici, straturi de bază. @ro
comment: Odev zakrývajúci hornú časť tela vrátane celej paže. Typické zahrnuté produkty: Košele s dlhým rukávom, blúzky, tuniky, základné vrstvy. @sk
comment: Oblačilo, ki prekriva zgornji del telesa, vključno s celotno roko. Tipični vključeni izdelki: Srajce z dolgimi rokavi, bluze, tunike, osnovni sloji. @sl
comment: Plagg som täcker överkroppen inklusive hela armen. Typiska produkter som ingår: Långärmade skjortor, blusar, tunikor, baslager. @sv

Пуловери и средни слоеве
type: Стойност на категорията PEFCR
label: Sweaters and midlayers @en
label: Svetry a střední vrstvy @cs
label: Trøjer og mellemlag @da
label: Pullover und Midlayer @de
label: Πουλόβερ και ενδιάμεσα στρώματα @el
label: Jerséis y capas intermedias @es
label: Kampsunid ja vahekihid @et
label: Villapaidat ja välikerrokset @fi
label: Pulls et couches intermédiaires @fr
label: Geansaithe agus sraitheanna lár @ga
label: Džemperi i srednji slojevi @hr
label: Pulóverek és középrétegek @hu
label: Maglioni e strati intermedi @it
label: Megztiniai ir viduriniai sluoksniai @lt
label: Džemperi un vidējie slāņi @lv
label: Ġerżijiet u saffi tan-nofs @mt
label: Truien en tussenlagen @nl
label: Swetry i warstwy środkowe @pl
label: Camisolas e camadas intermédias @pt
label: Pulovere și straturi intermediare @ro
label: Svetre a stredné vrstvy @sk
label: Puloverji in vmesni sloji @sl
label: Tröjor och mellanlager @sv
comment: Garment to keep the upper body warm and covered. Typical products included: Pullovers, cardigans, hoodies, jerseys, sweatshirts, knitted and wool sweaters, vests. @en
comment: Дреха, която да поддържа горната част на тялото топла и покрита. Типични включени продукти: Пуловери, жилетки, суичъри, фланелки, плетени и вълнени пуловери, елеци.
comment: Oděv k udržení tepla a zakrytí horní části těla. Typické zahrnuté produkty: Pulovry, kardigany, mikiny s kapucí, dresy, mikiny, pletené a vlněné svetry, vesty. @cs
comment: Beklædningsgenstand for at holde overkroppen varm og dækket. Typiske produkter inkluderet: Pullovers, cardigans, hættetrøjer, trøjer, sweatshirts, strikkede og uldtrøjer, veste. @da
comment: Kleidungsstück, das den Oberkörper warm hält und bedeckt. Typische Produkte: Pullover, Strickjacken, Hoodies, Trikots, Sweatshirts, Strick- und Wollpullover, Westen. @de
comment: Ένδυμα για να διατηρείται το πάνω μέρος του σώματος ζεστό και καλυμμένο. Τυπικά προϊόντα που περιλαμβάνονται: Πουλόβερ, ζακέτες, φούτερ με κουκούλα, φανέλες, φούτερ, πλεκτά και μάλλινα πουλόβερ, γιλέκα. @el
comment: Prenda para mantener la parte superior del cuerpo abrigada y cubierta. Productos típicos incluidos: Pulóveres, cárdigans, sudaderas con capucha, jerséis, sudaderas, jerséis de punto y lana, chalecos. @es
comment: Rõivaese, mis hoiab ülakeha soojas ja kaetud. Tüüpilised tooted on: Pulloverid, kardiganid, kapuutsiga pusad, kampsunid, dressipluusid, kootud ja villased kampsunid, vestid. @et
comment: Vaate, joka pitää ylävartalon lämpimänä ja peitettynä. Tyypilliset tuotteet: Villapaidat, neuletakit, hupparit, jerseyt, colleget, neulotut ja villapaidat, liivit. @fi
comment: Vêtement pour garder le haut du corps au chaud et couvert. Produits typiques inclus : Pulls, gilets, sweats à capuche, maillots, sweat-shirts, pulls en tricot et en laine, vestes sans manches. @fr
comment: Éadaí chun an corp uachtarach a choinneáil te agus clúdaithe. Táirgí tipiciúla a chuirtear san áireamh: Geansaithe, cardigain, cochaill, geansaithe, geansaithe allais, geansaithe cniotáilte agus olann, veisteanna. @ga
comment: Odjevni predmet za održavanje gornjeg dijela tijela toplim i pokrivenim. Tipični uključeni proizvodi: Puloveri, kardigani, majice s kapuljačom, dresovi, trenirke, pleteni i vuneni džemperi, prsluci. @hr
comment: A felsőtestet melegen tartó és fedő ruhadarab. Jellemző termékek: Pulóverek, kardigánok, kapucnis pulóverek, mezek, pamut pulóverek, kötött és gyapjú pulóverek, mellények. @hu
comment: Indumento per mantenere la parte superiore del corpo calda e coperta. Prodotti tipici inclusi: Pullover, cardigan, felpe con cappuccio, maglie, felpe, maglioni lavorati a maglia e di lana, gilet. @it
comment: Drabužis, skirtas išlaikyti viršutinę kūno dalį šiltą ir uždengtą. Tipiški produktai: Puloveriai, kardiganai, džemperiai su gobtuvu, megztiniai, sportiniai megztiniai, megzti ir vilnoniai megztiniai, liemenės. @lt
comment: Apģērbs, kas uztur ķermeņa augšdaļu siltu un apsegtu. Tipiski iekļautie produkti: Puloveri, jaciņas, džemperi ar kapuci, džemperi, sporta džemperi, trikotāžas un vilnas džemperi, vestes. @lv
comment: Ilbies biex jinżamm il-parti ta 'fuq tal-ġisem sħun u kopert. Prodotti tipiċi jinkludu: Pullovers, cardigans, hoodies, ġerżijiet, sweatshirts, ġerżijiet innittjati u tas-suf, flokkijiet. @mt
comment: Kledingstuk om het bovenlichaam warm en bedekt te houden. Typische inbegrepen producten: Pullovers, vesten, hoodies, truien, sweatshirts, gebreide en wollen truien, bodywarmers. @nl
comment: Odzież utrzymująca ciepło i zakrywająca górną część ciała. Typowe produkty: Pulowery, rozpinane swetry, bluzy z kapturem, koszulki, bluzy sportowe, swetry dzianinowe i wełniane, kamizelki. @pl
comment: Peça de vestuário para manter a parte superior do corpo quente e coberta. Produtos típicos incluídos: Pulôveres, cardigãs, camisolas com capuz, camisolas, sweatshirts, camisolas de malha e de lã, coletes. @pt
comment: Îmbrăcăminte pentru a menține partea superioară a corpului caldă și acoperită. Produse tipice incluse: Pulovere, cardigane, hanorace, bluze, treninguri, pulovere tricotate și din lână, veste. @ro
comment: Odev na udržanie tepla a zakrytie hornej časti tela. Typické zahrnuté produkty: Pulóvre, kardigány, mikiny s kapucňou, dresy, mikiny, pletené a vlnené svetre, vesty. @sk
comment: Oblačilo za ohranjanje toplega in pokritega zgornjega dela telesa. Tipični vključeni izdelki: Puloverji, jopice, puloverji s kapuco, majice, trenirke, pleteni in volneni puloverji, telovniki. @sl
comment: Plagg för att hålla överkroppen varm och täckt. Typiska produkter som ingår: Pullovrar, koftor, luvtröjor, tröjor, sweatshirts, stickade och ylletröjor, västar. @sv

Якета и палта
type: Стойност на категорията PEFCR
label: Jackets and coats @en
label: Bundy a kabáty @cs
label: Jakker og frakker @da
label: Jacken und Mäntel @de
label: Μπουφάν και παλτά @el
label: Chaquetas y abrigos @es
label: Joped ja mantlid @et
label: Takit ja päällystakit @fi
label: Vestes et manteaux @fr
label: Seaicéid agus cótaí @ga
label: Jakne i kaputi @hr
label: Dzsekik és kabátok @hu
label: Giacche e cappotti @it
label: Striukės ir paltai @lt
label: Jakas un mēteļi @lv
label: Ġkieket u kowtijiet @mt
label: Jassen en mantels @nl
label: Kurtki i płaszcze @pl
label: Casacos e sobretudos @pt
label: Jachete și paltoane @ro
label: Jakne in plašči @sl
label: Jackor och rockar @sv
comment: Garment to put on top of a shirt or sweater or to protect from the elements. Typical products included: Blazers, suit jackets, overcoats, other light jackets, rain jackets, outdoor winter jackets, parkas, down jackets, fur jackets, outdoor vests, leather jackets. @en
comment: Дреха, която се слага върху риза или пуловер или за защита от елементите. Типични включени продукти: Блейзъри, костюмни якета, палта, други леки якета, дъждобрани, зимни якета за открито, парки, пухени якета, кожени якета, елеци за открито.
comment: Oděv, který se obléká přes košili nebo svetr nebo chrání před přírodními vlivy. Typické zahrnuté produkty: Blejzry, obleková saka, převlečníky, další lehké bundy, pláštěnky, outdoorové zimní bundy, parky, péřové bundy, kožešinové bundy, outdoorové vesty, kožené bundy. @cs
comment: Beklædningsgenstand til at tage uden på en skjorte eller trøje eller for at beskytte mod vejret. Typiske produkter inkluderet: Blazere, habitjakker, overfrakker, andre lette jakker, regnjakker, udendørs vinterjakker, parkaer, dunjakker, pelsjakker, udendørs veste, læderjakker. @da
comment: Kleidungsstück, das über einem Hemd oder Pullover getragen wird oder vor den Elementen schützt. Typische Produkte: Blazer, Anzugjacken, Mäntel, andere leichte Jacken, Regenjacken, Outdoor-Winterjacken, Parkas, Daunenjacken, Pelzjacken, Outdoor-Westen, Lederjacken. @de
comment: Ένδυμα για να φορεθεί πάνω από πουκάμισο ή πουλόβερ ή για προστασία από τα στοιχεία της φύσης. Τυπικά προϊόντα: Μπλέιζερ, σακάκια, πανωφόρια, άλλα ελαφριά μπουφάν, αδιάβροχα, χειμερινά μπουφάν, παρκά, πουπουλένια μπουφάν, γούνινα μπουφάν, γιλέκα, δερμάτινα μπουφάν. @el
comment: Prenda para ponerse encima de una camisa o jersey o para proteger de los elementos. Productos típicos incluidos: Blazers, chaquetas de traje, abrigos, otras chaquetas ligeras, impermeables, chaquetas de invierno para exteriores, parkas, chaquetas de plumas, chaquetas de piel, chalecos para exteriores, chaquetas de cuero. @es
comment: Rõivaese särgi või kampsuni peal kandmiseks või ilmastikuolude eest kaitsmiseks. Tüüpilised tooted: Bleiserid, ülikonnajakid, mantlid, muud kerged jakid, vihmajoped, talvised välisjoped, parkad, sulejoped, karusnahast jakid, välisvestid, nahkjakid. @et
comment: Päällysvaate, joka puetaan paidan tai villapaidan päälle tai suojaamaan säältä. Tyypilliset tuotteet: Bleiserit, pukutakit, päällystakit, muut kevyet takit, sadetakit, talvitakit, parkat, untuvatakit, turkistakit, ulkoliivit, nahkatakit. @fi
comment: Vêtement à mettre par-dessus une chemise ou un pull ou pour protéger des intempéries. Produits typiques inclus : Blazers, vestes de costume, pardessus, autres vestes légères, imperméables, vestes d'hiver d'extérieur, parkas, doudounes, vestes en fourrure, gilets d'extérieur, vestes en cuir. @fr
comment: Éadaí le cur ar bharr léine nó geansaí nó chun cosaint ar na heilimintí. Táirgí tipiciúla a chuirtear san áireamh: Bléasair, seaicéid chulaith, cótaí móra, seaicéid éadroma eile, seaicéid bháistí, seaicéid gheimhridh amuigh faoin aer, parcas, seaicéid anuas, seaicéid fionnaidh, veisteanna amuigh faoin aer, seaicéid leathair. @ga
comment: Odjevni predmet za nošenje preko košulje ili džempera ili za zaštitu od vremenskih nepogoda. Tipični uključeni proizvodi: Blejzeri, sakoi, kaputi, ostale lagane jakne, kabanice, zimske jakne za otvoreno, parke, pernate jakne, krznene jakne, prsluci za otvoreno, kožne jakne. @hr
comment: Ing vagy pulóver fölé, vagy az időjárás viszontagságai elleni védelemként felvehető ruhadarab. Jellemző termékek: Blézerek, öltönykabátok, felöltők, egyéb könnyű dzsekik, esőkabátok, szabadtéri téli dzsekik, parkák, pehelykabátok, szőrmekabátok, szabadtéri mellények, bőrkabátok. @hu
comment: Indumento da indossare sopra una camicia o un maglione o per proteggere dalle intemperie. Prodotti tipici inclusi: Blazer, giacche da abito, soprabiti, altre giacche leggere, impermeabili, giacche invernali da esterno, parka, piumini, giacche di pelliccia, gilet da esterno, giacche di pelle. @it
comment: Drabužis, dedamas ant marškinių ar megztinio, arba skirtas apsaugoti nuo gamtos stichijų. Tipiški produktai: Švarkai, kostiumų švarkai, paltai, kitos lengvos striukės, lietpalčiai, žieminės striukės laukui, parkos, pūkinės striukės, kailinės striukės, lauko liemenės, odinės striukės. @lt
comment: Apģērbs, ko uzvelk pa virsu kreklam vai džemperim vai lai pasargātu no laikapstākļiem. Tipiski iekļautie produkti: Žaketes, uzvalku žaketes, mēteļi, citas vieglas jakas, lietus jakas, āra ziemas jakas, parkas, dūnu jakas, kažokādas jakas, āra vestes, ādas jakas. @lv
comment: Ilbies li jitpoġġa fuq qmis jew ġerżi jew biex jipproteġi mill-elementi. Prodotti tipiċi jinkludu: Blazers, ġkieket tal-libsa, overcoats, ġkieket ħfief oħra, ġkieket tax-xita, ġkieket tax-xitwa ta 'barra, parkas, ġkieket tar-rix, ġkieket tal-pil, flokkijiet ta' barra, ġkieket tal-ġilda. @mt
comment: Kledingstuk om over een overhemd of trui aan te trekken of om te beschermen tegen de weersomstandigheden. Typische inbegrepen producten: Blazers, colberts, overjassen, andere lichte jassen, regenjassen, winterjassen voor buiten, parka's, donsjassen, bontjassen, bodywarmers voor buiten, leren jassen. @nl
comment: Odzież zakładana na koszulę lub sweter albo w celu ochrony przed warunkami atmosferycznymi. Typowe produkty: Marynarki, żakiety, płaszcze, inne lekkie kurtki, płaszcze przeciwdeszczowe, zimowe kurtki outdoorowe, parki, kurtki puchowe, kurtki futrzane, kamizelki outdoorowe, kurtki skórzane. @pl
comment: Peça de vestuário para colocar por cima de uma camisa ou camisola ou para proteger dos elementos. Produtos típicos incluídos: Blazers, casacos de fato, sobretudos, outros casacos leves, impermeáveis, casacos de inverno para exterior, parkas, casacos de penas, casacos de peles, coletes para exterior, casacos de couro. @pt
comment: Îmbrăcăminte care se pune peste o cămașă sau un pulover sau pentru a proteja de intemperii. Produse tipice incluse: Sacouri, jachete de costum, paltoane, alte jachete ușoare, pelerine de ploaie, jachete de iarnă pentru exterior, geci, jachete cu puf, jachete de blană, veste pentru exterior, jachete de piele. @ro
comment: Odev, ktorý sa oblieka na košeľu alebo sveter, alebo chráni pred nepriaznivým počasím. Typické zahrnuté produkty: Saká, oblekové saká, zvrchníky, iné ľahké bundy, pršiplášte, outdoorové zimné bundy, parky, páperové bundy, kožušinové bundy, outdoorové vesty, kožené bundy. @sk
comment: Oblačilo, ki se obleče čez srajco ali pulover ali za zaščito pred vremenskimi vplivi. Tipični vključeni izdelki: Blazerji, suknjiči, plašči, druge lahke jakne, dežni plašči, zimske jakne za na prosto, parke, puhovke, krznene jakne, telovniki za na prosto, usnjene jakne. @sl
comment: Plagg att ta på sig över en skjorta eller tröja eller för att skydda mot väder och vind. Typiska produkter som ingår: Kavajer, kostymjackor, överrockar, andra lätta jackor, regnjackor, vinterjackor för utomhusbruk, parkas, dunjackor, pälsjackor, utomhusvästar, skinnjackor. @sv

Панталони и къси панталони
type: Стойност на категорията PEFCR
label: Pants and shorts @en
label: Kalhoty a šortky @cs
label: Bukser og shorts @da
label: Hosen und Shorts @de
label: Παντελόνια και σορτς @el
label: Pantalones y pantalones cortos @es
label: Püksid ja lühikesed püksid @et
label: Housut ja shortsit @fi
label: Pantalons et shorts @fr
label: Pants agus shorts @ga
label: Hlače i kratke hlače @hr
label: Nadrágok és rövidnadrágok @hu
label: Pantaloni e pantaloncini @it
label: Kelnės ir šortai @lt
label: Bikses un šorti @lv
label: Qliezet u xorts @mt
label: Broeken en shorts @nl
label: Spodnie i szorty @pl
label: Calças e calções @pt
label: Pantaloni și pantaloni scurți @ro
label: Nohavice a šortky @sk
label: Hlače in kratke hlače @sl
label: Byxor och shorts @sv
comment: Garment to cover the lower body, may protect from the elements. Typical products included: Casual pants, outdoor pants, dress pants, jeans, sports pants, capri pants, shorts. @en
comment: Дреха за покриване на долната част на тялото, може да предпазва от елементите. Типични продукти: Ежедневни панталони, външни панталони, официални панталони, дънки, спортни панталони, капри, къси панталони.
comment: Oděv pokrývající spodní část těla, může chránit před přírodními vlivy. Typické produkty: Neformální kalhoty, outdoorové kalhoty, společenské kalhoty, džíny, sportovní kalhoty, capri kalhoty, šortky. @cs
comment: Beklædningsgenstand til at dække underkroppen, kan beskytte mod vejret. Typiske produkter: Fritidsbukser, friluftsbukser, pæne bukser, jeans, sportsbukser, capribukser, shorts. @da
comment: Kleidungsstück zur Bedeckung des Unterkörpers, das vor den Elementen schützen kann. Typische Produkte: Freizeithosen, Outdoorhosen, Anzughosen, Jeans, Sporthosen, Caprihosen, Shorts. @de
comment: Ένδυμα για την κάλυψη του κάτω μέρους του σώματος, μπορεί να προστατεύει από τα στοιχεία της φύσης. Τυπικά προϊόντα: Καθημερινά παντελόνια, παντελόνια για εξωτερικούς χώρους, καλά παντελόνια, τζιν, αθλητικά παντελόνια, κάπρι, σορτς. @el
comment: Prenda para cubrir la parte inferior del cuerpo, puede proteger de los elementos. Productos típicos: Pantalones informales, pantalones de exterior, pantalones de vestir, vaqueros, pantalones de deporte, pantalones pirata, pantalones cortos. @es
comment: Rõivaese alakeha katmiseks, võib kaitsta ilmastiku eest. Tüüpilised tooted: Vabaajapüksid, välipüksid, viigipüksid, teksad, spordipüksid, kapri püksid, lühikesed püksid. @et
comment: Alavartalon peittävä vaate, joka voi suojata säältä. Tyypilliset tuotteet: Vapaa-ajan housut, ulkoiluhousut, suorat housut, farkut, urheiluhousut, caprit, shortsit. @fi
comment: Vêtement couvrant le bas du corps, pouvant protéger des intempéries. Produits typiques : Pantalons décontractés, pantalons d'extérieur, pantalons habillés, jeans, pantalons de sport, pantacourts, shorts. @fr
comment: Éadaí chun an corp íochtair a chlúdach, a fhéadfaidh cosaint a dhéanamh ar na heilimintí. Táirgí tipiciúla: Pants ócáideacha, pants amuigh faoin aer, pants gúna, jeans, pants spóirt, pants capri, shorts. @ga
comment: Odjevni predmet za pokrivanje donjeg dijela tijela, može štititi od vremenskih nepogoda. Tipični proizvodi: Svakodnevne hlače, hlače za van, svečane hlače, traperice, sportske hlače, capri hlače, kratke hlače. @hr
comment: Az alsótestet fedő ruhadarab, amely védhet az időjárás viszontagságaitól. Jellemző termékek: Szabadidőnadrágok, szabadtéri nadrágok, öltönynadrágok, farmerek, sportnadrágok, capri nadrágok, rövidnadrágok. @hu
comment: Indumento che copre la parte inferiore del corpo, può proteggere dalle intemperie. Prodotti tipici: Pantaloni casual, pantaloni da esterno, pantaloni eleganti, jeans, pantaloni sportivi, pantaloni capri, pantaloncini. @it
comment: Drabužis apatinei kūno daliai dengti, gali apsaugoti nuo gamtos stichijų. Tipiški produktai: Laisvalaikio kelnės, lauko kelnės, kostiuminės kelnės, džinsai, sportinės kelnės, kapri kelnės, šortai. @lt
comment: Apģērbs ķermeņa apakšdaļas nosegšanai, var pasargāt no laikapstākļiem. Tipiski produkti: Ikdienas bikses, āra bikses, uzvalka bikses, džinsi, sporta bikses, kapri bikses, šorti. @lv
comment: Ilbies biex jgħatti l-parti t'isfel tal-ġisem, jista 'jipproteġi mill-elementi. Prodotti tipiċi: Qliezet każwali, qliezet ta' barra, qliezet formali, jeans, qliezet sportivi, qliezet capri, xorts. @mt
comment: Kledingstuk om het onderlichaam te bedekken, kan beschermen tegen weersomstandigheden. Typische producten: Casual broeken, outdoorbroeken, pantalons, jeans, sportbroeken, capribroeken, shorts. @nl
comment: Odzież zakrywająca dolną część ciała, mogąca chronić przed warunkami atmosferycznymi. Typowe produkty: Spodnie codzienne, spodnie outdoorowe, spodnie wyjściowe, dżinsy, spodnie sportowe, rybaczki, szorty. @pl
comment: Peça de vestuário para cobrir a parte inferior do corpo, pode proteger dos elementos. Produtos típicos: Calças casuais, calças de exterior, calças de fato, calças de ganga, calças de desporto, calças capri, calções. @pt
comment: Îmbrăcăminte pentru a acoperi partea inferioară a corpului, poate proteja de intemperii. Produse tipice: Pantaloni casual, pantaloni de exterior, pantaloni de costum, blugi, pantaloni sport, pantaloni capri, pantaloni scurți. @ro
comment: Odev na zakrytie spodnej časti tela, môže chrániť pred nepriaznivým počasím. Typické produkty: Ležérne nohavice, outdoorové nohavice, oblekové nohavice, džínsy, športové nohavice, capri nohavice, šortky. @sk
comment: Oblačilo za prekrivanje spodnjega dela telesa, lahko ščiti pred vremenskimi vplivi. Tipični izdelki: Priložnostne hlače, hlače za na prosto, elegantne hlače, kavbojke, športne hlače, kapri hlače, kratke hlače. @sl
comment: Plagg som täcker underkroppen, kan skydda mot väder och vind. Typiska produkter: Fritidsbyxor, friluftsbyxor, kostymbyxor, jeans, sportbyxor, capribyxor, shorts. @sv

Рокли, поли и гащеризони
type: Стойност на категорията PEFCR
label: Dresses, skirts and jumpsuits @en
label: Šaty, sukně a overaly @cs
label: Kjoler, nederdele og jumpsuits @da
label: Kleider, Röcke und Jumpsuits @de
label: Φορέματα, φούστες και ολόσωμες φόρμες @el
label: Vestidos, faldas y monos @es
label: Kleidid, seelikud ja kombinesoonid @et
label: Mekot, hameet ja haalarit @fi
label: Robes, jupes et combinaisons @fr
label: Gúnaí, sciortaí agus rabhlaeir @ga
label: Haljine, suknje i kombinezoni @hr
label: Ruhák, szoknyák és kezeslábasok @hu
label: Abiti, gonne e tute @it
label: Suknelės, sijonai ir kombinezonai @lt
label: Kleitas, svārki un kombinezoni @lv
label: Ilbiesi, dbielet u jumpsuits @mt
label: Jurken, rokken en jumpsuits @nl
label: Sukienki, spódnice i kombinezony @pl
label: Vestidos, saias e macacões @pt
label: Rochii, fuste și salopete @ro
label: Šaty, sukne a overaly @sk
label: Obleke, krila in kombinezoni @sl
label: Klänningar, kjolar och jumpsuits @sv
comment: One-piece garment that covers both the upper and lower body, or the lower body only, other than pants and shorts. Typical products included: Short- and long-sleeved, strapless, wrap, long and short, one-piece suits. @en
comment: Цяла дреха, която покрива както горната, така и долната част на тялото, или само долната част, различна от панталони. Типични продукти: Къси и дълги ръкави, без презрамки, тип прегърни ме, дълги и къси, цели костюми.
comment: Jednodílný oděv zakrývající horní i spodní část těla, nebo jen spodní část, s výjimkou kalhot a šortek. Typické produkty: S krátkým a dlouhým rukávem, bez ramínek, zavinovací, dlouhé a krátké, jednodílné obleky. @cs
comment: Heldragt, der dækker både over- og underkrop, eller kun underkrop, bortset fra bukser og shorts. Typiske produkter: Kort- og langærmet, stropløs, slå-om, lang og kort, heldragter. @da
comment: Einteiliges Kleidungsstück, das sowohl den Ober- als auch den Unterkörper oder nur den Unterkörper bedeckt, ausgenommen Hosen und Shorts. Typische Produkte: Kurz- und langärmelig, trägerlos, Wickeloptik, lang und kurz, Einteiler. @de
comment: Μονοκόμματο ένδυμα που καλύπτει τόσο το πάνω όσο και το κάτω μέρος του σώματος ή μόνο το κάτω μέρος, εκτός από παντελόνια και σορτς. Τυπικά προϊόντα: Κοντομάνικα και μακρυμάνικα, στράπλες, κρουαζέ, μακριά και κοντά, ολόσωμες φόρμες. @el
comment: Prenda de una sola pieza que cubre tanto la parte superior como la inferior del cuerpo, o solo la parte inferior, distinta de pantalones y pantalones cortos. Productos típicos: De manga corta y larga, sin tirantes, cruzados, largos y cortos, monos de una pieza. @es
comment: Ühes tükis rõivaese, mis katab nii üla- kui alakeha või ainult alakeha, v.a püksid ja lühikesed püksid. Tüüpilised tooted: Lühikeste ja pikkade varrukatega, olapaelteta, hõlmik-, pikad ja lühikesed, ühes tükis kostüümid. @et
comment: Yksiosainen vaate, joka peittää sekä ylä- että alavartalon, tai pelkän alavartalon, muu kuin housut ja shortsit. Tyypilliset tuotteet: Lyhyt- ja pitkähihaiset, olkaimettomat, kietaisumallit, pitkät ja lyhyet, yksiosaiset puvut. @fi
comment: Vêtement d'une seule pièce qui couvre à la fois le haut et le bas du corps, ou seulement le bas du corps, autre que les pantalons et les shorts. Produits typiques : À manches courtes et longues, sans bretelles, portefeuille, longs et courts, combinaisons une pièce. @fr
comment: Éadaí aon-phíosa a chlúdaíonn an corp uachtarach agus íochtarach, nó an corp íochtarach amháin, seachas brístí agus shorts. Táirgí tipiciúla: muinchille gearr agus fada, gan strapaí, wrap, fada agus gearr, culaith aon-phíosa. @ga
comment: Jednodijelni odjevni predmet koji pokriva gornji i donji dio tijela, ili samo donji dio, osim hlača i kratkih hlača. Tipični proizvodi: Kratkih i dugih rukava, bez naramenica, na preklop, dugi i kratki, jednodijelna odijela. @hr
comment: Egyrészes ruhadarab, amely mind a felső-, mind az alsótestet, vagy csak az alsótestet fedi, a nadrágok kivételével. Jellemző termékek: Rövid és hosszú ujjú, pánt nélküli, átlapolós, hosszú és rövid, egyrészes ruhák. @hu
comment: Indumento in un solo pezzo che copre sia la parte superiore che quella inferiore del corpo, o solo la parte inferiore, diverso da pantaloni e pantaloncini. Prodotti tipici: A maniche corte e lunghe, senza spalline, a portafoglio, lunghi e corti, tute intere. @it
comment: Vientisas drabužis, dengiantis ir viršutinę, ir apatinę kūno dalis, arba tik apatinę dalį, išskyrus kelnes ir šortus. Tipiški produktai: Trumpomis ir ilgomis rankovėmis, be petnešėlių, susiaučiami, ilgi ir trumpi, vientisi kostiumai. @lt
comment: Viengabala apģērbs, kas nosedz gan ķermeņa augšdaļu, gan apakšdaļu, vai tikai apakšdaļu, izņemot bikses un šortus. Tipiski produkti: Ar īsām un garām piedurknēm, bez lencītēm, pārliekami, gari un īsi, viengabala uzvalki. @lv
comment: Ilbies ta 'biċċa waħda li jkopri kemm il-parti ta' fuq kif ukoll ta 'isfel tal-ġisem, jew il-parti t'isfel biss, minbarra qliezet u xorts. Prodotti tipiċi: bi kmiem qosra u twal, mingħajr ċineg, wrap, twal u qosra, ilbiesi ta' biċċa waħda. @mt
comment: Eendelig kledingstuk dat zowel het boven- als onderlichaam bedekt, of alleen het onderlichaam, anders dan broeken en shorts. Typische producten: Met korte en lange mouwen, strapless, overslag, lang en kort, eendelige pakken. @nl
comment: Odzież jednoczęściowa zakrywająca górną i dolną część ciała lub tylko dolną część, inna niż spodnie i szorty. Typowe produkty: Z krótkim i długim rękawem, bez ramiączek, kopertowe, długie i krótkie, jednoczęściowe kombinezony. @pl
comment: Peça de vestuário de uma só peça que cobre tanto a parte superior como a inferior do corpo, ou apenas a parte inferior, que não sejam calças e calções. Produtos típicos: De manga curta e comprida, sem alças, traçados, compridos e curtos, fatos de uma só peça. @pt
comment: Îmbrăcăminte dintr-o singură piesă care acoperă atât partea superioară, cât și pe cea inferioară a corpului, sau doar partea inferioară, alta decât pantaloni și pantaloni scurți. Produse tipice: Cu mâneci scurte și lungi, fără bretele, parte peste parte, lungi și scurte, costume dintr-o singură piesă. @ro
comment: Jednodielny odev zakrývajúci hornú aj spodnú časť tela, alebo len spodnú časť, s výnimkou nohavíc a šortiek. Typické produkty: S krátkym a dlhým rukávom, bez ramienok, zavinovacie, dlhé a krátke, jednodielne overaly. @sk
comment: Enodelno oblačilo, ki prekriva zgornji in spodnji del telesa ali samo spodnji del, razen hlač in kratkih hlač. Tipični izdelki: S kratkimi in dolgimi rokavi, brez naramnic, na preklop, dolgi in kratki, enodelne obleke. @sl
comment: Heldräkt som täcker både över- och underkropp, eller endast underkropp, annat än byxor och shorts. Typiska produkter: Kort- och långärmade, axelbandslösa, omlott, långa och korta, heldräkter. @sv

Клинове, чорапи, чорапогащи и къси чорапи
type: Стойност на категорията PEFCR
label: Leggings, stockings, tights and socks @en
label: Legíny, punčochy, punčocháče a ponožky @cs
label: Leggings, strømper, strømpebukser og sokker @da
label: Leggings, Strümpfe, Strumpfhosen und Socken @de
label: Κολάν, κάλτσες, καλσόν και κοντές κάλτσες @el
label: Leggings, medias, pantimedias y calcetines @es
label: Säärised, sukad, sukkpüksid ja sokid @et
label: Leggingsit, sukat, sukkahousut ja lyhyet sukat @fi
label: Leggings, bas, collants et chaussettes @fr
label: Luiteoga, stocaí, riteoga agus stocaí gearra @ga
label: Tajice, čarape, hulahopke i kratke čarape @hr
label: Leggings, harisnyák, harisnyanadrágok és zoknik @hu
label: Leggings, calze, collant e calzini @it
label: Tamprės, kojinės, pėdkelnės ir trumpos kojinės @lt
label: Legingi, zeķes, zeķubikses un īsās zeķes @lv
label: Leggings, kalzetti, tights u kalzetti qosra @mt
label: Leggings, kousen, panty's en sokken @nl
label: Leginsy, pończochy, rajstopy i skarpety @pl
label: Leggings, meias, collants e peúgas @pt
label: Colanți, ciorapi, dresuri și șosete @ro
label: Legíny, pančuchy, pančucháče a ponožky @sk
label: Pajkice, nogavice, hlačne nogavice in kratke nogavice @sl
label: Leggings, strumpor, strumpbyxor och sockor @sv
comment: Tight garment to cover the legs and/or feet. Typical products included: Opaque and sheer tights, pantyhose, fishnets, ankle socks, knee socks, low-cut socks. @en
comment: Плътно прилепнала дреха за покриване на краката и/или стъпалата. Типични продукти: Непрозрачни и прозрачни чорапогащи, мрежести, чорапи до глезена, чорапи до коляното, изрязани чорапи.
comment: Přiléhavý oděv zakrývající nohy a/nebo chodidla. Typické produkty: Neprůhledné a průsvitné punčocháče, síťované punčochy, kotníkové ponožky, podkolenky, nízké ponožky. @cs
comment: Stramtsiddende beklædningsgenstand til at dække ben og/eller fødder. Typiske produkter: Uigennemsigtige og gennemsigtige strømpebukser, netstrømper, ankelsokker, knæstrømper, lave sokker. @da
comment: Eng anliegendes Kleidungsstück zur Bedeckung der Beine und/oder Füße. Typische Produkte: Blickdichte und durchsichtige Strumpfhosen, Netzstrumpfhosen, Knöchelsocken, Kniestrümpfe, Füßlinge. @de
comment: Εφαρμοστό ένδυμα για την κάλυψη των ποδιών ή/και των πελμάτων. Τυπικά προϊόντα: Οπάκ και διάφανα καλσόν, διχτυωτά, καλτσάκια αστραγάλου, κάλτσες μέχρι το γόνατο, χαμηλές κάλτσες. @el
comment: Prenda ajustada para cubrir las piernas y/o los pies. Productos típicos: Medias opacas y transparentes, pantimedias, medias de rejilla, calcetines tobilleros, calcetines hasta la rodilla, calcetines cortos. @es
comment: Liibuv rõivaese jalgade ja/või jalalabade katmiseks. Tüüpilised tooted: Läbipaistmatud ja õhukesed sukkpüksid, võrksukad, sokid, põlvikud, madala lõikega sokid. @et
comment: Tiukka vaate, joka peittää jalat ja/tai jalkaterät. Tyypilliset tuotteet: Peittävät ja ohuet sukkahousut, verkkosukat, nilkkasukat, polvisukat, matalat sukat. @fi
comment: Vêtement moulant pour couvrir les jambes et/ou les pieds. Produits typiques : Collants opaques et transparents, bas, résilles, socquettes, mi-bas, chaussettes basses. @fr
comment: Éadaí daingean chun na cosa agus/nó na cosa a chlúdach. Táirgí tipiciúla: Riteoga teimhneacha agus fórsa, pantyhose, eangacha éisc, stocaí rúitín, stocaí glúine, stocaí ísle. @ga
comment: Uski odjevni predmet za pokrivanje nogu i/ili stopala. Tipični proizvodi: Neprozirne i prozirne hulahopke, mrežaste čarape, čarape do gležnja, dokoljenke, niske čarape. @hr
comment: Szoros ruhadarab a lábak és/vagy lábfejek fedésére. Jellemző termékek: Átlátszatlan és áttetsző harisnyanadrágok, neccharisnyák, bokazoknik, térdzoknik, titokzoknik. @hu
comment: Indumento aderente per coprire le gambe e/o i piedi. Prodotti tipici: Collant coprenti e velati, calze a rete, calzini alla caviglia, calzettoni, fantasmini. @it
comment: Prie kūno priglundantis drabužis, skirtas kojoms ir (arba) pėdoms apdengti. Tipiški produktai: Nepermatomos ir permatomos pėdkelnės, tinklinės pėdkelnės, kojinės iki kulkšnies, puskojinės, žemos kojinės. @lt
comment: Cieši pieguļošs apģērbs kāju un/vai pēdu nosegšanai. Tipiski produkti: Necaurspīdīgas un caurspīdīgas zeķubikses, tīkliņzeķes, potīšu zeķes, zeķes līdz celim, pēdiņas. @lv
comment: Ilbies strett biex jgħatti s-saqajn u/jew is-saqajn. Prodotti tipiċi: Tights opaki u trasparenti, pantyhose, fishnets, kalzetti ta 'l-għaksa, kalzetti ta' l-irkoppa, kalzetti qosra. @mt
comment: Strak kledingstuk om de benen en/of voeten te bedekken. Typische producten: Ondoorzichtige en doorschijnende panty's, netkousen, enkelsokken, kniekousen, lage sokken. @nl
comment: Obcisła odzież zakrywająca nogi i/lub stopy. Typowe produkty: Nieprzezroczyste i przezroczyste rajstopy, kabaretki, skarpetki do kostki, podkolanówki, stopki. @pl
comment: Peça de vestuário justa para cobrir as pernas e/ou os pés. Produtos típicos: Collants opacos e transparentes, meias de rede, meias pelo tornozelo, meias até ao joelho, soquetes. @pt
comment: Îmbrăcăminte mulată pentru a acoperi picioarele și/sau tălpile. Produse tipice: Dresuri opace și transparente, ciorapi plasă, șosete până la gleznă, șosete până la genunchi, șosete scurte. @ro
comment: Priliehavý odev na zakrytie nôh a/alebo chodidiel. Typické produkty: Nepriehľadné a priesvitné pančucháče, sieťované pančuchy, ponožky po členky, podkolienky, nízke ponožky. @sk
comment: Tesno oblačilo za prekrivanje nog in/ali stopal. Tipični izdelki: Neprozorne in prosojne hlačne nogavice, mrežaste nogavice, nogavice do gležnja, dokolenke, nizke nogavice. @sl
comment: Åtsittande plagg för att täcka ben och/eller fötter. Typiska produkter: Ogenomskinliga och skira strumpbyxor, nätstrumpor, ankelsockor, knästrumpor, låga sockor. @sv

Бельо
type: Стойност на категорията PEFCR
label: Underwear @en
label: Spodní prádlo @cs
label: Undertøj @da
label: Unterwäsche @de
label: Εσώρουχα @el
label: Ropa interior @es
label: Aluspesu @et
label: Alusvaatteet @fi
label: Sous-vêtements @fr
label: Fo-éadaí @ga
label: Donje rublje @hr
label: Alsónemű @hu
label: Biancheria intima @it
label: Apatiniai drabužiai @lt
label: Apakšveļa @lv
label: Ħwejjeġ ta' taħt @mt
label: Ondergoed @nl
label: Bielizna @pl
label: Roupa interior @pt
label: Lenjerie intimă @ro
label: Spodná bielizeň @sk
label: Spodnje perilo @sl
label: Underkläder @sv
comment: Garment worn under clothes, often next to the skin of the upper or lower body. Typical products included: Boxers, briefs, panties, bras, body-shaping suits. @en
comment: Дреха, носена под дрехите, често до кожата на горната или долната част на тялото. Типични продукти: Боксерки, слипове, бикини, сутиени, оформящи костюми.
comment: Oděv nošený pod oblečením, často přímo na kůži horní nebo spodní části těla. Typické produkty: Boxerky, slipy, kalhotky, podprsenky, tvarující oblečení. @cs
comment: Beklædningsgenstand båret under tøj, ofte mod huden på over- eller underkroppen. Typiske produkter: Boxershorts, underbukser, trusser, bh'er, bodystockings. @da
comment: Kleidungsstück, das unter der Kleidung getragen wird, oft direkt auf der Haut des Ober- oder Unterkörpers. Typische Produkte: Boxershorts, Slips, Höschen, BHs, figurbetonte Anzüge. @de
comment: Ένδυμα που φοριέται κάτω από τα ρούχα, συχνά σε επαφή με το δέρμα του άνω ή κάτω μέρους του σώματος. Τυπικά προϊόντα: Μπόξερ, σλιπ, κιλότες, σουτιέν, κορσέδες. @el
comment: Prenda que se lleva debajo de la ropa, a menudo junto a la piel de la parte superior o inferior del cuerpo. Productos típicos: Bóxers, calzoncillos, bragas, sujetadores, trajes moldeadores. @es
comment: Rõivaese, mida kantakse riiete all, sageli vastu üla- või alakeha nahka. Tüüpilised tooted: Bokserid, püksikud, aluspüksid, rinnahoidjad, vormivad pesud. @et
comment: Vaate, jota pidetään vaatteiden alla, usein ylä- tai alavartalon ihoa vasten. Tyypilliset tuotteet: Bokserit, alushousut, pikkuhousut, rintaliivit, muotoilevat asut. @fi
comment: Vêtement porté sous les vêtements, souvent à même la peau du haut ou du bas du corps. Produits typiques : Boxers, slips, culottes, soutiens-gorge, combinaisons sculptantes. @fr
comment: Éadaí a chaitear faoi éadaí, is minic in aice le craiceann an choirp uachtaraigh nó íochtair. Táirgí tipiciúla: dornálaithe, mionbhrístíní, mionbhrístíní, bras, cultacha múnlaithe coirp. @ga
comment: Odjevni predmet koji se nosi ispod odjeće, često uz kožu gornjeg ili donjeg dijela tijela. Tipični proizvodi: Bokserice, gaćice, ženske gaćice, grudnjaci, odijela za oblikovanje tijela. @hr
comment: Ruházat alatt, gyakran a felső- vagy alsótest bőrével érintkezve viselt ruhadarab. Jellemző termékek: Bokszeralsók, fecskék, női alsók, melltartók, alakformáló ruhák. @hu
comment: Indumento indossato sotto i vestiti, spesso a contatto con la pelle della parte superiore o inferiore del corpo. Prodotti tipici: Boxer, slip, mutandine, reggiseni, body modellanti. @it
comment: Drabužis, nešiojamas po drabužiais, dažnai prie viršutinės ar apatinės kūno dalies odos. Tipiški produktai: Bokseriai, glaudės, kelnaitės, liemenėlės, kūną formuojantys kostiumai. @lt
comment: Apģērbs, ko valkā zem drēbēm, bieži vien uz ķermeņa augšdaļas vai apakšdaļas ādas. Tipiski produkti: Bokseršorti, apenes, biksītes, krūšturi, ķermeni veidojoši tērpi. @lv
comment: Ilbies li jintlibes taħt il-ħwejjeġ, ħafna drabi ħdejn il-ġilda tal-parti ta 'fuq jew ta' isfel tal-ġisem. Prodotti tipiċi: Boxers, briefs, qliezet ta' taħt, bras, ilbiesi għat-tiswir tal-ġisem. @mt
comment: Kledingstuk gedragen onder kleding, vaak direct op de huid van het boven- of onderlichaam. Typische producten: Boxershorts, slips, slipjes, bh's, corrigerend ondergoed. @nl
comment: Odzież noszona pod ubraniem, często przy skórze górnej lub dolnej części ciała. Typowe produkty: Bokserki, slipy, majtki, biustonosze, body modelujące. @pl
comment: Peça de vestuário usada debaixo da roupa, frequentemente em contacto com a pele da parte superior ou inferior do corpo. Produtos típicos: Boxers, slips, cuecas, sutiãs, cintas modeladoras. @pt
comment: Îmbrăcăminte purtată pe sub haine, adesea pe pielea părții superioare sau inferioare a corpului. Produse tipice: Boxeri, chiloți, slipi, sutiene, costume modelatoare. @ro
comment: Odev nosený pod oblečením, často priamo na koži hornej alebo spodnej časti tela. Typické produkty: Boxerky, slipy, nohavičky, podprsenky, formovacie oblečenie. @sk
comment: Oblačilo, ki se nosi pod oblačili, pogosto ob koži zgornjega ali spodnjega dela telesa. Tipični izdelki: Boksarice, spodnje hlače, hlačke, nedrčki, oblačila za oblikovanje postave. @sl
comment: Plagg som bärs under kläder, ofta närmast huden på över- eller underkroppen. Typiska produkter: Kalsonger, trosor, bh:ar, figurformande plagg. @sv

Бански костюми
type: Стойност на категорията PEFCR
label: Swimwear @en
label: Plavky @cs
label: Badetøj @da
label: Bademode @de
label: Μαγιό @el
label: Ropa de baño @es
label: Ujumisriided @et
label: Uimapuvut @fi
label: Maillots de bain @fr
label: Éadaí snámha @ga
label: Kupaći kostimi @hr
label: Fürdőruhák @hu
label: Costumi da bagno @it
label: Maudymosi apranga @lt
label: Peldkostīmi @lv
label: Ilbies għall-għawm @mt
label: Zwemkleding @nl
label: Stroje kąpielowe @pl
label: Fatos de banho @pt
label: Costume de baie @ro
label: Kopalke @sl
label: Badkläder @sv
comment: Garment worn for water-based or sunbased activities. Typical products included: Bikinis, bathing suits, racing-style swimwear, board shorts. @en
comment: Дреха, носена за дейности на вода или слънце. Типични продукти: Бикини, бански костюми, състезателни бански, борд шорти.
comment: Oděv nošený pro vodní nebo sluneční aktivity. Typické produkty: Bikiny, plavky, závodní plavky, koupací šortky. @cs
comment: Beklædningsgenstand båret til vand- eller solbaserede aktiviteter. Typiske produkter: Bikinier, badedragter, konkurrencebadetøj, badeshorts. @da
comment: Kleidungsstück für Aktivitäten im Wasser oder in der Sonne. Typische Produkte: Bikinis, Badeanzüge, wettkampforientierte Bademode, Boardshorts. @de
comment: Ένδυμα που φοριέται για δραστηριότητες στο νερό ή στον ήλιο. Τυπικά προϊόντα: Μπικίνι, ολόσωμα μαγιό, αγωνιστικά μαγιό, σορτς κολύμβησης. @el
comment: Prenda que se lleva para actividades acuáticas o bajo el sol. Productos típicos: Bikinis, bañadores, trajes de baño de competición, pantalones cortos de baño. @es
comment: Rõivaese vee- või päikesepõhisteks tegevusteks. Tüüpilised tooted: Bikiinid, trikood, võistlusujumisriided, surfaripüksid. @et
comment: Vaate, jota pidetään vesi- tai aurinkopohjaisissa aktiviteeteissa. Tyypilliset tuotteet: Bikinit, uimapuvut, kilpauimapuvut, uimashortsit. @fi
comment: Vêtement porté pour les activités aquatiques ou au soleil. Produits typiques : Bikinis, maillots de bain, maillots de bain de compétition, shorts de bain. @fr
comment: Éadaí a chaitear le haghaidh gníomhaíochtaí uisce nó gréine. Táirgí tipiciúla: Bikinis, feistis snámha, éadaí snámha rásaíochta, shorts boird. @ga
comment: Odjevni predmet koji se nosi za aktivnosti na vodi ili suncu. Tipični proizvodi: Bikiniji, kupaći kostimi, natjecateljski kupaći kostimi, kratke hlače za kupanje. @hr
comment: Vízi vagy napozási tevékenységekhez viselt ruhadarab. Jellemző termékek: Bikinik, fürdőruhák, versenydresszek, szörfnadrágok. @hu
comment: Indumento indossato per attività acquatiche o al sole. Prodotti tipici: Bikini, costumi interi, costumi da bagno da gara, pantaloncini da surf. @it
comment: Drabužis, skirtas vandens ar saulės vonių veiklai. Tipiški produktai: Bikiniai, maudymosi kostiumėliai, sportiniai maudymosi kostiumai, maudymosi šortai. @lt
comment: Apģērbs ūdens vai saules aktivitātēm. Tipiski produkti: Bikini, peldkostīmi, sporta peldkostīmi, peldšorti. @lv
comment: Ilbies milbus għal attivitajiet ibbażati fuq l-ilma jew fuq ix-xemx. Prodotti tipiċi: Bikinis, ilbiesi tal-għawm, ilbies għall-għawm stil tat-tlielaq, xorts tal-bord. @mt
comment: Kledingstuk gedragen voor water- of zongerelateerde activiteiten. Typische producten: Bikini's, badpakken, wedstrijdzwemkleding, zwemshorts. @nl
comment: Odzież noszona do aktywności w wodzie lub na słońcu. Typowe produkty: Bikini, kostiumy kąpielowe, stroje startowe, szorty kąpielowe. @pl
comment: Peça de vestuário usada para atividades aquáticas ou ao sol. Produtos típicos: Biquínis, fatos de banho, fatos de banho de competição, calções de banho. @pt
comment: Îmbrăcăminte purtată pentru activități acvatice sau la soare. Produse tipice: Bikini, costume de baie, costume de baie de competiție, șorturi de baie. @ro
comment: Odev nosený pri aktivitách vo vode alebo na slnku. Typické produkty: Bikiny, plavky, pretekárske plavky, kúpacie šortky. @sk
comment: Oblačilo za vodne aktivnosti ali sončenje. Tipični izdelki: Bikiniji, enodelne kopalke, tekmovalne kopalke, kopalne hlače. @sl
comment: Plagg som bärs för vatten- eller solbaserade aktiviteter. Typiska produkter: Bikinis, baddräkter, tävlingsbadkläder, badbyxor. @sv

Аксесоари за облекло
type: Стойност на категорията PEFCR
label: Apparel Accessories @en
label: Oděvní doplňky @cs
label: Beklædningstilbehør @da
label: Bekleidungszubehör @de
label: Αξεσουάρ ένδυσης @el
label: Accesorios de vestir @es
label: Rõivalisandid @et
label: Vaateasusteet @fi
label: Accessoires vestimentaires @fr
label: Gabhálais Éadaí @ga
label: Odjevni dodaci @hr
label: Ruházati kiegészítők @hu
label: Accessori di abbigliamento @it
label: Drabužių priedai @lt
label: Apģērbu aksesuāri @lv
label: Aċċessorji tal-ilbies @mt
label: Kledingaccessoires @nl
label: Akcesoria odzieżowe @pl
label: Acessórios de vestuário @pt
label: Accesorii de îmbrăcăminte @ro
label: Odevné doplnky @sk
label: Oblačilni dodatki @sl
label: Klädtillbehör @sv
comment: Garments for the head, neck, waist, or hands to protect from elements or secure clothing. Typical products included: Hats (Caps, flat caps, woollen hats/beanies, fedoras, panamas, bowlers, newsboys, berets), Scarves and ties (Warm and light scarves, buffs, neckerchiefs, headscarves, shawls, bowties), Belts (Dress belts, casual belts, buckle belts, tie-up belts, suspenders), Gloves and mittens (fingerless gloves, fashion gloves, outdoor sports gloves, mittens). @en
comment: Дрехи за главата, врата, талията или ръцете за предпазване от елементите или закрепване на дрехите. Типични включени продукти: Шапки (Кепета, каскети, вълнени шапки, федори, панами, бомбета, вестникарски шапки, барети), Шалове и вратовръзки (Топли и леки шалове, бъфове, кърпи за врат, забрадки, шалове за рамене, папионки), Колани (Официални колани, ежедневни колани, колани с катарами, колани за връзване, тиранти), Ръкавици и ръкавици без пръсти (ръкавици без пръсти, модни ръкавици, ръкавици за спорт на открито, ръкавици с един пръст).
comment: Oděvy na hlavu, krk, pas nebo ruce k ochraně před živly nebo k upevnění oděvu. Typické zahrnuté produkty: Klobouky (Čepice, bekovky, vlněné čepice/kulichy, fedory, panamáky, buřinky, baretky), Šály a kravaty (Teplé a lehké šály, nákrčníky, šátky na krk, šátky na hlavu, plédy, motýlky), Opasky (Společenské opasky, neformální opasky, opasky s přezkou, zavazovací opasky, šle), Rukavice a palčáky (rukavice bez prstů, módní rukavice, outdoorové sportovní rukavice, palčáky). @cs
comment: Beklædningsgenstande til hoved, hals, talje eller hænder for at beskytte mod vejret eller fastgøre tøj. Typiske produkter inkluderet: Hatte (Kasketter, flat caps, uldhuer/beanies, fedoraer, panamahatte, bowlerhatte, sixpences, baretter), Tørklæder og slips (Varme og lette tørklæder, halsedisser, halstørklæder, hovedtørklæder, sjaler, butterflys), Bælter (Kjolebælter, hverdagsbælter, spændebælter, bindebælter, seler), Handsker og luffer (fingerløse handsker, modehandsker, udendørs sportshandsker, luffer). @da
comment: Kleidungsstücke für Kopf, Hals, Taille oder Hände zum Schutz vor den Elementen oder zur Befestigung von Kleidung. Typische Produkte: Hüte/Mützen (Kappen, Schiebermützen, Wollmützen/Beanies, Fedoras, Panamahüte, Melonen, Schirmmützen, Barette), Schals und Krawatten (Warme und leichte Schals, Schlauchtücher, Halstücher, Kopftücher, Umschlagtücher, Fliegen), Gürtel (Anzuggürtel, Freizeitgürtel, Schnallengürtel, Bindegürtel, Hosenträger), Handschuhe und Fäustlinge (fingerlose Handschuhe, Modehandschuhe, Outdoor-Sporthandschuhe, Fäustlinge). @de
comment: Ενδύματα για το κεφάλι, τον λαιμό, τη μέση ή τα χέρια για προστασία από τα στοιχεία της φύσης ή για τη στερέωση ρούχων. Τυπικά προϊόντα που περιλαμβάνονται: Καπέλα (Τραγιάσκες, μάλλινοι σκούφοι, φεντόρες, παναμάδες, ημίψηλα, μπερέδες), Κασκόλ και γραβάτες (Ζεστά και ελαφριά κασκόλ, φουλάρια, μαντήλια λαιμού, μαντήλια κεφαλιού, σάλια, παπιγιόν), Ζώνες (Επίσημες ζώνες, καθημερινές ζώνες, ζώνες με αγκράφα, ζώνες που δένουν, τιράντες), Γάντια (γάντια χωρίς δάχτυλα, γάντια μόδας, γάντια υπαίθριων αθλημάτων, γάντια χωρίς χωρίσματα). @el
comment: Prendas para la cabeza, el cuello, la cintura o las manos para proteger de los elementos o asegurar la ropa. Productos típicos incluidos: Sombreros (Gorras, gorras planas, gorros de lana/beanies, fedoras, panamás, bombines, boinas), Bufandas y corbatas (Bufandas cálidas y ligeras, bragas de cuello, pañuelos para el cuello, pañuelos para la cabeza, chales, pajaritas), Cinturones (Cinturones de vestir, cinturones informales, cinturones con hebilla, cinturones para anudar, tirantes), Guantes y manoplas (guantes sin dedos, guantes de moda, guantes para deportes al aire libre, manoplas). @es
comment: Rõivaesemed peale, kaelale, vöökohale või kätele kaitseks ilmastikuolude eest või riiete kinnitamiseks. Tüüpilised tooted: Mütsid (Nokamütsid, läkiläkid, villased mütsid/kootud mütsid, kaabud, panamamütsid, kõvakübarad, baretid), Sallid ja lipsud (Soojad ja kerged sallid, torusallid, kaelarätikud, pearätikud, õlasallid, kikilipsud), Vööd (Ülikonnavööd, vabaajavööd, pandlaga vööd, seotavad vööd, traksid), Kindad ja käpikud (sõrmedeta kindad, moekindad, välispordikindad, käpikud). @et
comment: Päähän, kaulaan, vyötärölle tai käsiin tarkoitetut vaatteet säältä suojautumiseen tai vaatteiden kiinnittämiseen. Tyypillisiä tuotteita: Hatut (Lippalakit, lätsät, villapipot, fedorat, panamahatut, knallit, baskerit), Huivit ja solmiot (Lämpimät ja kevyet huivit, tuubihuivit, kaulahuivit, päänauhat, saalit, rusetit), Vyöt (Pukuvyöt, vapaa-ajan vyöt, solkivyöt, solmittavat vyöt, henkselit), Käsineet ja lapaset (sormettomat käsineet, muotikäsineet, ulkourheilukäsineet, lapaset). @fi
comment: Vêtements pour la tête, le cou, la taille ou les mains afin de protéger des intempéries ou d'ajuster les vêtements. Produits typiques inclus : Chapeaux (Casquettes, casquettes plates, bonnets en laine, fedoras, panamas, chapeaux melons, gavroches, bérets), Écharpes et cravates (Écharpes chaudes et légères, tours de cou, foulards, foulards de tête, châles, nœuds papillon), Ceintures (Ceintures de costume, ceintures décontractées, ceintures à boucle, ceintures à nouer, bretelles), Gants et moufles (gants sans doigts, gants de mode, gants de sports d'extérieur, moufles). @fr
comment: Baill éadaigh don cheann, muineál, coim, nó lámha chun éadaí a chosaint ó na heilimintí nó a dhaingniú. Táirgí tipiciúla san áireamh: Hataí (Caipíní, caipíní cothroma, hataí olann, fedoras, panamas, babhléirí, caipíní nuachtáin, bearéid), Scaifeanna agus carbhat (Scaifeanna te agus éadrom, buffs, muince, scaifeanna cloiginn, seálta, carbhait bhabha), Criosanna (Criosanna gúna, criosanna ócáideacha, criosanna búcla, criosanna comhionannas vótaí, crochadóirí), Lámhainní agus miotóga (lámhainní gan mhéara, lámhainní faisin, lámhainní spóirt amuigh faoin aer, miotóga). @ga
comment: Odjevni predmeti za glavu, vrat, struk ili ruke za zaštitu od vremenskih nepogoda ili pričvršćivanje odjeće. Tipični proizvodi uključuju: Kape i šešire (Šilterice, ravne kape, vunene kape, fedore, panama šeširi, polucilindri, beretke), Šalove i kravate (Topli i lagani šalovi, marame za vrat, rubci, marame za glavu, šalovi za ramena, leptir mašne), Remenje (Svečano remenje, svakodnevno remenje, remenje s kopčom, remenje na vezivanje, naramenice), Rukavice (rukavice bez prstiju, modne rukavice, rukavice za sportove na otvorenom, rukavice s jednim prstom). @hr
comment: A fej, nyak, derék vagy kezek fedésére szolgáló ruhadarabok az időjárás elleni védelem vagy a ruházat rögzítése céljából. Jellemző termékek: Kalapok és sapkák (Bellsapkák, lapos sapkák, gyapjúsapkák/kötött sapkák, fedorák, panamakalapok, keménykalapok, barett sapkák), Sálak és nyakkendők (Meleg és könnyű sálak, csősálak, nyakkendők, fejkendők, vállkendők, csokornyakkendők), Övek (Öltönyövek, hétköznapi övek, csatos övek, megkötős övek, nadrágtartók), Kesztyűk és egyujjas kesztyűk (ujj nélküli kesztyűk, divatkesztyűk, szabadtéri sportkesztyűk, egyujjas kesztyűk). @hu
comment: Indumenti per la testa, il collo, la vita o le mani per proteggere dalle intemperie o fissare i vestiti. Prodotti tipici inclusi: Cappelli (Berretti, coppole, cappelli di lana/berretti, fedora, panama, bombette, berretti da strillone, baschi), Sciarpe e cravatte (Sciarpe calde e leggere, scaldacollo, foulard, foulard per la testa, scialli, papillon), Cinture (Cinture eleganti, cinture casual, cinture con fibbia, cinture da annodare, bretelle), Guanti e muffole (guanti senza dita, guanti alla moda, guanti per sport all'aperto, muffole). @it
comment: Drabužiai galvai, kaklui, juosmeniui ar rankoms, skirti apsaugoti nuo stichijų ar pritvirtinti drabužius. Tipiški įtraukti produktai: Kepurės (Kepuraitės su snapeliu, plokščios kepurės, vilnonės kepurės, fedoros, panamos, katiliukai, laikraščių išnešiotojų kepurės, beretės), Šalikai ir kaklaraiščiai (Šilti ir lengvi šalikai, kaklo movos, kaklaskarės, skarelės, skaros, varlytės), Diržai (Kostiuminiai diržai, kasdieniai diržai, diržai su sagtimi, surišami diržai, petnešos), Pirštinės ir kumštinės pirštinės (pirštinės be pirštų, madingos pirštinės, lauko sporto pirštinės, kumštinės pirštinės). @lt
comment: Apģērbs galvai, kaklam, viduklim vai rokām, lai pasargātu no laikapstākļiem vai nostiprinātu apģērbu. Tipiski iekļautie produkti: Cepures (Naģenes, plakanās naģenes, vilnas cepures, fedoras, panamas, katliņi, beretes), Šalles un kaklasaites (Siltas un vieglas šalles, tuneļšalles, kaklauti, lakati, lakati pleciem, tauriņi), Jostas (Uzvilkuma jostas, ikdienas jostas, jostas ar sprādzi, sasienamas jostas, bikšturi), Cimdi un dūraiņi (cimdi bez pirkstiem, modes cimdi, brīvdabas sporta cimdi, dūraiņi). @lv
comment: Ħwejjeġ għar-ras, l-għonq, il-qadd, jew l-idejn biex jipproteġu minn elementi jew ħwejjeġ siguri. Prodotti tipiċi inklużi: Kpiepel (Brieret, brieret ċatti, kpiepel tas-suf/beanies, fedoras, panamas, bowlers, newsboys, berets), Xalpi u ingravati (Xalpi sħan u ħfief, buffs, mkatar tal-għonq, xalpi tar-ras, xalel, bowties), Ċinturini (Ċinturini tal-libsa, ċinturini każwali, ċinturini bil-bokkla, ċinturini tal-irbit, suspenders), Ingwanti u mittens (ingwanti mingħajr swaba, ingwanti tal-moda, ingwanti għall-isports fil-beraħ, mittens). @mt
comment: Kledingstukken voor het hoofd, de hals, de taille of de handen ter bescherming tegen de elementen of om kleding vast te zetten. Typische producten inbegrepen: Hoeden (Petten, platte petten, wollen mutsen/beanies, fedora's, panama's, bolhoeden, newsboy-petten, baretten), Sjaals en dassen (Warme en lichte sjaals, colsjaals, halsdoeken, hoofddoeken, omslagdoeken, vlinderdassen), Riemen (Nette riemen, vrijetijdsriemen, gespriemen, strikriemen, bretels), Handschoenen en wanten (vingerloze handschoenen, modehandschoenen, buitensporthandschoenen, wanten). @nl
comment: Odzież na głowę, szyję, talię lub dłonie w celu ochrony przed warunkami atmosferycznymi lub mocowania odzieży. Typowe produkty w zestawie: Czapki i kapelusze (Czapki z daszkiem, kaszkiety, czapki wełniane, fedory, panamy, meloniki, gawroszki, berety), Szaliki i krawaty (Ciepłe i lekkie szaliki, kominy, apaszki, chusty na głowę, szale, muchy), Paski (Paski wizytowe, paski na co dzień, paski z klamrą, paski wiązane, szelki), Rękawiczki i rękawice z jednym palcem (rękawiczki bez palców, rękawiczki modowe, rękawiczki do sportów na świeżym powietrzu, rękawice z jednym palcem). @pl
comment: Peças de vestuário para a cabeça, pescoço, cintura ou mãos para proteger dos elementos ou fixar o vestuário. Produtos típicos incluídos: Chapéus (Bonés, boinas, gorros de lã, fedoras, panamás, chapéus-coco, boinas de ardina, boinas francesas), Cachecóis e gravatas (Cachecóis quentes e leves, golas, lenços de pescoço, lenços de cabeça, xales, laços), Cintos (Cintos de cerimónia, cintos casuais, cintos com fivela, cintos de atar, suspensórios), Luvas e mitenes (luvas sem dedos, luvas de moda, luvas para desportos ao ar livre, mitenes). @pt
comment: Îmbrăcăminte pentru cap, gât, talie sau mâini pentru a proteja de intemperii sau pentru a asigura îmbrăcămintea. Produse tipice incluse: Pălării și șepci (Șepci, șepci plate, căciuli de lână, fedora, panama, melon, șepci de ziarist, berete), Eșarfe și cravate (Eșarfe calde și ușoare, fulare circulare, baticuri, eșarfe pentru cap, șaluri, papioane), Curele (Curele de costum, curele casual, curele cu cataramă, curele de legat, bretele), Mănuși (mănuși fără degete, mănuși de modă, mănuși pentru sporturi în aer liber, mănuși cu un deget). @ro
comment: Odevy na hlavu, krk, pás alebo ruky na ochranu pred nepriaznivým počasím alebo zaistenie oblečenia. Typické zahrnuté produkty: Čiapky a klobúky (Šiltovky, bekovky, vlnené čiapky, fedory, panamáky, burinky, barety), Šály a kravaty (Teplé a ľahké šály, nákrčníky, šatky na krk, šatky na hlavu, plédy, motýliky), Opasky (Oblekové opasky, neformálne opasky, opasky s prackou, zaväzovacie opasky, traky), Rukavice a palčiaky (rukavice bez prstov, módne rukavice, outdoorové športové rukavice, palčiaky). @sk
comment: Oblačila za glavo, vrat, pas ali roke za zaščito pred vremenskimi vplivi ali pritrditev oblačil. Tipični vključeni izdelki: Kape in klobuki (Kape s šiltom, baretke, volnene kape, fedore, paname, polcilindri, baretke), Šali in kravate (Topli in lahki šali, ovratni šali, rutke, naglavne rute, šali, metuljčki), Pasovi (Svečani pasovi, vsakodnevni pasovi, pasovi z zaponko, pasovi za zavezovanje, naramnice), Rokavice (rokavice brez prstov, modne rokavice, rokavice za športe na prostem, rokavice na en prst). @sl
comment: Plagg för huvud, hals, midja eller händer för att skydda mot väder eller fästa kläder. Typiska produkter som ingår: Hattar och mössor (Kepsar, gubbkepsar, ullmössor/beanies, fedorahattar, panamahattar, plommonstop, newsboy-kepsar, baskrar), Halsdukar och slipsar (Varma och lätta halsdukar, tubhalsdukar, snusnesnäsar, huvuddukar, sjalar, flugor), Bälten (Kostymbälten, vardagsbälten, spännbälten, knytbälten, hängslen), Handskar och vantar (torgvantar, modehandskar, utomhussportvantar, tumvantar). @sv

Обувки с отворени пръсти
type: Стойност на категорията PEFCR
label: Open-toed shoes @en
label: Boty s otevřenou špičkou @cs
label: Sko med åben tå @da
label: Offene Schuhe @de
label: Παπούτσια ανοιχτά μπροστά @el
label: Zapatos con punta abierta @es
label: Lahtise ninaga kingad @et
label: Avokärkiset kengät @fi
label: Chaussures à bout ouvert @fr
label: Bróga oscailte le ladhar @ga
label: Cipele s otvorenim prstima @hr
label: Nyitott orrú cipők @hu
label: Scarpe spuntate @it
label: Batai atvirais pirštais @lt
label: Kurpes ar vaļēju purngalu @lv
label: Żraben miftuħin @mt
label: Schoenen met open neus @nl
label: Buty z odkrytymi palcami @pl
label: Sapatos abertos à frente @pt
label: Încălțăminte decupată la vârf @ro
label: Topánky s otvorenou špičkou @sk
label: Čevlji z odprtimi prsti @sl
label: Skor med öppen tå @sv
comment: Open-toed shoes, providing protection from the ground. Used in pairs. Typical products included: Flip-flops, casual /fashion sandals, sports sandals, slippers. @en
comment: Обувки с отворени пръсти, осигуряващи защита от земята. Използват се по двойки. Типични включени продукти: Джапанки, ежедневни/модни сандали, спортни сандали, чехли.
comment: Boty s otevřenou špičkou, poskytující ochranu od země. Používají se v párech. Typické zahrnuté produkty: Žabky, neformální/módní sandály, sportovní sandály, pantofle. @cs
comment: Sko med åben tå, der giver beskyttelse mod jorden. Bruges i par. Typiske produkter inkluderet: Klipklapper, fritids-/modesandaler, sportssandaler, hjemmesko. @da
comment: Offene Schuhe, die Schutz vor dem Boden bieten. Werden paarweise getragen. Typische Produkte: Flip-Flops, Freizeit-/Modensandalen, Sportsandalen, Hausschuhe. @de
comment: Παπούτσια ανοιχτά μπροστά, που παρέχουν προστασία από το έδαφος. Χρησιμοποιούνται σε ζεύγη. Τυπικά προϊόντα που περιλαμβάνονται: Σαγιονάρες, καθημερινά/μοδάτα σανδάλια, αθλητικά σανδάλια, παντόφλες. @el
comment: Zapatos con punta abierta, que brindan protección contra el suelo. Se usan en pares. Productos típicos incluidos: Chanclas, sandalias informales/de moda, sandalias deportivas, zapatillas de casa. @es
comment: Lahtise ninaga kingad, mis pakuvad kaitset maapinna eest. Kasutatakse paaridena. Tüüpilised tooted: Plätud, vabaaja-/moesandaalid, spordisandaalid, sussid. @et
comment: Avokärkiset kengät, jotka suojaavat jalkaa maalta. Käytetään pareittain. Tyypillisiä tuotteita: Varvassandaalit, vapaa-ajan/muotisandaalit, urheilusandaalit, tohvelit. @fi
comment: Chaussures à bout ouvert, offrant une protection contre le sol. Utilisées par paires. Produits typiques inclus : Tongs, sandales décontractées/de mode, sandales de sport, pantoufles. @fr
comment: Bróga le ladhar oscailte, a thugann cosaint ón talamh. Úsáidtear ina mbeirteanna. Táirgí tipiciúla san áireamh: Smeach-flops, sandals ócáideacha/faisin, sandals spóirt, slipéir. @ga
comment: Cipele s otvorenim prstima koje pružaju zaštitu od tla. Koriste se u paru. Tipični proizvodi uključuju: Japanke, ležerne/modne sandale, sportske sandale, papuče. @hr
comment: Nyitott orrú cipők, amelyek védelmet nyújtanak a talajjal szemben. Párban használatosak. Jellemző termékek: Strandpapucsok, hétköznapi/divatszandálok, sportszandálok, papucsok. @hu
comment: Scarpe spuntate, che offrono protezione dal suolo. Usate in paia. Prodotti tipici inclusi: Infradito, sandali casual/alla moda, sandali sportivi, pantofole. @it
comment: Batai atvirais pirštais, apsaugantys nuo žemės. Naudojami poromis. Tipiški įtraukti produktai: Paplūdimio šlepetės, kasdienės/madingos basutės, sportinės basutės, šlepetės. @lt
comment: Kurpes ar vaļēju purngalu, kas nodrošina aizsardzību no zemes. Izmanto pa pāriem. Tipiski iekļautie produkti: Vjetnamkas, ikdienas/modes sandales, sporta sandales, čības. @lv
comment: Żraben miftuħin, li jipprovdu protezzjoni mill-art. Użati f'pari. Prodotti tipiċi inklużi: Flip-flops, sandlijiet każwali/tal-moda, sandlijiet sportivi, papoċċi. @mt
comment: Schoenen met open neus, die bescherming bieden tegen de grond. Worden per paar gebruikt. Typische producten inbegrepen: Teenslippers, casual/mode sandalen, sportsandalen, pantoffels. @nl
comment: Buty z odkrytymi palcami, zapewniające ochronę przed podłożem. Używane w parach. Typowe produkty w zestawie: Klapki, sandały na co dzień/modowe, sandały sportowe, kapcie. @pl
comment: Sapatos abertos à frente, proporcionando proteção contra o solo. Usados em pares. Produtos típicos incluídos: Chinelos, sandálias casuais/de moda, sandálias de desporto, pantufas. @pt
comment: Încălțăminte decupată la vârf, care oferă protecție față de sol. Folosită în perechi. Produse tipice incluse: Șlapi, sandale casual/de modă, sandale sport, papuci de casă. @ro
comment: Topánky s otvorenou špičkou, poskytujúce ochranu pred zemou. Používajú sa v pároch. Typické zahrnuté produkty: Žabky, neformálne/módne sandále, športové sandále, papuče. @sk
comment: Čevlji z odprtimi prsti, ki zagotavljajo zaščito pred tlemi. Uporabljajo se v parih. Tipični vključeni izdelki: Japonke, vsakodnevni/modni sandali, športni sandali, copati. @sl
comment: Skor med öppen tå, ger skydd från marken. Används i par. Typiska produkter som ingår: Flip-flops, vardags-/modesandaler, sportsandaler, tofflor. @sv

Обувки със затворени пръсти
type: Стойност на категорията PEFCR
label: Closed-toed shoes @en
label: Boty s uzavřenou špičkou @cs
label: Lukkede sko @da
label: Geschlossene Schuhe @de
label: Κλειστά παπούτσια @el
label: Zapatos cerrados @es
label: Kinnise ninaga kingad @et
label: Umpikärkiset kengät @fi
label: Chaussures fermées @fr
label: Bróga dúnta @ga
label: Zatvorene cipele @hr
label: Zárt cipők @hu
label: Scarpe chiuse @it
label: Uždari batai @lt
label: Slēgtas kurpes @lv
label: Żraben magħluqa @mt
label: Gesloten schoenen @nl
label: Buty z zakrytymi palcami @pl
label: Sapatos fechados @pt
label: Încălțăminte închisă @ro
label: Topánky s uzavretou špičkou @sk
label: Zaprti čevlji @sl
label: Stängda skor @sv
comment: Closed-toed shoes, providing protection from the ground. They may protect against water, the elements and/or heavy objects. Used in pairs. Typical products included: Slippers, tennis shoes, moccasins, espadrilles, sneakers, cleats, athletic shoes, dress shoes, protective toecap – toed shoes. @en
comment: Обувки със затворени пръсти, осигуряващи защита от земята. Могат да предпазват от вода, елементите и/или тежки предмети. Използват се по двойки. Типични включени продукти: Чехли, обувки за тенис, мокасини, еспадрили, маратонки, бутонки, спортни обувки, официални обувки, обувки със защитно бомбе.
comment: Boty s uzavřenou špičkou, poskytující ochranu od země. Mohou chránit před vodou, živly a/nebo těžkými předměty. Používají se v párech. Typické zahrnuté produkty: Pantofle, tenisové boty, mokasíny, espadrilky, tenisky, kopačky, sportovní obuv, společenská obuv, boty s ochrannou špičkou. @cs
comment: Lukkede sko, der giver beskyttelse mod jorden. De kan beskytte mod vand, vejret og/eller tunge genstande. Bruges i par. Typiske produkter inkluderet: Hjemmesko, tennissko, mokkasiner, espadriller, sneakers, knopper, sportssko, pæne sko, sikkerhedssko. @da
comment: Geschlossene Schuhe, die Schutz vor dem Boden bieten. Sie können vor Wasser, den Elementen und/oder schweren Gegenständen schützen. Werden paarweise getragen. Typische Produkte: Hausschuhe, Tennisschuhe, Mokassins, Espadrilles, Sneakers, Stollenschuhe, Sportschuhe, Anzugschuhe, Sicherheitsschuhe mit Zehenkappe. @de
comment: Κλειστά παπούτσια, που παρέχουν προστασία από το έδαφος. Μπορούν να προστατεύσουν από νερό, καιρικές συνθήκες και/ή βαριά αντικείμενα. Χρησιμοποιούνται σε ζεύγη. Τυπικά προϊόντα που περιλαμβάνονται: Παντόφλες, παπούτσια τένις, μοκασίνια, εσπαντρίγιες, αθλητικά παπούτσια (sneakers), παπούτσια με τάπες, αθλητικά υποδήματα, επίσημα παπούτσια, παπούτσια με προστατευτικό δακτύλων. @el
comment: Zapatos cerrados, que brindan protección contra el suelo. Pueden proteger contra el agua, los elementos y/o objetos pesados. Se usan en pares. Productos típicos incluidos: Zapatillas de casa, zapatillas de tenis, mocasines, alpargatas, zapatillas de deporte, tacos, calzado deportivo, zapatos de vestir, zapatos con puntera protectora. @es
comment: Kinnise ninaga kingad, mis pakuvad kaitset maapinna eest. Võivad kaitsta vee, ilmastiku ja/või raskete esemete eest. Kasutatakse paaridena. Tüüpilised tooted: Sussid, tennised, mokassiinid, espadrillid, tossud, naelikud, spordijalatsid, viigikingad, turvaninaga kingad. @et
comment: Umpikärkiset kengät, jotka suojaavat jalkaa maalta. Ne voivat suojata vedeltä, säältä ja/tai raskailta esineiltä. Käytetään pareittain. Tyypillisiä tuotteita: Tohvelit, tenniskengät, mokkasiinit, espadrillot, lenkkarit, nappulakengät, urheilukengät, pukukengät, turvakärkiset kengät. @fi
comment: Chaussures fermées, offrant une protection contre le sol. Elles peuvent protéger contre l'eau, les intempéries et/ou les objets lourds. Utilisées par paires. Produits typiques inclus : Pantoufles, chaussures de tennis, mocassins, espadrilles, baskets, crampons, chaussures de sport, chaussures de ville, chaussures à embout de protection. @fr
comment: Bróga dúnta, a thugann cosaint ón talamh. Féadfaidh siad cosaint a dhéanamh ar uisce, na heilimintí agus/nó rudaí troma. Úsáidtear ina mbeirteanna. Táirgí tipiciúla san áireamh: Slipéir, bróga leadóige, moccasins, espadrilles, sneakers, cleats, bróga lúthchleasa, bróga gúna, bróga le caipín cosanta. @ga
comment: Zatvorene cipele koje pružaju zaštitu od tla. Mogu štititi od vode, vremenskih neprilika i/ili teških predmeta. Koriste se u paru. Tipični proizvodi uključuju: Papuče, tenisice, mokasinke, espadrile, sportske tenisice, kopačke, atletske cipele, svečane cipele, cipele sa zaštitnom kapicom. @hr
comment: Zárt cipők, amelyek védelmet nyújtanak a talajjal szemben. Védhetnek a víztől, az időjárás viszontagságaitól és/vagy nehéz tárgyaktól. Párban használatosak. Jellemző termékek: Papucsok, teniszcipők, mokaszinok, espadrille-ek, tornacipők, stoplis cipők, sportcipők, alkalmi cipők, acélbetétes védőcipők. @hu
comment: Scarpe chiuse, che offrono protezione dal suolo. Possono proteggere da acqua, intemperie e/o oggetti pesanti. Usate in paia. Prodotti tipici inclusi: Pantofole, scarpe da tennis, mocassini, espadrillas, scarpe da ginnastica, scarpe con tacchetti, scarpe sportive, scarpe eleganti, scarpe con puntale protettivo. @it
comment: Uždari batai, apsaugantys nuo žemės. Gali apsaugoti nuo vandens, gamtos stichijų ir (arba) sunkių daiktų. Naudojami poromis. Tipiški įtraukti produktai: Šlepetės, teniso batai, mokasinai, espadrilės, sportbačiai, bucai, sporto batai, išeiginiai batai, batai su apsaugine nosimi. @lt
comment: Slēgtas kurpes, kas nodrošina aizsardzību no zemes. Var aizsargāt pret ūdeni, laikapstākļiem un/vai smagiem priekšmetiem. Izmanto pa pāriem. Tipiski iekļautie produkti: Čības, tenisa kurpes, mokasīni, espadrilas, kedas, buči, sporta apavi, izejamās kurpes, kurpes ar aizsargpurngalu. @lv
comment: Żraben magħluqa, li jipprovdu protezzjoni mill-art. Jistgħu jipproteġu mill-ilma, elementi u/jew oġġetti tqal. Użati f'pari. Prodotti tipiċi inklużi: Papoċċi, żraben tat-tennis, moccasins, espadrilles, sneakers, bitti, żraben atletiċi, żraben tal-libsa, żraben bil-ponta protettiva. @mt
comment: Gesloten schoenen, die bescherming bieden tegen de grond. Ze kunnen beschermen tegen water, de elementen en/of zware voorwerpen. Worden per paar gebruikt. Typische producten inbegrepen: Pantoffels, tennisschoenen, mocassins, espadrilles, sneakers, noppenschoenen, sportschoenen, nette schoenen, veiligheidsschoenen. @nl
comment: Buty z zakrytymi palcami, zapewniające ochronę przed podłożem. Mogą chronić przed wodą, warunkami atmosferycznymi i/lub ciężkimi przedmiotami. Używane w parach. Typowe produkty w zestawie: Kapcie, buty do tenisa, mokasyny, espadryle, sneakersy, korki, buty sportowe, wizytowe, buty z noskiem ochronnym. @pl
comment: Sapatos fechados, proporcionando proteção contra o solo. Podem proteger contra água, elementos e/ou objetos pesados. Usados em pares. Produtos típicos incluídos: Pantufas, sapatos de ténis, mocassins, alpercatas, sapatilhas, chuteiras, calçado desportivo, sapatos de cerimónia, sapatos com biqueira de proteção. @pt
comment: Încălțăminte închisă, care oferă protecție față de sol. Poate proteja de apă, intemperii și/sau obiecte grele. Folosită în perechi. Produse tipice incluse: Papuci de casă, pantofi de tenis, mocasini, espadrile, adidași, ghete cu crampoane, pantofi de sport, pantofi eleganți, pantofi cu bombeu de protecție. @ro
comment: Topánky s uzavretou špičkou, poskytujúce ochranu pred zemou. Môžu chrániť pred vodou, nepriaznivým počasím a/alebo ťažkými predmetmi. Používajú sa v pároch. Typické zahrnuté produkty: Papuče, tenisové topánky, mokasíny, espadrilky, tenisky, kopačky, športová obuv, spoločenská obuv, topánky s ochrannou špičkou. @sk
comment: Zaprti čevlji, ki zagotavljajo zaščito pred tlemi. Lahko ščitijo pred vodo, vremenskimi vplivi in/ali težkimi predmeti. Uporabljajo se v parih. Tipični vključeni izdelki: Copati, teniški copati, mokasini, espadrile, superge, kopačke, športni čevlji, svečani čevlji, čevlji z zaščitno kapico. @sl
comment: Stängda skor, ger skydd från marken. De kan skydda mot vatten, väder och/eller tunga föremål. Används i par. Typiska produkter som ingår: Tofflor, tennisskor, mockasiner, espadriller, sneakers, fotbollsskor, atletiska skor, finskor, skyddsskor med stålhätta. @sv

Ботуши
type: Стойност на категорията PEFCR
label: Boots @en
label: Kozačky/boty @cs
label: Støvler @da
label: Stiefel @de
label: Μπότες @el
label: Botas @es
label: Saapad @et
label: Saappaat @fi
label: Bottes @fr
label: Buataisí @ga
label: Čizme @hr
label: Csizmák @hu
label: Stivali @it
label: Batai (auliniai) @lt
label: Zābaki @lv
label: Stvali @mt
label: Laarzen @nl
label: Buty/Kozaki @pl
label: Cizme @ro
label: Čižmy/topánky @sk
label: Škornji @sl
label: Stövlar @sv
comment: Boots that cover the ankle, providing protection from the ground. They may protect against water, the elements, heavy objects and/or ankle injuries. Used in pairs. Typical products included: Polymer boots, winter boots, hiking boots, dress boots, protective toecap - toed boots. @en
comment: Ботуши, които покриват глезена и осигуряват защита от земята. Могат да предпазват от вода, елементите, тежки предмети и/или наранявания на глезена. Използват се по двойки. Типични включени продукти: Полимерни ботуши, зимни ботуши, туристически обувки, официални ботуши, ботуши със защитно бомбе.
comment: Boty, které zakrývají kotník a poskytují ochranu od země. Mohou chránit před vodou, živly, těžkými předměty a/nebo zraněním kotníku. Používají se v párech. Typické zahrnuté produkty: Polymerové boty, zimní boty, turistické boty, společenské boty, boty s ochrannou špičkou. @cs
comment: Støvler, der dækker anklen, og giver beskyttelse fra jorden. De kan beskytte mod vand, elementerne, tunge genstande og/eller ankelskader. Bruges i par. Typiske produkter inkluderet: Polymerstøvler, vinterstøvler, vandrestøvler, pæne støvler, støvler med beskyttende tåkappe. @da
comment: Stiefel, die den Knöchel bedecken und Schutz vor dem Boden bieten. Sie können vor Wasser, den Elementen, schweren Gegenständen und/oder Knöchelverletzungen schützen. Werden paarweise getragen. Typische Produkte: Polymerstiefel, Winterstiefel, Wanderstiefel, Anzugstiefel, Stiefel mit Zehenschutzkappe. @de
comment: Μπότες που καλύπτουν τον αστράγαλο, παρέχοντας προστασία από το έδαφος. Μπορούν να προστατεύσουν από το νερό, τα στοιχεία της φύσης, βαριά αντικείμενα ή/και τραυματισμούς στον αστράγαλο. Χρησιμοποιούνται σε ζευγάρια. Τυπικά προϊόντα που περιλαμβάνονται: Μπότες από πολυμερές, χειμερινές μπότες, μπότες πεζοπορίας, επίσημες μπότες, μπότες με προστατευτικό κάλυμμα δακτύλων. @el
comment: Botas que cubren el tobillo, proporcionando protección del suelo. Pueden proteger contra el agua, los elementos, objetos pesados y/o lesiones en el tobillo. Se usan en pares. Productos típicos incluidos: Botas de polímero, botas de invierno, botas de senderismo, botas de vestir, botas con puntera protectora. @es
comment: Saapad, mis katavad pahkluu ja pakuvad kaitset maapinna eest. Võivad kaitsta vee, ilmastikuolude, raskete esemete ja/või pahkluuvigastuste eest. Kantakse paaris. Tüüpilised tooted: Polümeersaapad, talvesaapad, matkasaapad, viigisaapad, kaitsevarbaga saapad. @et
comment: Nilkan peittävät saappaat, jotka antavat suojaa maalta. Voivat suojata vedeltä, säältä, raskailta esineiltä ja/tai nilkkavammoilta. Käytetään pareittain. Tyypillisiä tuotteita ovat: Polymeerisaappaat, talvisaappaat, vaelluskengät, pukusaappaat, turvakärjellä varustetut saappaat. @fi
comment: Bottes qui couvrent la cheville, offrant une protection par rapport au sol. Elles peuvent protéger de l'eau, des intempéries, des objets lourds et/ou des blessures à la cheville. Portées par paires. Produits typiques inclus : Bottes en polymère, bottes d'hiver, chaussures de randonnée, bottes habillées, bottes avec embout de protection. @fr
comment: Buataisí a chlúdaíonn an rúitín, a thugann cosaint ón talamh. D'fhéadfadh siad cosaint a dhéanamh i gcoinne uisce, na heilimintí, rudaí troma agus/nó gortuithe rúitín. Úsáidtear ina mbeirteanna. Táirgí tipiciúla san áireamh: Buataisí polaiméire, buataisí geimhridh, buataisí fánaíochta, buataisí gúna, buataisí le caipín cosanta. @ga
comment: Čizme koje prekrivaju gležanj, pružajući zaštitu od tla. Mogu štititi od vode, vremenskih neprilika, teških predmeta i/ili ozljeda gležnja. Koriste se u paru. Tipični proizvodi uključuju: Polimerne čizme, zimske čizme, planinarske cipele, svečane čizme, čizme sa zaštitnom kapicom. @hr
comment: Bokát takaró csizmák, amelyek védelmet nyújtanak a talajjal szemben. Védhetnek a víztől, az időjárás viszontagságaitól, nehéz tárgyaktól és/vagy a boka sérüléseitől. Párban használatosak. Jellemző termékek: Polimer csizmák, téli csizmák, túrabakancsok, alkalmi csizmák, acélbetétes védőcsizmák. @hu
comment: Stivali che coprono la caviglia, offrendo protezione dal suolo. Possono proteggere da acqua, intemperie, oggetti pesanti e/o lesioni alla caviglia. Usati in paia. Prodotti tipici inclusi: Stivali in polimero, stivali invernali, scarponi da trekking, stivali eleganti, stivali con puntale protettivo. @it
comment: Batai, dengiantys kulkšnį ir apsaugantys nuo žemės. Gali apsaugoti nuo vandens, gamtos stichijų, sunkių daiktų ir (arba) kulkšnies sužalojimų. Naudojami poromis. Tipiški įtraukti produktai: Polimeriniai batai, žieminiai batai, žygio batai, išeiginiai batai, batai su apsaugine nosimi. @lt
comment: Zābaki, kas nosedz potīti, nodrošinot aizsardzību no zemes. Var aizsargāt pret ūdeni, laikapstākļiem, smagiem priekšmetiem un/vai potīšu traumām. Izmanto pa pāriem. Tipiski iekļautie produkti: Polimēra zābaki, ziemas zābaki, pārgājienu zābaki, izejamie zābaki, zābaki ar aizsargpurngalu. @lv
comment: Stvali li jkopru l-għaksa, u jipprovdu protezzjoni mill-art. Jistgħu jipproteġu mill-ilma, elementi, oġġetti tqal u/jew korrimenti fl-għaksa. Użati f'pari. Prodotti tipiċi inklużi: Stvali tal-polimeru, stvali tax-xitwa, stvali tal-mixi, stvali tal-libsa, stvali bil-ponta protettiva. @mt
comment: Laarzen die de enkel bedekken en bescherming bieden tegen de grond. Ze kunnen beschermen tegen water, de elementen, zware voorwerpen en/of enkelblessures. Worden per paar gebruikt. Typische producten inbegrepen: Polymeerlaarzen, winterlaarzen, wandelschoenen, nette laarzen, laarzen met beschermende neus. @nl
comment: Buty zakrywające kostkę, zapewniające ochronę przed podłożem. Mogą chronić przed wodą, warunkami atmosferycznymi, ciężkimi przedmiotami i/lub urazami kostki. Używane w parach. Typowe produkty w zestawie: Buty polimerowe, buty zimowe, buty trekkingowe, eleganckie kozaki, buty z noskiem ochronnym. @pl
comment: Botas que cobrem o tornozelo, proporcionando proteção contra o solo. Podem proteger contra água, elementos, objetos pesados e/ou lesões no tornozelo. Usadas em pares. Produtos típicos incluídos: Botas de polímero, botas de inverno, botas de caminhada, botas de cerimónia, botas com biqueira de proteção. @pt
comment: Cizme care acoperă glezna, oferind protecție față de sol. Pot proteja de apă, intemperii, obiecte grele și/sau leziuni ale gleznei. Folosite în perechi. Produse tipice incluse: Cizme din polimer, cizme de iarnă, bocanci de drumeție, cizme elegante, cizme cu bombeu de protecție. @ro
comment: Topánky, ktoré zakrývajú členok a poskytujú ochranu pred zemou. Môžu chrániť pred vodou, nepriaznivým počasím, ťažkými predmetmi a/alebo zranením členku. Používajú sa v pároch. Typické zahrnuté produkty: Polymérové topánky, zimné topánky, turistické topánky, spoločenské topánky, topánky s ochrannou špičkou. @sk
comment: Škornji, ki prekrivajo gleženj in zagotavljajo zaščito pred tlemi. Lahko ščitijo pred vodo, vremenskimi vplivi, težkimi predmeti in/ali poškodbami gležnja. Uporabljajo se v parih. Tipični vključeni izdelki: Polimerni škornji, zimski škornji, pohodniški čevlji, svečani škornji, škornji z zaščitno kapico. @sl
comment: Stövlar som täcker vristen och ger skydd från marken. De kan skydda mot vatten, väder, tunga föremål och/eller vristskador. Används i par. Typiska produkter som ingår: Polymerstövlar, vinterstövlar, vandringskängor, finskor av stöveltyp, skyddsstövlar med stålhätta. @sv

Сертификати за съответствие на текстила с ESPR
type: ObjectProperty
label: Textile ESPR Conformity Certifications @en
label: Certifikace shody textilu s ESPR @cs
label: Tekstil ESPR overensstemmelsescertifikater @da
label: ESPR-Konformitätszertifikate für Textilien @de
label: Πιστοποιήσεις συμμόρφωσης κλωστοϋφαντουργικών προϊόντων με ESPR @el
label: Certificaciones de conformidad ESPR textil @es
label: Tekstiili ESPR vastavussertifikaadid @et
label: Tekstiilien ESPR-vaatimustenmukaisuussertifikaatit @fi
label: Certifications de conformité ESPR des textiles @fr
label: Deimhnithe Comhréireachta ESPR Teicstíle @ga
label: Certifikati o sukladnosti tekstila s ESPR-om @hr
label: Textil ESPR megfelelőségi tanúsítványok @hu
label: Certificazioni di conformità ESPR per prodotti tessili @it
label: Tekstilės ESPR atitikties sertifikatai @lt
label: Tekstilizstrādājumu ESPR atbilstības sertifikāti @lv
label: Ċertifikazzjonijiet tal-Konformità ESPR tat-Tessuti @mt
label: Textiel ESPR conformiteitscertificaten @nl
label: Certyfikaty zgodności tekstyliów z ESPR @pl
label: Certificações de conformidade ESPR de têxteis @pt
label: Certificate de conformitate ESPR pentru textile @ro
label: Certifikáty zhody textilu s ESPR @sk
label: Certifikati o skladnosti tekstila z ESPR @sl
label: Textil ESPR överensstämmelseintyg @sv
comment: Certifications specifically verifying ESPR textile claims (e.g. recycled content, recyclability, mechanical properties). @en
comment: Сертификати, потвърждаващи специфични ESPR твърдения за текстил (напр. съдържание на рециклирани материали, рециклируемост, механични свойства).
comment: Certifikace výslovně ověřující tvrzení ESPR o textilu (např. obsah recyklovaného materiálu, recyklovatelnost, mechanické vlastnosti). @cs
comment: Certificeringer, der specifikt verificerer ESPR tekstilpåstande (f.eks. genanvendt indhold, genanvendelighed, mekaniske egenskaber). @da
comment: Zertifizierungen zur spezifischen Überprüfung von ESPR-Textilbehauptungen (z. B. Anteil an recyceltem Material, Recyclingfähigkeit, mechanische Eigenschaften). @de
comment: Πιστοποιήσεις που επαληθεύουν συγκεκριμένα τους ισχυρισμούς ESPR για κλωστοϋφαντουργικά προϊόντα (π.χ. περιεχόμενο ανακυκλωμένου υλικού, ανακυκλωσιμότητα, μηχανικές ιδιότητες). @el
comment: Certificaciones que verifican específicamente las declaraciones de textiles ESPR (p. ej., contenido reciclado, reciclabilidad, propiedades mecánicas). @es
comment: Sertifikaadid, mis kontrollivad konkreetselt ESPR-i tekstiilinõudeid (nt ringlussevõetud sisu, ringlussevõetavus, mehaanilised omadused). @et
comment: Sertifikaatit, joilla todennetaan erityisesti ESPR-tekstiiliväitteet (esim. kierrätyssisältö, kierrätettävyys, mekaaniset ominaisuudet). @fi
comment: Certifications vérifiant spécifiquement les allégations ESPR relatives aux textiles (par ex. contenu recyclé, recyclabilité, propriétés mécaniques). @fr
comment: Deimhnithe a fhíoraíonn go sonrach éilimh teicstíle ESPR (e.g. ábhar athchúrsáilte, in-athchúrsáilteacht, airíonna meicniúla). @ga
comment: Certifikati kojima se posebno potvrđuju tvrdnje o tekstilu u okviru ESPR-a (npr. reciklirani sadržaj, reciklabilnost, mehanička svojstva). @hr
comment: A textíliákra vonatkozó ESPR-állításokat kifejezetten igazoló tanúsítványok (pl. újrahasznosított tartalom, újrahasznosíthatóság, mechanikai tulajdonságok). @hu
comment: Certificazioni che verificano specificamente le dichiarazioni sui tessili ESPR (ad es. contenuto riciclato, riciclabilità, proprietà meccaniche). @it
comment: Sertifikatai, kuriais konkrečiai patikrinami ESPR su tekstile susiję teiginiai (pvz., perdirbto turinio dalis, perdirbamumas, mechaninės savybės). @lt
comment: Sertifikāti, kas īpaši pārbauda ESPR apgalvojumus par tekstilizstrādājumiem (piem., reciklēts saturs, pārstrādājamība, mehāniskās īpašības). @lv
comment: Ċertifikazzjonijiet li jivverifikaw speċifikament it-talbiet tat-tessuti tal-ESPR (eż. kontenut riċiklat, riċiklabbiltà, proprjetajiet mekkaniċi). @mt
comment: Certificeringen die specifiek de ESPR-textielclaims verifiëren (bijv. gerecycleerde inhoud, recyclebaarheid, mechanische eigenschappen). @nl
comment: Certyfikaty weryfikujące w szczególności oświadczenia dotyczące tekstyliów ESPR (np. zawartość materiałów z recyklingu, przydatność do recyklingu, właściwości mechaniczne). @pl
comment: Certificações que verificam especificamente as alegações da ESPR sobre os têxteis (por ex., conteúdo reciclado, reciclabilidade, propriedades mecânicas). @pt
comment: Certificări care verifică în mod specific mențiunile ESPR referitoare la textile (de ex. conținut reciclat, reciclabilitate, proprietăți mecanice). @ro
comment: Certifikácie výslovne overujúce tvrdenia ESPR o textile (napr. obsah recyklovaného materiálu, recyklovateľnosť, mechanické vlastnosti). @sk
comment: Certifikati, ki posebej preverjajo trditve ESPR o tekstilu (npr. vsebnost recikliranega materiala, možnost recikliranja, mehanske lastnosti). @sl
comment: Certifieringar som specifikt verifierar ESPR-textilpåståenden (t.ex. återvunnet innehåll, återvinningsbarhet, mekaniska egenskaper). @sv
governed by: ESPR DA of textiles
source: Source: ESPR - Article 7(2)(b), Annex I(a)
domain: Текстилен продукт
range: Certification
sub property of: hasCertification

Декларация за съответствие на ЕС
type: ObjectProperty
label: EU Declaration of Conformity @en
label: EU prohlášení o shodě @cs
label: EU-overensstemmelseserklæring @da
label: EU-Konformitätserklärung @de
label: Δήλωση συμμόρφωσης ΕΕ @el
label: Declaración UE de conformidad @es
label: ELi vastavusdeklaratsioon @et
label: EU-vaatimustenmukaisuusvakuutus @fi
label: Déclaration UE de conformité @fr
label: Dearbhú comhréireachta an AE @ga
label: EU izjava o sukladnosti @hr
label: EU-megfelelőségi nyilatkozat @hu
label: Dichiarazione di conformità UE @it
label: ES atitikties deklaracija @lt
label: ES atbilstības deklarācija @lv
label: Dikjarazzjoni ta' konformità tal-UE @mt
label: EU-conformiteitsverklaring @nl
label: Deklaracja zgodności UE @pl
label: Declaração UE de conformidade @pt
label: Declarația UE de conformitate @ro
label: EÚ vyhlásenie o zhode @sk
label: Izjava EU o skladnosti @sl
label: EU-försäkran om överensstämmelse @sv
comment: A reference to the EU Declaration of Conformity for the product. @en
comment: Позоваване на ЕС Декларацията за съответствие за продукта.
comment: Odkaz na EU prohlášení o shodě pro produkt. @cs
comment: En henvisning til EU-overensstemmelseserklæringen for produktet. @da
comment: Ein Verweis auf die EU-Konformitätserklärung für das Produkt. @de
comment: Αναφορά στη δήλωση συμμόρφωσης ΕΕ για το προϊόν. @el
comment: Una referencia a la Declaración UE de Conformidad para el producto. @es
comment: Viide toote ELi vastavusdeklaratsioonile. @et
comment: Viittaus tuotteen EU-vaatimustenmukaisuusvakuutukseen. @fi
comment: Une référence à la déclaration UE de conformité du produit. @fr
comment: Tagairt do Dhearbhú Comhréireachta an AE don táirge. @ga
comment: Upućivanje na EU izjavu o sukladnosti za proizvod. @hr
comment: Hivatkozás a termék EU-megfelelőségi nyilatkozatára. @hu
comment: Un riferimento alla Dichiarazione di conformità UE per il prodotto. @it
comment: Nuoroda į produkto ES atitikties deklaraciją. @lt
comment: Atsauce uz produkta ES atbilstības deklarāciju. @lv
comment: Referenza għad-Dikjarazzjoni ta' Konformità tal-UE għall-prodott. @mt
comment: Een verwijzing naar de EU-conformiteitsverklaring voor het product. @nl
comment: Odniesienie do deklaracji zgodności UE dla produktu. @pl
comment: Uma referência à Declaração UE de Conformidade para o produto. @pt
comment: O referință la Declarația UE de conformitate pentru produs. @ro
comment: Odkaz na EÚ vyhlásenie o zhode pre výrobok. @sk
comment: Sklic na izjavo EU o skladnosti za izdelek. @sl
comment: En hänvisning till EU-försäkran om överensstämmelse för produkten. @sv
visibility: AuthorityOnly
governed by: ESPR DA of textiles
source: Source: ESPR - Article 7(2)(b), Annex I(a)
domain: Текстилен продукт
range: RelatedResource

Въглероден отпечатък
type: DatatypeProperty
label: Carbon Footprint @en
label: Uhlíková stopa @cs
label: CO2-aftryk @da
label: CO2-Fußabdruck @de
label: Αποτύπωμα άνθρακα @el
label: Huella de carbono @es
label: Süsinikujalajälg @et
label: Hiilijalanjälki @fi
label: Empreinte carbone @fr
label: Lorg Carbóin @ga
label: Ugljični otisak @hr
label: Karbonlábnyom @hu
label: Impronta di carbonio @it
label: Anglies pėdsakas @lt
label: Oglekļa pēda @lv
label: Marka tal-karbonju @mt
label: Koolstofvoetafdruk @nl
label: Ślad węglowy @pl
label: Pegada de carbono @pt
label: Amprenta de carbon @ro
label: Ogljični odtis @sl
label: Koldioxidavtryck @sv
comment: The carbon footprint of the product. @en
comment: Въглеродният отпечатък на продукта.
comment: Uhlíková stopa produktu. @cs
comment: Produktets CO2-aftryk. @da
comment: Der CO2-Fußabdruck des Produkts. @de
comment: Το αποτύπωμα άνθρακα του προϊόντος. @el
comment: La huella de carbono del producto. @es
comment: Toote süsinikujalajälg. @et
comment: Tuotteen hiilijalanjälki. @fi
comment: L'empreinte carbone du produit. @fr
comment: Lorg carbóin an táirge. @ga
comment: Ugljični otisak proizvoda. @hr
comment: A termék karbonlábnyoma. @hu
comment: L'impronta di carbonio del prodotto. @it
comment: Produkto anglies pėdsakas. @lt
comment: Produkta oglekļa pēda. @lv
comment: Il-marka tal-karbonju tal-prodott. @mt
comment: De koolstofvoetafdruk van het product. @nl
comment: Ślad węglowy produktu. @pl
comment: A pegada de carbono do produto. @pt
comment: Amprenta de carbon a produsului. @ro
comment: Uhlíková stopa výrobku. @sk
comment: Ogljični odtis izdelka. @sl
comment: Produktens koldioxidavtryck. @sv
unit: kg CO₂ eq/kg
visibility: LegitimateInterestOrAuthority
governed by: PEFCR climate change category
source: Source: ESPR - Article 7(2)(b), Annex I(a)
domain: Текстилен продукт
range: double

Процент на еталонния въглероден отпечатък
type: DatatypeProperty
label: Carbon Footprint Benchmark Percentage @en
label: Referenční procento uhlíkové stopy @cs
label: Procentdel for benchmark af CO2-aftryk @da
label: Referenzprozentsatz des CO2-Fußabdrucks @de
label: Ποσοστό αναφοράς αποτυπώματος άνθρακα @el
label: Porcentaje de referencia de la huella de carbono @es
label: Süsinikujalajälje võrdlusprotsent @et
label: Hiilijalanjäljen vertailuprosentti @fi
label: Pourcentage de référence de l'empreinte carbone @fr
label: Céatadán Tagarmharc Lorga Carbóin @ga
label: Referentni postotak ugljičnog otiska @hr
label: Karbonlábnyom referencia-százalék @hu
label: Percentuale di riferimento dell'impronta di carbonio @it
label: Anglies pėdsako lyginamasis procentas @lt
label: Oglekļa pēdas etalona procentuālā daļa @lv
label: Perċentwal ta' Referenza tal-Marka tal-Karbonju @mt
label: Benchmarkpercentage koolstofvoetafdruk @nl
label: Wartość referencyjna śladu węglowego w procentach @pl
label: Percentagem de referência da pegada de carbono @pt
label: Procentul de referință al amprentei de carbon @ro
label: Referenčné percento uhlíkovej stopy @sk
label: Referenčni odstotek ogljičnega odtisa @sl
label: Referensprocent för koldioxidavtryck @sv
comment: The product's carbon footprint performance compared to the established benchmark, expressed as a percentage. @en
comment: Ефективността на въглеродния отпечатък на продукта в сравнение с установения еталон, изразена като процент.
comment: Výkonnost uhlíkové stopy produktu v porovnání se stanovenou referenční hodnotou, vyjádřená v procentech. @cs
comment: Produktets præstation for CO2-aftryk sammenlignet med det fastsatte benchmark, udtrykt som en procentdel. @da
comment: Die Leistung des CO2-Fußabdrucks des Produkts im Vergleich zum festgelegten Richtwert, ausgedrückt als Prozentsatz. @de
comment: Η επίδοση του αποτυπώματος άνθρακα του προϊόντος σε σύγκριση με το καθορισμένο σημείο αναφοράς, εκφραζόμενη ως ποσοστό. @el
comment: El rendimiento de la huella de carbono del producto en comparación con el punto de referencia establecido, expresado como porcentaje. @es
comment: Toote süsinikujalajälje toimivus võrreldes kehtestatud võrdlusalusega, väljendatuna protsentides. @et
comment: Tuotteen hiilijalanjäljen suorituskyky verrattuna vahvistettuun vertailuarvoon prosentteina ilmaistuna. @fi
comment: La performance de l'empreinte carbone du produit par rapport à l'indice de référence établi, exprimée en pourcentage. @fr
comment: Feidhmíocht lorg carbóin an táirge i gcomparáid leis an tagarmharc bunaithe, curtha in iúl mar chéatadán. @ga
comment: Učinak ugljičnog otiska proizvoda u usporedbi s utvrđenom referentnom vrijednošću, izražen kao postotak. @hr
comment: A termék karbonlábnyom-teljesítménye a megállapított referenciamutatóhoz viszonyítva, százalékban kifejezve. @hu
comment: Le prestazioni dell'impronta di carbonio del prodotto rispetto al parametro di riferimento stabilito, espresse in percentuale. @it
comment: Produkto anglies pėdsako veiksmingumas, palyginti su nustatytu lyginamuoju indeksu, išreikštas procentais. @lt
comment: Produkta oglekļa pēdas sniegums salīdzinājumā ar noteikto etalonu, izteikts procentos. @lv
comment: Il-prestazzjoni tal-impronta tal-karbonju tal-prodott meta mqabbla mal-parametru referenzjarju stabbilit, espressa bħala perċentwal. @mt
comment: De prestatie van de koolstofvoetafdruk van het product in vergelijking met de vastgestelde benchmark, uitgedrukt als een percentage. @nl
comment: Wydajność śladu węglowego produktu w porównaniu do ustalonego poziomu odniesienia, wyrażona w procentach. @pl
comment: O desempenho da pegada de carbono do produto em comparação com o valor de referência estabelecido, expresso em percentagem. @pt
comment: Performanța amprentei de carbon a produsului comparativ cu valoarea de referință stabilită, exprimată ca procent. @ro
comment: Výkonnosť uhlíkovej stopy výrobku v porovnaní so stanovenou referenčnou hodnotou, vyjadrená v percentách. @sk
comment: Uspešnost ogljičnega odtisa izdelka v primerjavi z določenim referenčnim merilom, izražena v odstotkih. @sl
comment: Produktens prestanda för koldioxidavtryck jämfört med det fastställda riktmärket, uttryckt i procent. @sv
unit: %
visibility: LegitimateInterestOrAuthority
governed by: PEFCR benchmark
source: Source: ESPR - Article 7(2)(b), Annex I(a)
domain: Текстилен продукт
range: double

Клас на въглеродния отпечатък
type: DatatypeProperty
label: Carbon Footprint Class @en
label: Třída uhlíkové stopy @cs
label: CO2-aftryksklasse @da
label: Klasse des CO2-Fußabdrucks @de
label: Κατηγορία αποτυπώματος άνθρακα @el
label: Clase de huella de carbono @es
label: Süsinikujalajälje klass @et
label: Hiilijalanjälkiluokka @fi
label: Classe d'empreinte carbone @fr
label: Aicme Lorg Carbóin @ga
label: Razred ugljičnog otiska @hr
label: Karbonlábnyom-osztály @hu
label: Classe di impronta di carbonio @it
label: Anglies pėdsako klasė @lt
label: Oglekļa pēdas klase @lv
label: Klassi tal-Marka tal-Karbonju @mt
label: Klasse koolstofvoetafdruk @nl
label: Klasa śladu węglowego @pl
label: Classe da pegada de carbono @pt
label: Clasa amprentei de carbon @ro
label: Trieda uhlíkovej stopy @sk
label: Razred ogljičnega odtisa @sl
label: Koldioxidavtrycksklass @sv
comment: The performance class of the product's carbon footprint. @en
comment: Класът на ефективност на въглеродния отпечатък на продукта.
comment: Třída výkonnosti uhlíkové stopy produktu. @cs
comment: Præstationsklassen for produktets CO2-aftryk. @da
comment: Die Leistungsklasse des CO2-Fußabdrucks des Produkts. @de
comment: Η κατηγορία επιδόσεων του αποτυπώματος άνθρακα του προϊόντος. @el
comment: La clase de rendimiento de la huella de carbono del producto. @es
comment: Toote süsinikujalajälje toimivusklass. @et
comment: Tuotteen hiilijalanjäljen suorituskykyluokka. @fi
comment: La classe de performance de l'empreinte carbone du produit. @fr
comment: Aicme feidhmíochta lorg carbóin an táirge. @ga
comment: Razred učinkovitosti ugljičnog otiska proizvoda. @hr
comment: A termék karbonlábnyomának teljesítményosztálya. @hu
comment: La classe di prestazione dell'impronta di carbonio del prodotto. @it
comment: Produkto anglies pėdsako veiksmingumo klasė. @lt
comment: Produkta oglekļa pēdas snieguma klase. @lv
comment: Il-klassi tal-prestazzjoni tal-marka tal-karbonju tal-prodott. @mt
comment: De prestatieklasse van de koolstofvoetafdruk van het product. @nl
comment: Klasa wydajności śladu węglowego produktu. @pl
comment: A classe de desempenho da pegada de carbono do produto. @pt
comment: Clasa de performanță a amprentei de carbon a produsului. @ro
comment: Trieda výkonnosti uhlíkovej stopy výrobku. @sk
comment: Razred uspešnosti ogljičnega odtisa izdelka. @sl
comment: Prestandaklassen för produktens koldioxidavtryck. @sv
unit: unitless
visibility: Public
governed by: PEFCR climate change impact category
source: Source: ESPR - Article 7(2)(b), Annex I(a)
domain: Текстилен продукт
range: integer

Отпечатък върху околната среда
type: DatatypeProperty
label: Environmental Footprint @en
label: Environmentální stopa @cs
label: Miljøaftryk @da
label: Umweltfußabdruck @de
label: Περιβαλλοντικό αποτύπωμα @el
label: Huella ambiental @es
label: Keskkonnajalajälg @et
label: Ympäristöjalanjälki @fi
label: Empreinte environnementale @fr
label: Lorg Comhshaoil @ga
label: Ekološki otisak @hr
label: Környezeti lábnyom @hu
label: Impronta ambientale @it
label: Aplinkosauginis pėdsakas @lt
label: Vides pēda @lv
label: Impronta Ambjentali @mt
label: Milieuvoetafdruk @nl
label: Ślad środowiskowy @pl
label: Pegada ambiental @pt
label: Amprenta de mediu @ro
label: Environmentálna stopa @sk
label: Okoljski odtis @sl
label: Miljöavtryck @sv
comment: The absolute value of the product's environmental footprint. @en
comment: Абсолютната стойност на отпечатъка върху околната среда на продукта.
comment: Absolutní hodnota environmentální stopy produktu. @cs
comment: Den absolutte værdi af produktets miljøaftryk. @da
comment: Der absolute Wert des Umweltfußabdrucks des Produkts. @de
comment: Η απόλυτη τιμή του περιβαλλοντικού αποτυπώματος του προϊόντος. @el
comment: El valor absoluto de la huella ambiental del producto. @es
comment: Toote keskkonnajalajälje absoluutväärtus. @et
comment: Tuotteen ympäristöjalanjäljen absoluuttinen arvo. @fi
comment: La valeur absolue de l'empreinte environnementale du produit. @fr
comment: Luach iomlán lorg comhshaoil ​​an táirge. @ga
comment: Apsolutna vrijednost ekološkog otiska proizvoda. @hr
comment: A termék környezeti lábnyomának abszolút értéke. @hu
comment: Il valore assoluto dell'impronta ambientale del prodotto. @it
comment: Absoliutinė produkto aplinkosauginio pėdsako vertė. @lt
comment: Produkta vidiskās pēdas absolūtā vērtība. @lv
comment: Il-valur assolut tal-impronta ambjentali tal-prodott. @mt
comment: De absolute waarde van de milieuvoetafdruk van het product. @nl
comment: Bezwzględna wartość śladu środowiskowego produktu. @pl
comment: O valor absoluto da pegada ambiental do produto. @pt
comment: Valoarea absolută a amprentei de mediu a produsului. @ro
comment: Absolútna hodnota environmentálnej stopy výrobku. @sk
comment: Absolutna vrednost okoljskega odtisa izdelka. @sl
comment: Det absoluta värdet av produktens miljöavtryck. @sv
unit: Pt / kg
visibility: LegitimateInterestOrAuthority
governed by: PEFCR single score
source: Source: ESPR - Article 7(2)(b), Annex I(a)
domain: Текстилен продукт
range: double

Процент на еталонния отпечатък върху околната среда
type: DatatypeProperty
label: Environmental Footprint Benchmark Percentage @en
label: Referenční procento environmentální stopy @cs
label: Procentdel for benchmark af miljøaftryk @da
label: Referenzprozentsatz des Umweltfußabdrucks @de
label: Ποσοστό αναφοράς περιβαλλοντικού αποτυπώματος @el
label: Porcentaje de referencia de la huella ambiental @es
label: Keskkonnajalajälje võrdlusprotsent @et
label: Ympäristöjalanjäljen vertailuprosentti @fi
label: Pourcentage de référence de l'empreinte environnementale @fr
label: Céatadán Tagarmharc Lorg Comhshaoil @ga
label: Referentni postotak ekološkog otiska @hr
label: Környezeti lábnyom referencia-százalék @hu
label: Percentuale di riferimento dell'impronta ambientale @it
label: Aplinkosauginio pėdsako lyginamasis procentas @lt
label: Vides pēdas etalona procentuālā daļa @lv
label: Perċentwal ta' Referenza tal-Impronta Ambjentali @mt
label: Benchmarkpercentage milieuvoetafdruk @nl
label: Wartość referencyjna śladu środowiskowego w procentach @pl
label: Percentagem de referência da pegada ambiental @pt
label: Procentul de referință al amprentei de mediu @ro
label: Referenčné percento environmentálnej stopy @sk
label: Referenčni odstotek okoljskega odtisa @sl
label: Referensprocent för miljöavtryck @sv
comment: The product's environmental footprint performance compared to the established benchmark, expressed as a percentage. @en
comment: Ефективността на отпечатъка върху околната среда на продукта в сравнение с установения еталон, изразена като процент.
comment: Výkonnost environmentální stopy produktu v porovnání se stanovenou referenční hodnotou, vyjádřená v procentech. @cs
comment: Produktets præstation for miljøaftryk sammenlignet med det fastsatte benchmark, udtrykt som en procentdel. @da
comment: Die Leistung des Umweltfußabdrucks des Produkts im Vergleich zum festgelegten Richtwert, ausgedrückt als Prozentsatz. @de
comment: Η επίδοση του περιβαλλοντικού αποτυπώματος του προϊόντος σε σύγκριση με το καθορισμένο σημείο αναφοράς, εκφραζόμενη ως ποσοστό. @el
comment: El rendimiento de la huella ambiental del producto en comparación con el punto de referencia establecido, expresado como porcentaje. @es
comment: Toote keskkonnajalajälje toimivus võrreldes kehtestatud võrdlusalusega, väljendatuna protsentides. @et
comment: Tuotteen ympäristöjalanjäljen suorituskyky verrattuna vahvistettuun vertailuarvoon prosentteina ilmaistuna. @fi
comment: La performance de l'empreinte environnementale du produit par rapport à l'indice de référence établi, exprimée en pourcentage. @fr
comment: Feidhmíocht lorg comhshaoil an táirge i gcomparáid leis an tagarmharc bunaithe, curtha in iúl mar chéatadán. @ga
comment: Učinak ekološkog otiska proizvoda u usporedbi s utvrđenom referentnom vrijednošću, izražen kao postotak. @hr
comment: A termék környezeti lábnyom-teljesítménye a megállapított referenciamutatóhoz viszonyítva, százalékban kifejezve. @hu
comment: Le prestazioni dell'impronta ambientale del prodotto rispetto al parametro di riferimento stabilito, espresse in percentuale. @it
comment: Produkto aplinkosauginio pėdsako veiksmingumas, palyginti su nustatytu lyginamuoju indeksu, išreikštas procentais. @lt
comment: Produkta vides pēdas sniegums salīdzinājumā ar noteikto etalonu, izteikts procentos. @lv
comment: Il-prestazzjoni tal-impronta ambjentali tal-prodott meta mqabbla mal-parametru referenzjarju stabbilit, espressa bħala perċentwal. @mt
comment: De prestatie van de milieuvoetafdruk van het product in vergelijking met de vastgestelde benchmark, uitgedrukt als een percentage. @nl
comment: Wydajność śladu środowiskowego produktu w porównaniu do ustalonego poziomu odniesienia, wyrażona w procentach. @pl
comment: O desempenho da pegada ambiental do produto em comparação com o valor de referência estabelecido, expresso em percentagem. @pt
comment: Performanța amprentei de mediu a produsului comparativ cu valoarea de referință stabilită, exprimată ca procent. @ro
comment: Výkonnosť environmentálnej stopy výrobku v porovnaní so stanovenou referenčnou hodnotou, vyjadrená v percentách. @sk
comment: Uspešnost okoljskega odtisa izdelka v primerjavi z določenim referenčnim merilom, izražena v odstotkih. @sl
comment: Produktens prestanda för miljöavtryck jämfört med det fastställda riktmärket, uttryckt i procent. @sv
unit: %
visibility: LegitimateInterestOrAuthority
governed by: PEFCR benchmark (single score)
source: Source: ESPR - Article 7(2)(b), Annex I(a)
domain: Текстилен продукт
range: double

Клас на екологичен отпечатък
type: DatatypeProperty
label: Environmental Footprint Class @en
label: Třída ekologické stopy @cs
label: Miljøaftryksklasse @da
label: Umweltfußabdruckklasse @de
label: Κλάση περιβαλλοντικού αποτυπώματος @el
label: Clase de Huella Ambiental @es
label: Keskkonnajalajälje klass @et
label: Ympäristöjalanjälkiluokka @fi
label: Classe d'empreinte environnementale @fr
label: Aicme Lorg Comhshaoil @ga
label: Klasa ekološkog otiska @hr
label: Környezeti lábnyom osztály @hu
label: Classe di impronta ambientale @it
label: Aplinkosauginio pėdsako klasė @lt
label: Vides pēdas nospieduma klase @lv
label: Klassi tal-impronta ambjentali @mt
label: Milieuvoetafdrukklasse @nl
label: Klasa śladu środowiskowego @pl
label: Classe de Pegada Ambiental @pt
label: Clasa de amprentă de mediu @ro
label: Trieda environmentálnej stopy @sk
label: Razred okoljskega odtisa @sl
label: Miljöavtrycksklass @sv
comment: The performance class of the product's environmental footprint. @en
comment: Класът на ефективност на екологичния отпечатък на продукта.
comment: Třída výkonnosti ekologické stopy produktu. @cs
comment: Ydelsesklassen for produktets miljøaftryk. @da
comment: Die Leistungsklasse des Umweltfußabdrucks des Produkts. @de
comment: Η κλάση απόδοσης του περιβαλλοντικού αποτυπώματος του προϊόντος. @el
comment: La clase de rendimiento de la huella ambiental del producto. @es
comment: Toote keskkonnajalajälje toimivusklass. @et
comment: Tuotteen ympäristöjalanjäljen suorituskykyluokka. @fi
comment: La classe de performance de l'empreinte environnementale du produit. @fr
comment: Aicme feidhmíochta lorg comhshaoil an táirge. @ga
comment: Klasa izvedbe ekološkog otiska proizvoda. @hr
comment: A termék környezeti lábnyomának teljesítményosztálya. @hu
comment: La classe di prestazione dell'impronta ambientale del prodotto. @it
comment: Produkto aplinkosauginio pėdsako veiksmingumo klasė. @lt
comment: Produkta vides pēdas nospieduma veiktspējas klase. @lv
comment: Il-klassi ta' prestazzjoni tal-impronta ambjentali tal-prodott. @mt
comment: De prestatieklasse van de milieuvoetafdruk van het product. @nl
comment: Klasa wydajności śladu środowiskowego produktu. @pl
comment: A classe de desempenho da pegada ambiental do produto. @pt
comment: Clasa de performanță a amprentei de mediu a produsului. @ro
comment: Trieda výkonnosti environmentálnej stopy produktu. @sk
comment: Razred učinkovitosti okoljskega odtisa izdelka. @sl
comment: Prestandaklassen för produktens miljöavtryck. @sv
unit: unitless
visibility: Public
governed by: PEFCR single score
source: Source: ESPR - Article 7(2)(b), Annex I(a)
domain: Текстилен продукт
range: integer

Тегло на текстила
type: DatatypeProperty
label: Textile Weight @en
label: Hmotnost textilie @cs
label: Tekstilvægt @da
label: Textilgewicht @de
label: Βάρος υφάσματος @el
label: Peso del Textil @es
label: Tekstiili kaal @et
label: Tekstiilin paino @fi
label: Poids du textile @fr
label: Meáchan Teicstíle @ga
label: Težina tekstila @hr
label: Textil súlya @hu
label: Peso del tessuto @it
label: Tekstilės svoris @lt
label: Tekstila svars @lv
label: Piż tat-Tessuti @mt
label: Textielgewicht @nl
label: Waga tekstyliów @pl
label: Peso do Têxtil @pt
label: Greutatea materialului textil @ro
label: Hmotnosť textílie @sk
label: Teža tekstila @sl
label: Textilvikt @sv
comment: The average final product weight including trims, in kilograms. @en
comment: Средното крайно тегло на продукта, включително гарнитурите, в килограми.
comment: Průměrná konečná hmotnost produktu včetně ozdob v kilogramech. @cs
comment: Den gennemsnitlige slutproduktvægt inklusive besætninger i kg. @da
comment: Das durchschnittliche Endproduktgewicht einschließlich Besätzen in Kilogramm. @de
comment: Το μέσο τελικό βάρος του προϊόντος συμπεριλαμβανομένων των διακοσμητικών, σε κιλά. @el
comment: El peso medio final del producto, incluidos los adornos, en kilogramos. @es
comment: Keskmine lõpptoote kaal koos kaunistustega kilodes. @et
comment: Keskimääräinen lopputuotteen paino koristeet mukaan lukien kilogrammoina. @fi
comment: Le poids moyen du produit final, y compris les garnitures, en kilogrammes. @fr
comment: Meánmheáchan an táirge deiridh lena n-áirítear baill mhaisiúcháin, i gcileagraim. @ga
comment: Prosječna konačna težina proizvoda, uključujući ukrase, u kilogramima. @hr
comment: A termék átlagos végső súlya a díszítésekkel együtt, kilogrammban. @hu
comment: Il peso medio del prodotto finale compresi i rifinimenti, in chilogrammi. @it
comment: Vidutinis galutinio produkto svoris įskaitant apdailą, kilogramais. @lt
comment: Vidējais galaprodukta svars, ieskaitot apdari, kilogramos. @lv
comment: Il-piż medju tal-prodott finali inklużi t-trims, f'kilogrammi. @mt
comment: Het gemiddelde eindgewicht van het product inclusief afwerking, in kilogram. @nl
comment: Średnia masa końcowa produktu wraz z wykończeniami w kilogramach. @pl
comment: O peso médio do produto final, incluindo os acabamentos, em quilogramas. @pt
comment: Greutatea medie a produsului final, inclusiv garniturile, în kilograme. @ro
comment: Priemerná konečná hmotnosť produktu vrátane ozdôb v kilogramoch. @sk
comment: Povprečna končna teža izdelka z obrobami v kilogramih. @sl
comment: Den genomsnittliga slutproduktvikten inklusive beslag, i kilo. @sv
unit: kg
visibility: Public
governed by: EN ISO 80000-1 / PEFCR
source: Source: ESPR - Article 7(2)(b), Annex I(a)
domain: Текстилен продукт
range: double

Параметри за изчисляване на въглеродния отпечатък
type: ObjectProperty
label: Carbon Footprint Calculation Parameters @en
label: Parametry výpočtu uhlíkové stopy @cs
label: Parametre for beregning af kulstofaftryk @da
label: Parameter zur Berechnung des CO2-Fußabdrucks @de
label: Παράμετροι υπολογισμού ανθρακικού αποτυπώματος @el
label: Parámetros de Cálculo de la Huella de Carbono @es
label: Süsinikujalajälje arvutamise parameetrid @et
label: Hiilijalanjäljen laskentaparametrit @fi
label: Paramètres de calcul de l'empreinte carbone @fr
label: Paraiméadair Ríomha Lorg Carbóin @ga
label: Parametri izračuna ugljičnog otiska @hr
label: Szénlábnyom számítási paraméterek @hu
label: Parametri di calcolo dell'impronta di carbonio @it
label: Anglies pėdsako skaičiavimo parametrai @lt
label: Oglekļa pēdas nospieduma aprēķināšanas parametri @lv
label: Parametri tal-Kalkolu tal-Impronta tal-Karbonju @mt
label: Berekeningsparameters voor koolstofvoetafdruk @nl
label: Parametry obliczania śladu węglowego @pl
label: Parâmetros de Cálculo da Pegada de Carbono @pt
label: Parametri de calcul a amprentei de carbon @ro
label: Parametre výpočtu uhlíkovej stopy @sk
label: Parametri za izračun ogljičnega odtisa @sl
label: Parametrar för beräkning av koldioxidavtryck @sv
comment: A reference to the document or resource describing the parameters used for the carbon footprint calculation. @en
comment: Справка към документа или ресурса, описващ параметрите, използвани за изчисляване на въглеродния отпечатък.
comment: Odkaz na dokument nebo zdroj popisující parametry použité pro výpočet uhlíkové stopy. @cs
comment: En reference til dokumentet eller ressourcen, der beskriver de parametre, der anvendes til beregning af kulstofaftryk. @da
comment: Ein Verweis auf das Dokument oder die Ressource, die die Parameter zur Berechnung des CO2-Fußabdrucks beschreibt. @de
comment: Παραπομπή στο έγγραφο ή στον πόρο που περιγράφει τις παραμέτρους που χρησιμοποιούνται για τον υπολογισμό του ανθρακικού αποτυπώματος. @el
comment: Una referencia al documento o recurso que describe los parámetros utilizados para el cálculo de la huella de carbono. @es
comment: Viide dokumendile või ressursile, mis kirjeldab süsinikujalajälje arvutamiseks kasutatud parameetreid. @et
comment: Viittaus asiakirjaan tai resurssiin, jossa kuvataan hiilijalanjäljen laskennassa käytetyt parametrit. @fi
comment: Une référence au document ou à la ressource décrivant les paramètres utilisés pour le calcul de l'empreinte carbone. @fr
comment: Tagairt don doiciméad nó acmhainn a chuireann síos ar na paraiméadair a úsáideadh do ríomh lorg carbóin. @ga
comment: Referenca na dokument ili resurs koji opisuje parametre korištene za izračun ugljičnog otiska. @hr
comment: Hivatkozás a szénlábnyom kiszámításához használt paramétereket leíró dokumentumra vagy erőforrásra. @hu
comment: Un riferimento al documento o alla risorsa che descrive i parametri utilizzati per il calcolo dell'impronta di carbonio. @it
comment: Nuoroda į dokumentą arba išteklių, kuriame aprašomi anglies pėdsako skaičiavimui naudojami parametrai. @lt
comment: Atsauce uz dokumentu vai resursu, kas apraksta oglekļa pēdas nospieduma aprēķināšanai izmantotos parametrus. @lv
comment: Referenza għad-dokument jew riżorsa li tiddeskrivi l-parametri użati għall-kalkolu tal-impronta tal-karbonju. @mt
comment: Een verwijzing naar het document of de bron die de parameters beschrijft die zijn gebruikt voor de berekening van de koolstofvoetafdruk. @nl
comment: Odniesienie do dokumentu lub zasobu opisującego parametry wykorzystane do obliczenia śladu węglowego. @pl
comment: Uma referência ao documento ou recurso que descreve os parâmetros utilizados para o cálculo da pegada de carbono. @pt
comment: O referință la documentul sau resursa care descrie parametrii utilizați pentru calcularea amprentei de carbon. @ro
comment: Odkaz na dokument alebo zdroj popisujúci parametre použité na výpočet uhlíkovej stopy. @sk
comment: Sklicevanje na dokument ali vir, ki opisuje parametre, uporabljene za izračun ogljičnega odtisa. @sl
comment: En hänvisning till det dokument eller den resurs som beskriver de parametrar som använts för beräkning av koldioxidavtrycket. @sv
visibility: LegitimateInterestOrAuthority
governed by: PEFCR
source: Source: ESPR - Article 7(2)(b), Annex I(a)
domain: Текстилен продукт
range: RelatedResource

Оценка за здравина
type: DatatypeProperty
label: Robustness Score @en
label: Skóre robustnosti @cs
label: Robusthedsscore @da
label: Robustheitsbewertung @de
label: Βαθμολογία ευρωστίας @el
label: Puntuación de Robustez @es
label: Tugevuse skoor @et
label: Vankkuuspisteet @fi
label: Score de robustesse @fr
label: Scór Stóinsithe @ga
label: Ocjena robusnosti @hr
label: Robusztussági pontszám @hu
label: Punteggio di robustezza @it
label: Tvirtumo balas @lt
label: Izturības rādītājs @lv
label: Punteġġ ta' Robustezza @mt
label: Robuustheidsscore @nl
label: Wynik wytrzymałości @pl
label: Pontuação de Robustez @pt
label: Scorul de robustețe @ro
label: Ocena robustnosti @sl
label: Robusthetspoäng @sv
comment: A numeric score representing the product's robustness (typically 0-10 scale). @en
comment: Цифрова оценка, представяща здравината на продукта (обикновено по скала от 0 до 10).
comment: Číselné skóre představující robustnost produktu (obvykle na stupnici 0-10). @cs
comment: En numerisk score, der repræsenterer produktets robusthed (typisk en skala fra 0-10). @da
comment: Eine numerische Bewertung, die die Robustheit des Produkts darstellt (normalerweise auf einer Skala von 0 bis 10). @de
comment: Μια αριθμητική βαθμολογία που αντιπροσωπεύει την ευρωστία του προϊόντος (συνήθως σε κλίμακα 0-10). @el
comment: Una puntuación numérica que representa la robustez del producto (generalmente en una escala de 0 a 10). @es
comment: Numbriline skoor, mis tähistab toote tugevust (tavaliselt skaalal 0-10). @et
comment: Numeerinen pistemäärä, joka edustaa tuotteen vankkuutta (yleensä asteikolla 0-10). @fi
comment: Un score numérique représentant la robustesse du produit (généralement sur une échelle de 0 à 10). @fr
comment: Scór uimhriúil a sheasann do stóinseacht an táirge (scála 0-10 de ghnáth). @ga
comment: Brojčana ocjena koja predstavlja robusnost proizvoda (obično na ljestvici od 0 do 10). @hr
comment: A termék robusztusságát jelző numerikus pontszám (általában 0-10 közötti skálán). @hu
comment: Un punteggio numerico che rappresenta la robustezza del prodotto (tipicamente su una scala da 0 a 10). @it
comment: Skaitinis balas, atspindintis produkto tvirtumą (paprastai 0–10 skalėje). @lt
comment: Skaitlisks rādītājs, kas atspoguļo produkta izturību (parasti skalā no 0 līdz 10). @lv
comment: Punteġġ numeriku li jirrappreżenta r-robustezza tal-prodott (tipikament skala 0-10). @mt
comment: Een numerieke score die de robuustheid van het product weergeeft (meestal op een schaal van 0-10). @nl
comment: Ocena liczbowa reprezentująca wytrzymałość produktu (zwykle w skali 0-10). @pl
comment: Uma pontuação numérica que representa a robustez do produto (normalmente em uma escala de 0 a 10). @pt
comment: Un scor numeric care reprezintă robustețea produsului (în mod normal, pe o scară de la 0 la 10). @ro
comment: Číselné skóre predstavujúce robustnosť produktu (zvyčajne na stupnici 0-10). @sk
comment: Številčna ocena, ki predstavlja robustnost izdelka (običajno na lestvici od 0 do 10). @sl
comment: Ett numeriskt betyg som representerar produktens robusthet (vanligtvis på en skala 0-10). @sv
unit: unitless
visibility: Public
governed by: ESPR DA of textiles
source: Source: ESPR - Article 7(2)(b), Annex I(a)
domain: Текстилен продукт
range: double

Оценка за рециклируемост
type: DatatypeProperty
label: Recyclability Score @en
label: Skóre recyklovatelnosti @cs
label: Genanvendelighedsscore @da
label: Recyclingfähigkeitsbewertung @de
label: Βαθμολογία ανακυκλωσιμότητας @el
label: Puntuación de Reciclabilidad @es
label: Ringlussevõetavuse skoor @et
label: Kierrätettävyyspisteet @fi
label: Score de recyclabilité @fr
label: Scór In-athchúrsáilte @ga
label: Ocjena reciklabilnosti @hr
label: Újrahasznosíthatósági pontszám @hu
label: Punteggio di riciclabilità @it
label: Perdirbamumo balas @lt
label: Pārstrādājamības rādītājs @lv
label: Punteġġ ta' Riċiklabbiltà @mt
label: Recyclebaarheidsscore @nl
label: Wynik recyklingu @pl
label: Pontuação de Reciclabilidade @pt
label: Scorul de reciclabilitate @ro
label: Skóre recyklovateľnosti @sk
label: Ocena možnosti recikliranja @sl
label: Återvinningsbarhetspoäng @sv
comment: A numeric score representing the product's recyclability (typically 0-10 scale). @en
comment: Цифрова оценка, представяща рециклируемостта на продукта (обикновено по скала от 0 до 10).
comment: Číselné skóre představující recyklovatelnost produktu (obvykle na stupnici 0-10). @cs
comment: En numerisk score, der repræsenterer produktets genanvendelighed (typisk en skala fra 0-10). @da
comment: Eine numerische Bewertung, die die Recyclingfähigkeit des Produkts darstellt (normalerweise auf einer Skala von 0 bis 10). @de
comment: Μια αριθμητική βαθμολογία που αντιπροσωπεύει την ανακυκλωσιμότητα του προϊόντος (συνήθως σε κλίμακα 0-10). @el
comment: Una puntuación numérica que representa la reciclabilidad del producto (generalmente en una escala de 0 a 10). @es
comment: Numbriline skoor, mis tähistab toote ringlussevõetavust (tavaliselt skaalal 0-10). @et
comment: Numeerinen pistemäärä, joka edustaa tuotteen kierrätettävyyttä (yleensä asteikolla 0-10). @fi
comment: Un score numérique représentant la recyclabilité du produit (généralement sur une échelle de 0 à 10). @fr
comment: Scór uimhriúil a sheasann d'in-athchúrsáilteacht an táirge (scála 0-10 de ghnáth). @ga
comment: Brojčana ocjena koja predstavlja reciklabilnost proizvoda (obično na ljestvici od 0 do 10). @hr
comment: A termék újrahasznosíthatóságát jelző numerikus pontszám (általában 0-10 közötti skálán). @hu
comment: Un punteggio numerico che rappresenta la riciclabilità del prodotto (tipicamente su una scala da 0 a 10). @it
comment: Skaitinis balas, atspindintis produkto perdirbamumą (paprastai 0–10 skalėje). @lt
comment: Skaitlisks rādītājs, kas atspoguļo produkta pārstrādājamību (parasti skalā no 0 līdz 10). @lv
comment: Punteġġ numeriku li jirrappreżenta r-riċiklabbiltà tal-prodott (tipikament skala 0-10). @mt
comment: Een numerieke score die de recyclebaarheid van het product weergeeft (meestal op een schaal van 0-10). @nl
comment: Ocena liczbowa reprezentująca zdolność produktu do recyklingu (zwykle w skali 0-10). @pl
comment: Uma pontuação numérica que representa a reciclabilidade do produto (normalmente em uma escala de 0 a 10). @pt
comment: Un scor numeric care reprezintă reciclabilitatea produsului (în mod normal, pe o scară de la 0 la 10). @ro
comment: Číselné skóre predstavujúce recyklovateľnosť produktu (zvyčajne na stupnici 0-10). @sk
comment: Številčna ocena, ki predstavlja možnost recikliranja izdelka (običajno na lestvici od 0 do 10). @sl
comment: Ett numeriskt betyg som representerar produktens återvinningsbarhet (vanligtvis på en skala 0-10). @sv
unit: unitless
visibility: Public
governed by: ESPR DA of textiles
source: Source: ESPR - Article 7(2)(b), Annex I(a)
domain: Текстилен продукт
range: double

Спиралност
type: DatatypeProperty
label: Spirality @en
label: Spirálivost @cs
label: Spiralitet @da
label: Spiralität @de
label: Σπειροειδής @el
label: Espiralidad @es
label: Spiraalsus @et
label: Spiraalisuus @fi
label: Spiralité @fr
label: Bíseachas @ga
label: Spiralnost @hr
label: Spirálisság @hu
label: Spiralità @it
label: Spirališkumas @lt
label: Spiralitāte @lv
label: Spiraliteit @nl
label: Spiralność @pl
label: Espiralidade @pt
label: Spiralitate @ro
label: Špirálovitosť @sk
comment: The measured spirality of the textile product. @en
comment: Измерената спиралност на текстилния продукт.
comment: Naměřená spirálivost textilního výrobku. @cs
comment: Den målte spiralitet af tekstilproduktet. @da
comment: Die gemessene Spiralität des Textilprodukts. @de
comment: Το μετρούμενο σπειροειδές του κλωστοϋφαντουργικού προϊόντος. @el
comment: La espiralidad medida del producto textil. @es
comment: Tekstiiltoote mõõdetud spiraalsus. @et
comment: Tekstiilituotteen mitattu spiraalisuus. @fi
comment: La spiralité mesurée du produit textile. @fr
comment: Bíseachas tomhaiste an táirge teicstíle. @ga
comment: Izmjerena spiralnost tekstilnog proizvoda. @hr
comment: A textiltermék mért spirálissága. @hu
comment: La spiralità misurata del prodotto tessile. @it
comment: Išmatuotas tekstilės gaminio spirališkumas. @lt
comment: Tekstila izstrādājuma izmērītā spiralitāte. @lv
comment: L-ispiralità mkejla tal-prodott tat-tessut. @mt
comment: De gemeten spiraliteit van het textielproduct. @nl
comment: Zmierzona spiralność wyrobu włókienniczego. @pl
comment: A espiralidade medida do produto têxtil. @pt
comment: Spiralitatea măsurată a produsului textil. @ro
comment: Nameraná špirálovitosť textilného výrobku. @sk
comment: Izmerjena spiralnost tekstilnega izdelka. @sl
comment: Den uppmätta spiraliteten hos textilprodukten. @sv
unit: %
visibility: Public
governed by: ISO 16322-3
source: Source: ESPR - Article 7(2)(b), Annex I(a)
domain: Текстилен продукт
range: double

Изменение на размерите
type: DatatypeProperty
label: Dimensional Change @en
label: Rozměrová změna @cs
label: Dimensionsændring @da
label: Maßänderung @de
label: Διαστατική αλλαγή @el
label: Cambio Dimensional @es
label: Mõõtmete muutus @et
label: Mittamuutos @fi
label: Changement dimensionnel @fr
label: Athrú Toiseach @ga
label: Dimenzionalna promjena @hr
label: Méretváltozás @hu
label: Variazione dimensionale @it
label: Matmenų pokytis @lt
label: Izmēru izmaiņas @lv
label: Bidla Dimensjonali @mt
label: Dimensionale verandering @nl
label: Zmiana wymiarowa @pl
label: Mudança Dimensional @pt
label: Modificarea dimensiunilor @ro
label: Rozmerová zmena @sk
label: Dimenzijska sprememba @sl
label: Dimensionsförändring @sv
comment: The dimensional change (shrinkage or expansion) after testing. @en
comment: Изменението на размерите (свиване или разширяване) след тестване.
comment: Rozměrová změna (srážení nebo rozpínání) po testování. @cs
comment: Dimensionsændringen (krympning eller udvidelse) efter testning. @da
comment: Die Maßänderung (Schrumpfung oder Dehnung) nach dem Testen. @de
comment: Η διαστατική αλλαγή (συρρίκνωση ή διαστολή) μετά τη δοκιμή. @el
comment: El cambio dimensional (contracción o expansión) después de la prueba. @es
comment: Mõõtmete muutus (kahanemine või paisumine) pärast testimist. @et
comment: Mittamuutos (kutistuminen tai laajeneminen) testauksen jälkeen. @fi
comment: Le changement dimensionnel (retrait ou expansion) après les essais. @fr
comment: An t-athrú toiseach (crapadh nó fairsingiú) tar éis tástála. @ga
comment: Dimenzionalna promjena (skupljanje ili širenje) nakon testiranja. @hr
comment: A méretváltozás (zsugorodás vagy tágulás) a tesztelés után. @hu
comment: La variazione dimensionale (restringimento o espansione) dopo i test. @it
comment: Matmenų pokytis (susitraukimas arba išsiplėtimas) po bandymo. @lt
comment: Izmēru izmaiņas (saraušanās vai izplešanās) pēc testēšanas. @lv
comment: Il-bidla dimensjonali (tiċkin jew espansjoni) wara l-ittestjar. @mt
comment: De dimensionale verandering (krimp of uitzetting) na het testen. @nl
comment: Zmiana wymiarowa (kurczenie się lub rozszerzanie) po testach. @pl
comment: A mudança dimensional (encolhimento ou expansão) após o teste. @pt
comment: Modificarea dimensională (contracție sau dilatare) după testare. @ro
comment: Rozmerová zmena (zmrštenie alebo expanzia) po testovaní. @sk
comment: Dimenzijska sprememba (krčenje ali raztezanje) po testiranju. @sl
comment: Dimensionsförändringen (krympning eller expansion) efter testning. @sv
unit: %
visibility: Public
governed by: ISO 3759
source: Source: ESPR - Article 7(2)(b), Annex I(a)
domain: Текстилен продукт
range: double

Резултат от визуална инспекция
type: DatatypeProperty
label: Visual Inspection Result @en
label: Výsledek vizuální kontroly @cs
label: Visuelt inspektionsresultat @da
label: Ergebnis der visuellen Inspektion @de
label: Αποτέλεσμα οπτικής επιθεώρησης @el
label: Resultado de Inspección Visual @es
label: Visuaalse kontrolli tulemus @et
label: Silmämääräisen tarkastuksen tulos @fi
label: Résultat de l'inspection visuelle @fr
label: Toradh Amharciniúchta @ga
label: Rezultat vizualnog pregleda @hr
label: Vizuális ellenőrzés eredménye @hu
label: Risultato dell'ispezione visiva @it
label: Vizualinio patikrinimo rezultatas @lt
label: Vizuālās pārbaudes rezultāts @lv
label: Riżultat ta' Spezzjoni Viżwali @mt
label: Visueel inspectieresultaat @nl
label: Wynik oględzin @pl
label: Resultado da Inspeção Visual @pt
label: Rezultatul inspecției vizuale @ro
label: Výsledok vizuálnej kontroly @sk
label: Rezultat vizualnega pregleda @sl
label: Visuellt inspektionsresultat @sv
comment: The result of the visual inspection (e.g. Pass/Fail or notes). @en
comment: Резултатът от визуалната инспекция (напр. Издържал/Неиздържал или бележки).
comment: Výsledek vizuální kontroly (např. Vyhovuje/Nevyhovuje nebo poznámky). @cs
comment: Resultatet af den visuelle inspektion (f.eks. Bestået/Ikke bestået eller noter). @da
comment: Das Ergebnis der visuellen Inspektion (z.B. Bestanden/Nicht bestanden oder Anmerkungen). @de
comment: Το αποτέλεσμα της οπτικής επιθεώρησης (π.χ. Επιτυχία/Αποτυχία ή σημειώσεις). @el
comment: El resultado de la inspección visual (por ejemplo, Aprobado/Reprobado o notas). @es
comment: Visuaalse kontrolli tulemus (nt Läbis/Ei läbinud või märkused). @et
comment: Silmämääräisen tarkastuksen tulos (esim. Hyväksytty/Hylätty tai huomautukset). @fi
comment: Le résultat de l'inspection visuelle (par ex. Réussite/Échec ou notes). @fr
comment: Toradh an amharciniúchta (m.sh. Pas/Teip nó nótaí). @ga
comment: Rezultat vizualnog pregleda (npr. Prošao/Nije prošao ili bilješke). @hr
comment: A vizuális ellenőrzés eredménye (pl. Megfelelt/Nem felelt meg vagy megjegyzések). @hu
comment: Il risultato dell'ispezione visiva (ad es. Superato/Fallito o note). @it
comment: Vizualinio patikrinimo rezultatas (pvz., Išlaikė/Neišlaikė arba pastabos). @lt
comment: Vizuālās pārbaudes rezultāts (piem., Nokārtots/Nenokārtots vai piezīmes). @lv
comment: Ir-riżultat tal-ispezzjoni viżwali (eż. Għadda/Ma Għaddiex jew noti). @mt
comment: Het resultaat van de visuele inspectie (bijv. Geslaagd/Gezakt of opmerkingen). @nl
comment: Wynik kontroli wizualnej (np. Zdał/Nie zdał lub uwagi). @pl
comment: O resultado da inspeção visual (por exemplo, Aprovado/Reprovado ou notas). @pt
comment: Rezultatul inspecției vizuale (de ex. Admis/Respins sau note). @ro
comment: Výsledok vizuálnej kontroly (napr. Vyhovel/Nevyhovel alebo poznámky). @sk
comment: Rezultat vizualnega pregleda (npr. Opravil/Ni opravil ali opombe). @sl
comment: Resultatet av den visuella inspektionen (t.ex. Godkänd/Underkänd eller anteckningar). @sv
visibility: Public
governed by: ISO 15487
source: Source: ESPR - Article 7(2)(b), Annex I(a)
domain: Текстилен продукт
range: string

Съдържа нетекстилни части от животински произход
type: DatatypeProperty
label: Contains Non-Textile Parts of Animal Origin @en
label: Obsahuje netextilní části živočišného původu @cs
label: Indeholder ikke-tekstildele af animalsk oprindelse @da
label: Enthält nichttextile Teile tierischen Ursprungs @de
label: Περιέχει μη κλωστοϋφαντουργικά μέρη ζωικής προέλευσης @el
label: Contiene Partes No Textiles de Origen Animal @es
label: Sisaldab loomse päritoluga mittetekstiilist osi @et
label: Sisältää eläinperäisiä ei-tekstiiliosia @fi
label: Contient des parties non textiles d'origine animale @fr
label: Go bhfuil Codanna Neamhtheicstíle de Bhunadh Ainmhíoch @ga
label: Sadrži netekstilne dijelove životinjskog podrijetla @hr
label: Állati eredetű nem textil részeket tartalmaz @hu
label: Contiene parti non tessili di origine animale @it
label: Sudėtyje yra gyvūninės kilmės ne tekstilės dalių @lt
label: Satur dzīvnieku izcelsmes netekstila daļas @lv
label: Fih Partijiet Mhux tat-Tessuti ta' Oriġini mill-Annimali @mt
label: Bevat niet-textieldelen van dierlijke oorsprong @nl
label: Zawiera nietekstylne części pochodzenia zwierzęcego @pl
label: Contém Partes Não Têxteis de Origem Animal @pt
label: Conține părți netextile de origine animală @ro
label: Obsahuje netextilné časti živočíšneho pôvodu @sk
label: Vsebuje netekstilne dele živalskega izvora @sl
label: Innehåller icke-textila delar av animaliskt ursprung @sv
comment: Indicates whether the product contains non-textile parts of animal origin, as required by the EU Textile Labelling Regulation. @en
comment: Посочва дали продуктът съдържа нетекстилни части от животински произход, както се изисква от Регламента на ЕС за етикетиране на текстил.
comment: Udává, zda výrobek obsahuje netextilní části živočišného původu, jak to vyžaduje nařízení EU o označování textilií. @cs
comment: Angiver, om produktet indeholder ikke-tekstildele af animalsk oprindelse, som krævet i EU's forordning om tekstilmærkning. @da
comment: Gibt an, ob das Produkt nichttextile Teile tierischen Ursprungs enthält, wie in der EU-Textilkennzeichnungsverordnung gefordert. @de
comment: Υποδεικνύει εάν το προϊόν περιέχει μη κλωστοϋφαντουργικά μέρη ζωικής προέλευσης, όπως απαιτείται από τον κανονισμό της ΕΕ για την επισήμανση των κλωστοϋφαντουργικών προϊόντων. @el
comment: Indica si el producto contiene partes no textiles de origen animal, como exige el Reglamento de Etiquetado de Textiles de la UE. @es
comment: Näitab, kas toode sisaldab loomse päritoluga mittetekstiilist osi, nagu on nõutud ELi tekstiilitoodete märgistamise määruses. @et
comment: Ilmoittaa, sisältääkö tuote eläinperäisiä ei-tekstiiliosia EU:n tekstiilien merkintäasetuksen mukaisesti. @fi
comment: Indique si le produit contient des parties non textiles d'origine animale, comme l'exige le règlement de l'UE sur l'étiquetage des textiles. @fr
comment: Léiríonn sé an bhfuil codanna neamhtheicstíle de bhunadh ainmhíoch sa táirge, mar a éilítear le Rialachán AE um Lipéadú Teicstíle. @ga
comment: Označava sadrži li proizvod netekstilne dijelove životinjskog podrijetla, kako to zahtijeva Uredba EU-a o označivanju tekstila. @hr
comment: Jelzi, hogy a termék tartalmaz-e állati eredetű nem textil részeket, ahogy azt az EU textilcímkézési rendelete megköveteli. @hu
comment: Indica se il prodotto contiene parti non tessili di origine animale, come richiesto dal regolamento UE sull'etichettatura dei prodotti tessili. @it
comment: Nurodo, ar gaminyje yra gyvūninės kilmės ne tekstilės dalių, kaip to reikalaujama ES tekstilės gaminių ženklinimo reglamente. @lt
comment: Norāda, vai produkts satur dzīvnieku izcelsmes netekstila daļas, kā to prasa ES tekstilizstrādājumu marķēšanas regula. @lv
comment: Jindika jekk il-prodott fihx partijiet mhux tat-tessuti ta' oriġini mill-annimali, kif meħtieġ mir-Regolament tal-UE dwar it-Tikkettar tat-Tessuti. @mt
comment: Geeft aan of het product niet-textieldelen van dierlijke oorsprong bevat, zoals vereist door de EU-verordening inzake textieletikettering. @nl
comment: Wskazuje, czy produkt zawiera nietekstylne części pochodzenia zwierzęcego, zgodnie z wymogami rozporządzenia UE w sprawie etykietowania wyrobów włókienniczych. @pl
comment: Indica se o produto contém partes não têxteis de origem animal, conforme exigido pelo Regulamento de Rotulagem Têxtil da UE. @pt
comment: Indică dacă produsul conține părți netextile de origine animală, așa cum prevede Regulamentul UE privind etichetarea textilelor. @ro
comment: Indikuje, či výrobok obsahuje netextilné časti živočíšneho pôvodu, ako si to vyžaduje nariadenie EÚ o označovaní textílií. @sk
comment: Označuje, ali izdelek vsebuje netekstilne dele živalskega izvora, kot to zahteva Uredba EU o označevanju tekstilnih izdelkov. @sl
comment: Anger om produkten innehåller icke-textila delar av animaliskt ursprung, enligt EU:s förordning om textilmärkning. @sv
visibility: Public
governed by: Textiles Labelling Regulation (EU) No 1007/2011
source: Source: ESPR - Annex III (a)
domain: Текстилен продукт
range: boolean

Екомаркировка на ЕС
type: DatatypeProperty
label: EU Ecolabel @en
label: Ekoznačka EU @cs
label: EU-miljømærke @da
label: EU-Ecolabel @de
label: Οικολογικό σήμα της ΕΕ @el
label: Etiqueta Ecológica de la UE @es
label: ELi ökomärgis @et
label: EU-ympäristömerkki @fi
label: Écolabel européen @fr
label: Éicilipéad an AE @ga
label: Znak zaštite okoliša EU-a @hr
label: EU ökocímke @hu
label: Ecolabel UE @it
label: ES ekologinis ženklas @lt
label: ES ekomarķējums @lv
label: Ekotikketta tal-UE @mt
label: EU-ecolabel @nl
label: Oznakowanie ekologiczne UE @pl
label: Rótulo Ecológico da UE @pt
label: Eticheta ecologică a UE @ro
label: Environmentálna značka EÚ @sk
label: Znak za okolje EU @sl
label: EU-miljömärke @sv
comment: Indicates whether the product has been awarded the EU Ecolabel. The label should be found in the certifications array as well, if present. @en
comment: Посочва дали продуктът е получил екомаркировката на ЕС. Етикетът трябва да се намира и в масива със сертификати, ако има такъв.
comment: Udává, zda byla produktu udělena ekoznačka EU. Tato značka by se měla nacházet také v poli certifikací, pokud je přítomna. @cs
comment: Angiver, om produktet er blevet tildelt EU-miljømærket. Mærket bør også findes i certificeringsarrayet, hvis det er til stede. @da
comment: Gibt an, ob das Produkt mit dem EU-Ecolabel ausgezeichnet wurde. Das Label sollte auch im Zertifizierungs-Array zu finden sein, falls vorhanden. @de
comment: Υποδεικνύει εάν το προϊόν έχει λάβει το Οικολογικό σήμα της ΕΕ. Η ετικέτα θα πρέπει να βρίσκεται επίσης στον πίνακα πιστοποιήσεων, εάν υπάρχει. @el
comment: Indica si el producto ha obtenido la Etiqueta Ecológica de la UE. La etiqueta también debe encontrarse en la matriz de certificaciones, si está presente. @es
comment: Näitab, kas tootele on antud ELi ökomärgis. See märgis peaks olema ka sertifikaatide massiivis, kui see on olemas. @et
comment: Ilmoittaa, onko tuotteelle myönnetty EU-ympäristömerkki. Merkin tulisi löytyä myös sertifiointitaulukosta, jos se on olemassa. @fi
comment: Indique si le produit a obtenu l'écolabel européen. L'étiquette doit également se trouver dans le tableau des certifications, le cas échéant. @fr
comment: Léiríonn sé an bhfuil Éicilipéad an AE bronnta ar an táirge. Ba cheart go mbeadh an lipéad le fáil san eagar deimhnithe freisin, más ann dó. @ga
comment: Označava je li proizvodu dodijeljen znak zaštite okoliša EU-a. Oznaka se također treba nalaziti u nizu certifikata, ako je prisutna. @hr
comment: Jelzi, hogy a termék megkapta-e az EU ökocímkét. A címkének a tanúsítványok tömbjében is szerepelnie kell, ha van. @hu
comment: Indica se il prodotto ha ottenuto l'Ecolabel UE. L'etichetta dovrebbe essere presente anche nell'array delle certificazioni, se presente. @it
comment: Nurodo, ar gaminiui suteiktas ES ekologinis ženklas. Jei yra, šis ženklas taip pat turėtų būti sertifikatų masyve. @lt
comment: Norāda, vai produktam ir piešķirts ES ekomarķējums. Šim marķējumam vajadzētu atrasties arī sertifikātu masīvā, ja tas ir pieejams. @lv
comment: Jindika jekk il-prodott ġiex mogħti l-Ekotikketta tal-UE. It-tikketta għandha tinstab ukoll fl-array taċ-ċertifikazzjonijiet, jekk preżenti. @mt
comment: Geeft aan of het product het EU-ecolabel heeft gekregen. Het label moet ook in de certificeringenarray te vinden zijn, indien aanwezig. @nl
comment: Wskazuje, czy produktowi przyznano oznakowanie ekologiczne UE. Etykieta ta powinna również znajdować się w tablicy certyfikatów, jeśli jest obecna. @pl
comment: Indica se o produto recebeu o Rótulo Ecológico da UE. O rótulo também deve ser encontrado na matriz de certificações, se presente. @pt
comment: Indică dacă produsului i-a fost acordată Eticheta ecologică a UE. Eticheta ar trebui să se găsească și în matricea de certificări, dacă este prezentă. @ro
comment: Indikuje, či výrobku bola udelená environmentálna značka EÚ. Táto značka by sa mala nachádzať aj v poli certifikácií, ak je prítomná. @sk
comment: Označuje, ali je bil izdelku podeljen znak za okolje EU. Ta znak bi moral biti tudi v polju certifikatov, če je prisoten. @sl
comment: Anger om produkten har tilldelats EU-miljömärket. Märket bör också finnas i certifieringsfältet, om sådant finns. @sv
visibility: Public
governed by: EU Ecolabel Certification
source: Source: ESPR - Article 7(2)(b), Annex I(a)
domain: Текстилен продукт
range: boolean

Тегло без гарнитури
type: DatatypeProperty
label: Weight Excluding Trims @en
label: Hmotnost bez ozdob @cs
label: Vægt eksklusiv besætninger @da
label: Gewicht ohne Besätze @de
label: Βάρος χωρίς διακοσμητικά @el
label: Peso Excluyendo Adornos @es
label: Kaal ilma kaunistusteta @et
label: Paino ilman koristeita @fi
label: Poids hors garnitures @fr
label: Meáchan Gan Bhaill Mhaisiúcháin a Áireamh @ga
label: Težina bez ukrasa @hr
label: Súly díszítések nélkül @hu
label: Peso esclusi i rifinimenti @it
label: Svoris be apdailos @lt
label: Svars bez apdares @lv
label: Piż Esklużi Trims @mt
label: Gewicht exclusief afwerking @nl
label: Waga bez wykończeń @pl
label: Peso Excluindo Acabamentos @pt
label: Greutate fără garnituri @ro
label: Hmotnosť bez ozdôb @sk
label: Teža brez obrob @sl
label: Vikt exklusive beslag @sv
comment: The weight of the product excluding non-textile trims (e.g. buttons, zippers), used as a base for calculations. @en
comment: Теглото на продукта без нетекстилни гарнитури (напр. копчета, ципове), използвано като база за изчисления.
comment: Hmotnost výrobku bez netextilních ozdob (např. knoflíky, zipy), používaná jako základ pro výpočty. @cs
comment: Produktets vægt eksklusiv ikke-tekstilbesætninger (f.eks. knapper, lynlåse), brugt som grundlag for beregninger. @da
comment: Das Gewicht des Produkts ohne nichttextile Besätze (z.B. Knöpfe, Reißverschlüsse), das als Grundlage für Berechnungen dient. @de
comment: Το βάρος του προϊόντος χωρίς τα μη κλωστοϋφαντουργικά διακοσμητικά (π.χ. κουμπιά, φερμουάρ), που χρησιμοποιείται ως βάση για υπολογισμούς. @el
comment: El peso del producto excluyendo los adornos no textiles (por ejemplo, botones, cremalleras), utilizado como base para cálculos. @es
comment: Toote kaal ilma mittetekstiilist kaunistusteta (nt nööbid, tõmblukud), mida kasutatakse arvutuste alusena. @et
comment: Tuotteen paino ilman ei-tekstiilikoristeita (esim. napit, vetoketjut), jota käytetään laskelmien perustana. @fi
comment: Le poids du produit à l'exclusion des garnitures non textiles (par ex. boutons, fermetures éclair), utilisé comme base de calcul. @fr
comment: Meáchan an táirge gan baill mhaisiúcháin neamhtheicstíle a áireamh (m.sh. cnaipí, zipeanna), a úsáidtear mar bhonn do ríomha. @ga
comment: Težina proizvoda isključujući netekstilne ukrase (npr. gumbe, patentne zatvarače), koja se koristi kao osnova za izračune. @hr
comment: A termék súlya a nem textil díszítések (pl. gombok, cipzárak) nélkül, számítások alapjául szolgál. @hu
comment: Il peso del prodotto esclusi i rifinimenti non tessili (ad es. bottoni, cerniere), utilizzato come base per i calcoli. @it
comment: Produkto svoris be ne tekstilės apdailos (pvz., sagų, užtrauktukų), naudojamas kaip skaičiavimų pagrindas. @lt
comment: Produkta svars bez netekstila apdares (piem., pogas, rāvējslēdzēji), ko izmanto kā pamatu aprēķiniem. @lv
comment: Il-piż tal-prodott esklużi t-trims mhux tat-tessuti (eż. buttuni, żippijiet), użat bħala bażi għall-kalkoli. @mt
comment: Het gewicht van het product exclusief niet-textiele afwerking (bijv. knopen, ritsen), gebruikt als basis voor berekeningen. @nl
comment: Masa produktu bez wykończeń nietekstylnych (np. guzików, zamków błyskawicznych), wykorzystywana jako podstawa do obliczeń. @pl
comment: O peso do produto excluindo acabamentos não têxteis (por exemplo, botões, zíperes), usado como base para cálculos. @pt
comment: Greutatea produsului fără garniturile netextile (de ex. nasturi, fermoare), utilizată ca bază pentru calcule. @ro
comment: Hmotnosť výrobku bez netextilných ozdôb (napr. gombíky, zipsy), ktorá sa používa ako základ pre výpočty. @sk
comment: Teža izdelka brez netekstilnih obrob (npr. gumbi, zadrge), ki se uporablja kot osnova za izračune. @sl
comment: Produktens vikt exklusive icke-textila beslag (t.ex. knappar, dragkedjor), som används som underlag för beräkningar. @sv
unit: kg
visibility: LegitimateInterestOrAuthority
governed by: EN ISO 80000-1
source: Source: ESPR - Annex III (a)
domain: Текстилен продукт
range: double

Процент на органично съдържание
type: DatatypeProperty
label: Organic Content Percentage @en
label: Procento organického obsahu @cs
label: Procentdel af organisk indhold @da
label: Prozentsatz des organischen Inhalts @de
label: Ποσοστό οργανικού περιεχομένου @el
label: Porcentaje de Contenido Orgánico @es
label: Orgaanilise sisu protsent @et
label: Orgaanisen sisällön prosenttiosuus @fi
label: Pourcentage de contenu organique @fr
label: Céatadán Ábhair Orgánaigh @ga
label: Postotak organskog sadržaja @hr
label: Szerves tartalom százaléka @hu
label: Percentuale di contenuto organico @it
label: Organinio turinio procentas @lt
label: Organiskā satura procentuālais daudzums @lv
label: Perċentwal ta' Kontenut Organiku @mt
label: Percentage organische inhoud @nl
label: Procent zawartości organicznej @pl
label: Porcentagem de Conteúdo Orgânico @pt
label: Procentajul conținutului organic @ro
label: Percento organického obsahu @sk
label: Odstotek organske vsebnosti @sl
label: Andel organiskt innehåll @sv
comment: The percentage of organic material in the product. @en
comment: Процентът на органичен материал в продукта.
comment: Procento organického materiálu v produktu. @cs
comment: Procentdelen af organisk materiale i produktet. @da
comment: Der Prozentsatz des organischen Materials im Produkt. @de
comment: Το ποσοστό του οργανικού υλικού στο προϊόν. @el
comment: El porcentaje de material orgánico en el producto. @es
comment: Orgaanilise materjali protsent tootes. @et
comment: Orgaanisen materiaalin prosenttiosuus tuotteessa. @fi
comment: Le pourcentage de matière organique dans le produit. @fr
comment: Céatadán an ábhair orgánaigh sa táirge. @ga
comment: Postotak organskog materijala u proizvodu. @hr
comment: A termékben lévő szerves anyag százalékos aránya. @hu
comment: La percentuale di materiale organico nel prodotto. @it
comment: Organinių medžiagų procentinė dalis gaminyje. @lt
comment: Organiskā materiāla procentuālais daudzums produktā. @lv
comment: Il-perċentwal ta' materjal organiku fil-prodott. @mt
comment: Het percentage organisch materiaal in het product. @nl
comment: Procentowa zawartość materiału organicznego w produkcie. @pl
comment: A porcentagem de material orgânico no produto. @pt
comment: Procentajul de material organic din produs. @ro
comment: Percento organického materiálu v produkte. @sk
comment: Odstotek organskega materiala v izdelku. @sl
comment: Procentandelen organiskt material i produkten. @sv
unit: %
visibility: Public
governed by: Organic Regulation (EU) 2018/848
source: Source: ESPR - Article 7(2)(b), Annex I(a)
domain: Текстилен продукт
range: double

Маса на органичното съдържание
type: DatatypeProperty
label: Organic Content Mass @en
label: Hmotnost organického obsahu @cs
label: Masse af organisk indhold @da
label: Masse des organischen Inhalts @de
label: Μάζα οργανικού περιεχομένου @el
label: Masa de Contenido Orgánico @es
label: Orgaanilise sisu mass @et
label: Orgaanisen sisällön massa @fi
label: Masse de contenu organique @fr
label: Mais Ábhair Orgánaigh @ga
label: Masa organskog sadržaja @hr
label: Szerves tartalom tömege @hu
label: Massa di contenuto organico @it
label: Organinio turinio masė @lt
label: Organiskā satura masa @lv
label: Massa ta' Kontenut Organiku @mt
label: Massa organische inhoud @nl
label: Masa zawartości organicznej @pl
label: Massa de Conteúdo Orgânico @pt
label: Masa conținutului organic @ro
label: Hmotnosť organického obsahu @sk
label: Masa organske vsebnosti @sl
label: Massa av organiskt innehåll @sv
comment: The absolute mass of organic material in the product. @en
comment: Абсолютната маса на органичния материал в продукта.
comment: Absolutní hmotnost organického materiálu v produktu. @cs
comment: Den absolutte masse af organisk materiale i produktet. @da
comment: Die absolute Masse des organischen Materials im Produkt. @de
comment: Η απόλυτη μάζα του οργανικού υλικού στο προϊόν. @el
comment: La masa absoluta de material orgánico en el producto. @es
comment: Orgaanilise materjali absoluutmass tootes. @et
comment: Tuotteen orgaanisen materiaalin absoluuttinen massa. @fi
comment: La masse absolue de matière organique dans le produit. @fr
comment: Mais iomlán an ábhair orgánaigh sa táirge. @ga
comment: Apsolutna masa organskog materijala u proizvodu. @hr
comment: A termékben lévő szerves anyag abszolút tömege. @hu
comment: La massa assoluta del materiale organico nel prodotto. @it
comment: Absoliuti organinių medžiagų masė gaminyje. @lt
comment: Absolūtā organiskā materiāla masa produktā. @lv
comment: Il-massa assoluta ta' materjal organiku fil-prodott. @mt
comment: De absolute massa organisch materiaal in het product. @nl
comment: Masa bezwzględna materiału organicznego w produkcie. @pl
comment: A massa absoluta do material orgânico no produto. @pt
comment: Masa absolută a materialului organic din produs. @ro
comment: Absolútna hmotnosť organického materiálu v produkte. @sk
comment: Absolutna masa organskega materiala v izdelku. @sl
comment: Den absoluta massan av organiskt material i produkten. @sv
unit: kg
visibility: LegitimateInterestOrAuthority
governed by: Organic Regulation (EU) 2018/848
source: Source: ESPR - Article 7(2)(b), Annex I(a)
domain: Текстилен продукт
range: double

Рециклирано съдържание преди потреблението
type: DatatypeProperty
label: Pre-consumer Recycled Content @en
label: Předspotřebitelský recyklovaný obsah @cs
label: Genbrugt indhold før forbrugerleddet @da
label: Pre-Consumer-Recyclinganteil @de
label: Ανακυκλωμένο περιεχόμενο πριν από την κατανάλωση @el
label: Contenido Reciclado Preconsumo @es
label: Tarbijaeelne ringlussevõetud sisu @et
label: Kuluttajaa edeltävä kierrätetty sisältö @fi
label: Contenu recyclé pré-consommation @fr
label: Ábhar Athchúrsáilte Réamhthomhaltóra @ga
label: Reciklirani sadržaj prije potrošnje @hr
label: Fogyasztás előtti újrahasznosított tartalom @hu
label: Contenuto riciclato pre-consumo @it
label: Prieš vartojimą perdirbtas turinys @lt
label: Pirms patērētāja pārstrādāts saturs @lv
label: Kontenut Riċiklat ta' Qabel il-Konsumatur @mt
label: Pre-consument gerecycled materiaal @nl
label: Zawartość z recyklingu przedkonsumenckiego @pl
label: Conteúdo Reciclado Pré-consumo @pt
label: Conținut reciclat pre-consumator @ro
label: Predspotrebiteľský recyklovaný obsah @sk
label: Reciklirana vsebina pred uporabo @sl
label: Återvunnet innehåll före konsumentledet @sv
comment: The percentage of pre-consumer recycled material in the product. @en
comment: Процентът на рециклирания материал преди потреблението в продукта.
comment: Procento předspotřebitelského recyklovaného materiálu v produktu. @cs
comment: Procentdelen af genbrugsmateriale fra før forbrugerleddet i produktet. @da
comment: Der Prozentsatz des Pre-Consumer-Recyclingmaterials im Produkt. @de
comment: Το ποσοστό του ανακυκλωμένου υλικού πριν από την κατανάλωση στο προϊόν. @el
comment: El porcentaje de material reciclado preconsumo en el producto. @es
comment: Tarbijaeelse ringlussevõetud materjali protsent tootes. @et
comment: Kuluttajaa edeltävän kierrätysmateriaalin prosenttiosuus tuotteessa. @fi
comment: Le pourcentage de matériau recyclé pré-consommation dans le produit. @fr
comment: Céatadán an ábhair athchúrsáilte réamhthomhaltóra sa táirge. @ga
comment: Postotak recikliranog materijala prije potrošnje u proizvodu. @hr
comment: A fogyasztás előtti újrahasznosított anyag százalékos aránya a termékben. @hu
comment: La percentuale di materiale riciclato pre-consumo nel prodotto. @it
comment: Prieš vartojimą perdirbtų medžiagų procentinė dalis gaminyje. @lt
comment: Pirms patērētāja pārstrādāta materiāla procentuālais daudzums produktā. @lv
comment: Il-perċentwal ta' materjal riċiklat qabel il-konsumatur fil-prodott. @mt
comment: Het percentage pre-consument gerecycled materiaal in het product. @nl
comment: Procentowa zawartość materiałów pochodzących z recyklingu przedkonsumenckiego w produkcie. @pl
comment: A porcentagem de material reciclado pré-consumo no produto. @pt
comment: Procentajul de material reciclat pre-consumator din produs. @ro
comment: Percento predspotrebiteľského recyklovaného materiálu v produkte. @sk
comment: Odstotek recikliranega materiala pred uporabo v izdelku. @sl
comment: Procentandelen återvunnet material före konsumentledet i produkten. @sv
unit: %
visibility: Public
governed by: ISO 14021:2016
source: Source: ESPR - Article 7(2)(b), Annex I(a)
domain: Текстилен продукт
range: double

Маса на рециклираното съдържание преди потреблението
type: DatatypeProperty
label: Pre-consumer Recycled Content Mass @en
label: Hmotnost předspotřebitelského recyklovaného obsahu @cs
label: Masse af genbrugt indhold før forbrugerleddet @da
label: Pre-Consumer-Recyclinganteil Masse @de
label: Μάζα ανακυκλωμένου περιεχομένου πριν από την κατανάλωση @el
label: Masa de Contenido Reciclado Preconsumo @es
label: Tarbijaeelse ringlussevõetud sisu mass @et
label: Kuluttajaa edeltävän kierrätetyn sisällön massa @fi
label: Masse de contenu recyclé pré-consommation @fr
label: Mais Ábhair Athchúrsáilte Réamhthomhaltóra @ga
label: Masa recikliranog sadržaja prije potrošnje @hr
label: Fogyasztás előtti újrahasznosított tartalom tömege @hu
label: Massa di contenuto riciclato pre-consumo @it
label: Prieš vartojimą perdirbto turinio masė @lt
label: Pirms patērētāja pārstrādāta satura masa @lv
label: Massa ta' Kontenut Riċiklat ta' Qabel il-Konsumatur @mt
label: Massa pre-consument gerecycled materiaal @nl
label: Masa zawartości z recyklingu przedkonsumenckiego @pl
label: Massa de Conteúdo Reciclado Pré-consumo @pt
label: Masa conținutului reciclat pre-consumator @ro
label: Hmotnosť predspotrebiteľského recyklovaného obsahu @sk
label: Masa reciklirane vsebine pred uporabo @sl
label: Massa av återvunnet innehåll före konsumentledet @sv
comment: The absolute mass of pre-consumer recycled material in the product. @en
comment: Абсолютната маса на рециклиран материал преди потреблението в продукта.
comment: Absolutní hmotnost předspotřebitelského recyklovaného materiálu v produktu. @cs
comment: Den absolutte masse af genbrugsmateriale fra før forbrugerleddet i produktet. @da
comment: Die absolute Masse des Pre-Consumer-Recyclingmaterials im Produkt. @de
comment: Η απόλυτη μάζα του ανακυκλωμένου υλικού πριν από την κατανάλωση στο προϊόν. @el
comment: La masa absoluta de material reciclado preconsumo en el producto. @es
comment: Tarbijaeelse ringlussevõetud materjali absoluutmass tootes. @et
comment: Kuluttajaa edeltävän kierrätysmateriaalin absoluuttinen massa tuotteessa. @fi
comment: La masse absolue de matériau recyclé pré-consommation dans le produit. @fr
comment: Mais iomlán an ábhair athchúrsáilte réamhthomhaltóra sa táirge. @ga
comment: Apsolutna masa recikliranog materijala prije potrošnje u proizvodu. @hr
comment: A fogyasztás előtti újrahasznosított anyag abszolút tömege a termékben. @hu
comment: La massa assoluta di materiale riciclato pre-consumo nel prodotto. @it
comment: Absoliuti prieš vartojimą perdirbtų medžiagų masė gaminyje. @lt
comment: Pirms patērētāja pārstrādāta materiāla absolūtā masa produktā. @lv
comment: Il-massa assoluta ta' materjal riċiklat qabel il-konsumatur fil-prodott. @mt
comment: De absolute massa van pre-consument gerecycled materiaal in het product. @nl
comment: Całkowita masa materiału pochodzącego z recyklingu przedkonsumenckiego w produkcie. @pl
comment: A massa absoluta de material reciclado pré-consumo no produto. @pt
comment: Masa absolută a materialului reciclat pre-consumator din produs. @ro
comment: Absolútna hmotnosť predspotrebiteľského recyklovaného materiálu v produkte. @sk
comment: Absolutna masa recikliranega materiala pred uporabo v izdelku. @sl
comment: Den absoluta massan av återvunnet material före konsumentledet i produkten. @sv
unit: kg
visibility: LegitimateInterestOrAuthority
governed by: ISO 14021:2016
source: Source: ESPR - Article 7(2)(b), Annex I(a)
domain: Текстилен продукт
range: double

Вид отпадък преди потреблението
type: DatatypeProperty
label: Pre-consumer Type of Waste @en
label: Typ předspotřebitelského odpadu @cs
label: Type affald før forbrugerleddet @da
label: Pre-Consumer-Abfallart @de
label: Τύπος απορριμμάτων πριν από την κατανάλωση @el
label: Tipo de Residuo Preconsumo @es
label: Tarbijaeelse jäätme tüüp @et
label: Kuluttajaa edeltävä jätetyyppi @fi
label: Type de déchets pré-consommation @fr
label: Cineál Dramhaíola Réamhthomhaltóra @ga
label: Vrsta otpada prije potrošnje @hr
label: Fogyasztás előtti hulladék típusa @hu
label: Tipo di rifiuto pre-consumo @it
label: Prieš vartojimą atsirandančių atliekų rūšis @lt
label: Pirms patērētāja atkritumu veids @lv
label: Tip ta' Skart Qabel il-Konsumatur @mt
label: Pre-consument type afval @nl
label: Rodzaj odpadów przedkonsumenckich @pl
label: Tipo de Resíduo Pré-consumo @pt
label: Tipul de deșeuri pre-consumator @ro
label: Typ predspotrebiteľského odpadu @sk
label: Vrsta odpadkov pred uporabo @sl
label: Typ av avfall före konsumentledet @sv
comment: The classification or source of the pre-consumer waste used for recycled content. @en
comment: Класификацията или източникът на отпадъка преди потреблението, използван за рециклирано съдържание.
comment: Klasifikace nebo zdroj předspotřebitelského odpadu použitého pro recyklovaný obsah. @cs
comment: Klassificeringen eller kilden til affaldet fra før forbrugerleddet, der anvendes til genbrugt indhold. @da
comment: Die Klassifizierung oder Herkunft des Pre-Consumer-Abfalls, der für den Recyclinganteil verwendet wird. @de
comment: Η ταξινόμηση ή η πηγή των απορριμμάτων πριν από την κατανάλωση που χρησιμοποιούνται για το ανακυκλωμένο περιεχόμενο. @el
comment: La clasificación o procedencia de los residuos preconsumo utilizados para el contenido reciclado. @es
comment: Ringlussevõetud sisuks kasutatud tarbijaeelse jäätme klassifikatsioon või allikas. @et
comment: Kierrätettyyn sisältöön käytetyn kuluttajaa edeltävän jätteen luokitus tai lähde. @fi
comment: La classification ou la source des déchets pré-consommation utilisés pour le contenu recyclé. @fr
comment: Aicmiú nó foinse na dramhaíola réamhthomhaltóra a úsáidtear don ábhar athchúrsáilte. @ga
comment: Klasifikacija ili izvor otpada prije potrošnje koji se koristi za reciklirani sadržaj. @hr
comment: Az újrahasznosított tartalomhoz felhasznált fogyasztás előtti hulladék besorolása vagy forrása. @hu
comment: La classificazione o la fonte del rifiuto pre-consumo utilizzato per il contenuto riciclato. @it
comment: Prieš vartojimą atsirandančių atliekų, naudojamų perdirbtam turiniui, klasifikacija arba šaltinis. @lt
comment: Pirms patērētāja atkritumu, kas izmantoti pārstrādātam saturam, klasifikācija vai avots. @lv
comment: Il-klassifikazzjoni jew sors tal-iskart qabel il-konsumatur użat għall-kontenut riċiklat. @mt
comment: De classificatie of bron van het pre-consument afval dat is gebruikt voor het gerecyclede materiaal. @nl
comment: Klasyfikacja lub źródło odpadów przedkonsumenckich wykorzystywanych do produkcji zawartości z recyklingu. @pl
comment: A classificação ou origem dos resíduos pré-consumo utilizados para conteúdo reciclado. @pt
comment: Clasificarea sau sursa deșeurilor pre-consumator utilizate pentru conținutul reciclat. @ro
comment: Klasifikácia alebo zdroj predspotrebiteľského odpadu použitého pre recyklovaný obsah. @sk
comment: Klasifikacija ali vir odpadkov pred uporabo, uporabljenih za reciklirano vsebino. @sl
comment: Klassificeringen eller källan till avfallet före konsumentledet som används för återvunnet innehåll. @sv
visibility: Public
governed by: ISO 14021:2016
source: Source: ESPR - Article 7(2)(b), Annex I(a)
domain: Текстилен продукт
range: string

Следпотребителско рециклирано съдържание
type: DatatypeProperty
label: Post-consumer Recycled Content @en
label: Pospotřebitelský recyklovaný obsah @cs
label: Genbrugt indhold efter forbrugerleddet @da
label: Post-Consumer-Recyclinganteil @de
label: Ανακυκλωμένο περιεχόμενο μετά την κατανάλωση @el
label: Contenido Reciclado Posconsumo @es
label: Tarbimisjärgne ringlussevõetud sisu @et
label: Kuluttajan jälkeinen kierrätetty sisältö @fi
label: Contenu recyclé post-consommation @fr
label: Ábhar Athchúrsáilte Iarthomhaltóra @ga
label: Reciklirani sadržaj nakon potrošnje @hr
label: Fogyasztás utáni újrahasznosított tartalom @hu
label: Contenuto riciclato post-consumo @it
label: Po vartojimo perdirbtas turinys @lt
label: Pēc patērētāja pārstrādāts saturs @lv
label: Kontenut Riċiklat wara l-Konsumatur @mt
label: Post-consument gerecycled materiaal @nl
label: Zawartość z recyklingu pokonsumenckiego @pl
label: Conteúdo Reciclado Pós-consumo @pt
label: Conținut reciclat post-consumator @ro
label: Pospotrebiteľský recyklovaný obsah @sk
label: Reciklirana vsebina po uporabi @sl
label: Återvunnet innehåll efter konsumentledet @sv
comment: The percentage of post-consumer recycled material in the product. @en
comment: Процентът на следпотребителски рециклиран материал в продукта.
comment: Procento pospotřebitelského recyklovaného materiálu v produktu. @cs
comment: Procentdelen af genbrugsmateriale fra efter forbrugerleddet i produktet. @da
comment: Der Prozentsatz des Post-Consumer-Recyclingmaterials im Produkt. @de
comment: Το ποσοστό του ανακυκλωμένου υλικού μετά την κατανάλωση στο προϊόν. @el
comment: El porcentaje de material reciclado posconsumo en el producto. @es
comment: Tarbimisjärgse ringlussevõetud materjali protsent tootes. @et
comment: Kuluttajan jälkeisen kierrätysmateriaalin prosenttiosuus tuotteessa. @fi
comment: Le pourcentage de matériau recyclé post-consommation dans le produit. @fr
comment: Céatadán an ábhair athchúrsáilte iarthomhaltóra sa táirge. @ga
comment: Postotak recikliranog materijala nakon potrošnje u proizvodu. @hr
comment: A fogyasztás utáni újrahasznosított anyag százalékos aránya a termékben. @hu
comment: La percentuale di materiale riciclato post-consumo nel prodotto. @it
comment: Po vartojimo perdirbtų medžiagų procentinė dalis gaminyje. @lt
comment: Pēc patērētāja pārstrādāta materiāla procentuālais daudzums produktā. @lv
comment: Il-perċentwal ta' materjal riċiklat wara l-konsumatur fil-prodott. @mt
comment: Het percentage post-consument gerecycled materiaal in het product. @nl
comment: Procentowa zawartość materiałów pochodzących z recyklingu pokonsumenckiego w produkcie. @pl
comment: A porcentagem de material reciclado pós-consumo no produto. @pt
comment: Procentajul de material reciclat post-consumator din produs. @ro
comment: Percento pospotrebiteľského recyklovaného materiálu v produkte. @sk
comment: Odstotek recikliranega materiala po uporabi v izdelku. @sl
comment: Procentandelen återvunnet material efter konsumentledet i produkten. @sv
unit: %
visibility: Public
governed by: ISO 14021:2016
source: Source: ESPR - Article 7(2)(b), Annex I(a)
domain: Текстилен продукт
range: double

Маса на рециклираното съдържание след потребление
type: DatatypeProperty
label: Post-consumer Recycled Content Mass @en
label: Hmotnost recyklovaného obsahu po spotřebiteli @cs
label: Masse af genanvendt indhold efter forbrug @da
label: Masse des recycelten Post-Consumer-Anteils @de
label: Μάζα ανακυκλωμένου περιεχομένου μετά την κατανάλωση @el
label: Masa del contenido reciclado posconsumo @es
label: Tarbimisjärgse ringlussevõetud sisu mass @et
label: Kuluttajakäytön jälkeisen kierrätetyn sisällön massa @fi
label: Masse du contenu recyclé post-consommation @fr
label: Mais Ábhar Athchúrsáilte Iar-thomhaltóra @ga
label: Masa recikliranog sadržaja nakon potrošnje @hr
label: Fogyasztás utáni újrahasznosított tartalom tömege @hu
label: Massa del contenuto riciclato post-consumo @it
label: Po vartojimo perdirbto turinio masė @lt
label: Pēc patēriņa pārstrādātā satura masa @lv
label: Massa tal-Kontenut Riċiklat wara l-Konsum @mt
label: Massa gerecyclede inhoud na consumptie @nl
label: Masa materiałów pochodzących z recyklingu poużytkowego @pl
label: Massa de conteúdo reciclado pós-consumo @pt
label: Masa conținutului reciclat post-consum @ro
label: Hmotnosť recyklovaného obsahu po spotrebiteľovi @sk
label: Masa reciklirane vsebine po uporabi @sl
label: Massa för återvunnet innehåll efter konsumentledet @sv
comment: The absolute mass of post-consumer recycled material in the product. @en
comment: Абсолютната маса на рециклирания материал след потребление в продукта.
comment: Absolutní hmotnost recyklovaného materiálu po spotřebiteli ve výrobku. @cs
comment: Den absolutte masse af genanvendt materiale efter forbrug i produktet. @da
comment: Die absolute Masse des recycelten Post-Consumer-Materials im Produkt. @de
comment: Η απόλυτη μάζα του ανακυκλωμένου υλικού μετά την κατανάλωση στο προϊόν. @el
comment: La masa absoluta de material reciclado posconsumo en el producto. @es
comment: Tootes sisalduva tarbimisjärgse ringlussevõetud materjali absoluutmass. @et
comment: Tuotteessa olevan kuluttajakäytön jälkeisen kierrätysmateriaalin absoluuttinen massa. @fi
comment: La masse absolue du matériau recyclé post-consommation dans le produit. @fr
comment: Mais iomlán an ábhair athchúrsáilte iar-thomhaltóra sa táirge. @ga
comment: Apsolutna masa recikliranog materijala nakon potrošnje u proizvodu. @hr
comment: A termékben lévő fogyasztás utáni újrahasznosított anyag abszolút tömege. @hu
comment: La massa assoluta di materiale riciclato post-consumo nel prodotto. @it
comment: Absoliuti po vartojimo perdirbtos medžiagos masė gaminyje. @lt
comment: Pēc patēriņa pārstrādātā materiāla absolūtā masa produktā. @lv
comment: Il-massa assoluta ta' materjal riċiklat wara l-konsum fil-prodott. @mt
comment: De absolute massa van gerecycled materiaal na consumptie in het product. @nl
comment: Bezwzględna masa materiału pochodzącego z recyklingu poużytkowego w produkcie. @pl
comment: A massa absoluta de material reciclado pós-consumo no produto. @pt
comment: Masa absolută a materialului reciclat post-consum din produs. @ro
comment: Absolútna hmotnosť recyklovaného materiálu po spotrebiteľovi vo výrobku. @sk
comment: Absolutna masa recikliranega materiala po uporabi v izdelku. @sl
comment: Den absoluta massan av återvunnet material efter konsumentledet i produkten. @sv
unit: kg
visibility: LegitimateInterestOrAuthority
governed by: ISO 14021:2016
source: Source: ESPR - Article 7(2)(b), Annex I(a)
domain: Текстилен продукт
range: double

Вид отпадъци след потребление
type: DatatypeProperty
label: Post-consumer Type of Waste @en
label: Typ odpadu po spotřebiteli @cs
label: Type affald efter forbrug @da
label: Art des Post-Consumer-Abfalls @de
label: Τύπος αποβλήτων μετά την κατανάλωση @el
label: Tipo de residuo posconsumo @es
label: Tarbimisjärgse jäätme tüüp @et
label: Kuluttajakäytön jälkeisen jätteen tyyppi @fi
label: Type de déchets post-consommation @fr
label: Cineál Dramhaíola Iar-thomhaltóra @ga
label: Vrsta otpada nakon potrošnje @hr
label: Fogyasztás utáni hulladék típusa @hu
label: Tipo di rifiuto post-consumo @it
label: Po vartojimo susidarančių atliekų tipas @lt
label: Pēc patēriņa atkritumu veids @lv
label: Tip ta' Skart wara l-Konsum @mt
label: Type afval na consumptie @nl
label: Rodzaj odpadów poużytkowych @pl
label: Tipo de resíduo pós-consumo @pt
label: Tipul de deșeuri post-consum @ro
label: Typ odpadu po spotrebiteľovi @sk
label: Vrsta odpadka po uporabi @sl
label: Typ av avfall efter konsumentledet @sv
comment: The classification or source of the post-consumer waste used for recycled content. @en
comment: Класификацията или източникът на отпадъците след потребление, използвани за рециклирано съдържание.
comment: Klasifikace nebo zdroj odpadu po spotřebiteli použitého pro recyklovaný obsah. @cs
comment: Klassificeringen af eller kilden til det affald efter forbrug, der anvendes til genanvendt indhold. @da
comment: Die Klassifizierung oder Quelle des Post-Consumer-Abfalls, der für recycelte Anteile verwendet wird. @de
comment: Η ταξινόμηση ή η πηγή των αποβλήτων μετά την κατανάλωση που χρησιμοποιούνται για το ανακυκλωμένο περιεχόμενο. @el
comment: La clasificación o fuente del residuo posconsumo utilizado para el contenido reciclado. @es
comment: Ringlussevõetud sisu jaoks kasutatud tarbimisjärgsete jäätmete klassifikatsioon või allikas. @et
comment: Kierrätetyn sisällön lähteenä käytetyn kuluttajakäytön jälkeisen jätteen luokitus tai lähde. @fi
comment: La classification ou la source des déchets post-consommation utilisés pour le contenu recyclé. @fr
comment: Aicmiú nó foinse na dramhaíola iar-thomhaltóra a úsáidtear don ábhar athchúrsáilte. @ga
comment: Klasifikacija ili izvor otpada nakon potrošnje upotrijebljenog za reciklirani sadržaj. @hr
comment: Az újrahasznosított tartalomhoz felhasznált fogyasztás utáni hulladék osztályozása vagy forrása. @hu
comment: La classificazione o fonte del rifiuto post-consumo utilizzato per il contenuto riciclato. @it
comment: Perdirbtam turiniui naudojamų po vartojimo susidarančių atliekų klasifikacija arba šaltinis. @lt
comment: Pārstrādātam saturam izmantoto pēc patēriņa atkritumu klasifikācija vai avots. @lv
comment: Il-klassifikazzjoni jew is-sors tal-iskart wara l-konsum użat għal kontenut riċiklat. @mt
comment: De classificatie of bron van het afval na consumptie dat is gebruikt voor gerecyclede inhoud. @nl
comment: Klasyfikacja lub źródło odpadów poużytkowych wykorzystanych do uzyskania materiałów pochodzących z recyklingu. @pl
comment: A classificação ou fonte do resíduo pós-consumo utilizado para o conteúdo reciclado. @pt
comment: Clasificarea sau sursa deșeurilor post-consum utilizate pentru conținutul reciclat. @ro
comment: Klasifikácia alebo zdroj odpadu po spotrebiteľovi použitého na recyklovaný obsah. @sk
comment: Klasifikacija ali vir odpadka po uporabi, uporabljenega za reciklirano vsebino. @sl
comment: Klassificeringen eller källan till det avfall efter konsumentledet som används för återvunnet innehåll. @sv
visibility: Public
governed by: ISO 14021:2016
source: Source: ESPR - Article 7(2)(b), Annex I(a)
domain: Текстилен продукт
range: string

Производствена стъпка
type: Class
label: Production Step @en
label: Výrobní krok @cs
label: Produktionstrin @da
label: Produktionsschritt @de
label: Βήμα παραγωγής @el
label: Etapa de producción @es
label: Tootmisetapp @et
label: Tuotantovaihe @fi
label: Étape de production @fr
label: Céim Táirgthe @ga
label: Proizvodni korak @hr
label: Gyártási lépés @hu
label: Fase di produzione @it
label: Gamybos etapas @lt
label: Ražošanas posms @lv
label: Pass tal-Produzzjoni @mt
label: Productiestap @nl
label: Etap produkcji @pl
label: Etapa de produção @pt
label: Etapa de producție @ro
label: Výrobný krok @sk
label: Korak proizvodnje @sl
label: Produktionssteg @sv
comment: A specific step in the manufacturing process of the product. @en
comment: Специфична стъпка в производствения процес на продукта.
comment: Konkrétní krok ve výrobním procesu produktu. @cs
comment: Et specifikt trin i fremstillingsprocessen for produktet. @da
comment: Ein spezifischer Schritt im Herstellungsprozess des Produkts. @de
comment: Ένα συγκεκριμένο βήμα στη διαδικασία κατασκευής του προϊόντος. @el
comment: Un paso específico en el proceso de fabricación del producto. @es
comment: Konkreetne etapp toote tootmisprotsessis. @et
comment: Tuotteen valmistusprosessin tietty vaihe. @fi
comment: Une étape spécifique dans le processus de fabrication du produit. @fr
comment: Céim shonrach i bpróiseas monaraíochta an táirge. @ga
comment: Određeni korak u proizvodnom procesu proizvoda. @hr
comment: A termék gyártási folyamatának egy meghatározott lépése. @hu
comment: Una fase specifica nel processo di fabbricazione del prodotto. @it
comment: Konkretus gaminio gamybos proceso etapas. @lt
comment: Konkrēts posms produkta ražošanas procesā. @lv
comment: Pass speċifiku fil-proċess tal-manifattura tal-prodott. @mt
comment: Een specifieke stap in het fabricageproces van het product. @nl
comment: Konkretny krok w procesie produkcji wyrobu. @pl
comment: Um passo específico no processo de fabrico do produto. @pt
comment: Un pas specific în procesul de fabricație al produsului. @ro
comment: Konkrétny krok vo výrobnom procese výrobku. @sk
comment: Poseben korak v procesu proizvodnje izdelka. @sl
comment: Ett specifikt steg i produktens tillverkningsprocess. @sv

Производствени стъпки
type: ObjectProperty
label: Production Steps @en
label: Výrobní kroky @cs
label: Produktionstrin @da
label: Produktionsschritte @de
label: Βήματα παραγωγής @el
label: Etapas de producción @es
label: Tootmisetapid @et
label: Tuotantovaiheet @fi
label: Étapes de production @fr
label: Céimeanna Táirgthe @ga
label: Proizvodni koraci @hr
label: Gyártási lépések @hu
label: Fasi di produzione @it
label: Gamybos etapai @lt
label: Ražošanas posmi @lv
label: Passi tal-Produzzjoni @mt
label: Productiestappen @nl
label: Etapy produkcji @pl
label: Etapas de produção @pt
label: Etape de producție @ro
label: Výrobné kroky @sk
label: Koraki proizvodnje @sl
label: Produktionssteg @sv
comment: The sequence of major production steps that occurred for this product. @en
comment: Последователността на основните производствени стъпки, които са се състояли за този продукт.
comment: Posloupnost hlavních výrobních kroků, ke kterým došlo u tohoto produktu. @cs
comment: Rækkefølgen af de vigtigste produktionstrin, der har fundet sted for dette produkt. @da
comment: Die Abfolge der wichtigsten Produktionsschritte, die für dieses Produkt durchgeführt wurden. @de
comment: Η ακολουθία των κύριων βημάτων παραγωγής που έλαβαν χώρα για αυτό το προϊόν. @el
comment: La secuencia de las principales etapas de producción que se llevaron a cabo para este producto. @es
comment: Selle toote puhul toimunud peamiste tootmisetappide järjestus. @et
comment: Tälle tuotteelle tehtyjen pääasiallisten tuotantovaiheiden järjestys. @fi
comment: La séquence des principales étapes de production qui ont eu lieu pour ce produit. @fr
comment: Seicheamh na bpríomhchéimeanna táirgthe a tharla don táirge seo. @ga
comment: Slijed glavnih proizvodnih koraka koji su se odvili za ovaj proizvod. @hr
comment: A termék esetében végbement főbb gyártási lépések sorrendje. @hu
comment: La sequenza delle principali fasi di produzione avvenute per questo prodotto. @it
comment: Šiam gaminiui atliktų pagrindinių gamybos etapų seka. @lt
comment: Šī produkta galveno ražošanas posmu secība. @lv
comment: Is-sekwenza tal-passi ewlenin tal-produzzjoni li seħħew għal dan il-prodott. @mt
comment: De volgorde van de belangrijkste productiestappen die hebben plaatsgevonden voor dit product. @nl
comment: Sekwencja głównych etapów produkcji, które miały miejsce w przypadku tego produktu. @pl
comment: A sequência de etapas de produção principais que ocorreram para este produto. @pt
comment: Secvența pașilor majori de producție care au avut loc pentru acest produs. @ro
comment: Postupnosť hlavných výrobných krokov, ku ktorým došlo v prípade tohto výrobku. @sk
comment: Zaporedje glavnih proizvodnih korakov, ki so se zgodili za ta izdelek. @sl
comment: Sekvensen av de viktigaste produktionsstegen som inträffade för denna produkt. @sv
visibility: AuthorityOnly
domain: Текстилен продукт
range: Производствена стъпка

Вид производствена стъпка
type: DatatypeProperty
label: Production Step Type @en
label: Typ výrobního kroku @cs
label: Type produktionstrin @da
label: Art des Produktionsschritts @de
label: Τύπος βήματος παραγωγής @el
label: Tipo de etapa de producción @es
label: Tootmisetapi tüüp @et
label: Tuotantovaiheen tyyppi @fi
label: Type d'étape de production @fr
label: Cineál Céime Táirgthe @ga
label: Vrsta proizvodnog koraka @hr
label: Gyártási lépés típusa @hu
label: Tipo di fase di produzione @it
label: Gamybos etapo tipas @lt
label: Ražošanas posma veids @lv
label: Tip ta' Pass tal-Produzzjoni @mt
label: Type productiestap @nl
label: Rodzaj etapu produkcji @pl
label: Tipo de etapa de produção @pt
label: Tip de etapă de producție @ro
label: Typ výrobného kroku @sk
label: Vrsta koraka proizvodnje @sl
label: Typ av produktionssteg @sv
comment: The type of activity performed (e.g., Spinning, Weaving, Dyeing). @en
comment: Видът на извършената дейност (напр. предене, тъкане, боядисване).
comment: Typ prováděné činnosti (např. předení, tkaní, barvení). @cs
comment: Den type aktivitet, der udføres (f.eks. spinding, vævning, farvning). @da
comment: Die Art der durchgeführten Tätigkeit (z. B. Spinnen, Weben, Färben). @de
comment: Το είδος της δραστηριότητας που εκτελείται (π.χ. κλώσιμο, ύφανση, βαφή). @el
comment: El tipo de actividad realizada (por ejemplo, hilado, tejido, teñido). @es
comment: Tehtud tegevuse liik (nt ketramine, kudumine, värvimine). @et
comment: Suoritetun toiminnan tyyppi (esim. kehräys, kudonta, värjäys). @fi
comment: Le type d'activité réalisée (par ex., filage, tissage, teinture). @fr
comment: An cineál gníomhaíochta a dhéantar (m.sh., Sníomh, Fíodóireacht, Ruaimniú). @ga
comment: Vrsta obavljene aktivnosti (npr. predenje, tkanje, bojenje). @hr
comment: A végzett tevékenység típusa (pl. fonás, szövés, festés). @hu
comment: Il tipo di attività svolta (ad es. filatura, tessitura, tintura). @it
comment: Atliktos veiklos tipas (pvz., verpimas, audimas, dažymas). @lt
comment: Veiktās darbības veids (piemēram, vērpšana, aušana, krāsošana). @lv
comment: It-tip ta' attività mwettqa (eż., Għażil, Insiġ, Żebgħa). @mt
comment: Het type activiteit dat is uitgevoerd (bijv. spinnen, weven, verven). @nl
comment: Rodzaj wykonywanej działalności (np. przędzenie, tkanie, farbowanie). @pl
comment: O tipo de atividade realizada (por exemplo, fiação, tecelagem, tingimento). @pt
comment: Tipul de activitate desfășurată (de ex., filare, țesere, vopsire). @ro
comment: Typ vykonávanej činnosti (napr. pradenie, tkanie, farbenie). @sk
comment: Vrsta izvedene dejavnosti (npr. predenje, tkanje, barvanje). @sl
comment: Typ av utförd aktivitet (t.ex. spinning, vävning, färgning). @sv
domain: Производствена стъпка
range: string

Държава на производственото местоположение
type: DatatypeProperty
label: Production Location Country @en
label: Země místa výroby @cs
label: Produktionsland @da
label: Land des Produktionsstandorts @de
label: Χώρα τοποθεσίας παραγωγής @el
label: País del lugar de producción @es
label: Tootmiskoha riik @et
label: Tuotantopaikan maa @fi
label: Pays du lieu de production @fr
label: Tír an tSuímh Táirgthe @ga
label: Zemlja lokacije proizvodnje @hr
label: Gyártás helyszínének országa @hu
label: Paese del luogo di produzione @it
label: Gamybos vietos šalis @lt
label: Ražošanas vietas valsts @lv
label: Pajjiż tal-Post tal-Produzzjoni @mt
label: Land van productielocatie @nl
label: Kraj miejsca produkcji @pl
label: País do local de produção @pt
label: Țara locației de producție @ro
label: Krajina miesta výroby @sk
label: Država lokacije proizvodnje @sl
label: Produktionsplatsens land @sv
comment: The country code (ISO 3166-1 alpha-3) where the production step took place. @en
comment: Кодът на държавата (ISO 3166-1 алфа-3), в която се е състояла производствената стъпка.
comment: Kód země (ISO 3166-1 alfa-3), kde výrobní krok proběhl. @cs
comment: Landekoden (ISO 3166-1 alfa-3) for det sted, hvor produktionstrinnet fandt sted. @da
comment: Der Ländercode (ISO 3166-1 alpha-3), in dem der Produktionsschritt stattfand. @de
comment: Ο κωδικός χώρας (ISO 3166-1 alpha-3) όπου πραγματοποιήθηκε το βήμα παραγωγής. @el
comment: El código de país (ISO 3166-1 alfa-3) donde se llevó a cabo la etapa de producción. @es
comment: Riigikood (ISO 3166-1 alpha-3), kus tootmisetapp toimus. @et
comment: Maakoodi (ISO 3166-1 alpha-3), jossa tuotantovaihe tapahtui. @fi
comment: Le code pays (ISO 3166-1 alpha-3) où l'étape de production a eu lieu. @fr
comment: An cód tíre (ISO 3166-1 alpha-3) inar tharla an chéim tháirgthe. @ga
comment: Oznaka zemlje (ISO 3166-1 alfa-3) u kojoj se odvio proizvodni korak. @hr
comment: Annak az országnak a kódja (ISO 3166-1 alpha-3), ahol a gyártási lépés zajlott. @hu
comment: Il codice del paese (ISO 3166-1 alpha-3) in cui si è svolta la fase di produzione. @it
comment: Šalies, kurioje vyko gamybos etapas, kodas (ISO 3166-1 alfa-3). @lt
comment: Valsts kods (ISO 3166-1 alfa-3), kurā norisinājās ražošanas posms. @lv
comment: Il-kodiċi tal-pajjiż (ISO 3166-1 alpha-3) fejn seħħ il-pass tal-produzzjoni. @mt
comment: De landcode (ISO 3166-1 alpha-3) waar de productiestap heeft plaatsgevonden. @nl
comment: Kod kraju (ISO 3166-1 alfa-3), w którym miał miejsce etap produkcji. @pl
comment: O código do país (ISO 3166-1 alfa-3) onde a etapa de produção ocorreu. @pt
comment: Codul țării (ISO 3166-1 alfa-3) unde a avut loc etapa de producție. @ro
comment: Kód krajiny (ISO 3166-1 alfa-3), v ktorej sa uskutočnil výrobný krok. @sk
comment: Koda države (ISO 3166-1 alpha-3), kjer se je zgodil korak proizvodnje. @sl
comment: Landskoden (ISO 3166-1 alpha-3) där produktionssteget ägde rum. @sv
domain: Производствена стъпка
range: string

Инструкции за грижа за текстила
type: ObjectProperty
label: Textile Care Instructions @en
label: Pokyny k péči o textil @cs
label: Anvisninger om tekstilpleje @da
label: Textilpflegehinweise @de
label: Οδηγίες φροντίδας υφασμάτων @el
label: Instrucciones de cuidado del tejido @es
label: Tekstiilihooldusjuhised @et
label: Tekstiilien hoito-ohjeet @fi
label: Instructions d'entretien des textiles @fr
label: Treoracha Cúraim Teicstíle @ga
label: Upute za njegu tekstila @hr
label: Textilápolási útmutató @hu
label: Istruzioni per la cura dei tessuti @it
label: Tekstilės priežiūros instrukcijos @lt
label: Tekstilizstrādājumu kopšanas norādījumi @lv
label: Istruzzjonijiet għall-Kura tat-Tessuti @mt
label: Onderhoudsinstructies voor textiel @nl
label: Instrukcja pielęgnacji wyrobów włókienniczych @pl
label: Instruções de cuidados com os têxteis @pt
label: Instrucțiuni de îngrijire a textilelor @ro
label: Pokyny na ošetrovanie textílií @sk
label: Navodila za nego tekstila @sl
label: Skötselråd för textil @sv
comment: Instructions and manuals for the care, washing, and maintenance of the textile product. @en
comment: Инструкции и ръководства за грижа, пране и поддръжка на текстилния продукт.
comment: Pokyny a návody pro péči, praní a údržbu textilního výrobku. @cs
comment: Anvisninger og manualer til pleje, vask og vedligeholdelse af tekstilproduktet. @da
comment: Anleitungen und Handbücher für die Pflege, das Waschen und die Wartung des Textilprodukts. @de
comment: Οδηγίες και εγχειρίδια για τη φροντίδα, το πλύσιμο και τη συντήρηση του κλωστοϋφαντουργικού προϊόντος. @el
comment: Instrucciones y manuales para el cuidado, lavado y mantenimiento del producto textil. @es
comment: Tekstiiltoote hoolduse, pesemise ja korrashoiu juhised ja käsiraamatud. @et
comment: Ohjeet ja käsikirjat tekstiilituotteen hoitoa, pesua ja ylläpitoa varten. @fi
comment: Instructions et manuels pour l'entretien, le lavage et la maintenance du produit textile. @fr
comment: Treoracha agus lámhleabhair maidir le cúram, níochán agus cothabháil an táirge teicstíle. @ga
comment: Upute i priručnici za njegu, pranje i održavanje tekstilnog proizvoda. @hr
comment: Útmutatók és kézikönyvek a textiltermék ápolásához, mosásához és karbantartásához. @hu
comment: Istruzioni e manuali per la cura, il lavaggio e la manutenzione del prodotto tessile. @it
comment: Tekstilės gaminio priežiūros, skalbimo ir techninės priežiūros instrukcijos ir vadovai. @lt
comment: Tekstilizstrādājuma kopšanas, mazgāšanas un uzturēšanas norādījumi un rokasgrāmatas. @lv
comment: Istruzzjonijiet u manwali għall-kura, il-ħasil, u l-manutenzjoni tal-prodott tat-tessut. @mt
comment: Instructies en handleidingen voor de verzorging, het wassen en het onderhoud van het textielproduct. @nl
comment: Instrukcje i podręczniki dotyczące pielęgnacji, prania i konserwacji wyrobu włókienniczego. @pl
comment: Instruções e manuais para o cuidado, lavagem e manutenção do produto têxtil. @pt
comment: Instrucțiuni și manuale pentru îngrijirea, spălarea și întreținerea produsului textil. @ro
comment: Pokyny a návody na ošetrovanie, pranie a údržbu textilného výrobku. @sk
comment: Navodila in priročniki za nego, pranje in vzdrževanje tekstilnega izdelka. @sl
comment: Anvisningar och manualer för skötsel, tvätt och underhåll av textilprodukten. @sv
governed by: Textiles Labelling Regulation (ISO 21600:2019)
source: Source: ESPR - Article 7(2)(b), Annex I(a)
domain: Текстилен продукт
range: RelatedResource
sub property of: careInstructions

Инструкции за безопасна употреба на текстил
type: ObjectProperty
label: Textile Safe Use Instructions @en
label: Pokyny pro bezpečné používání textilu @cs
label: Anvisninger om sikker brug af tekstiler @da
label: Anweisungen zur sicheren Verwendung von Textilien @de
label: Οδηγίες ασφαλούς χρήσης υφασμάτων @el
label: Instrucciones de uso seguro del tejido @es
label: Tekstiili ohutu kasutamise juhised @et
label: Tekstiilien turvallisen käytön ohjeet @fi
label: Instructions pour l'utilisation sûre des textiles @fr
label: Treoracha Úsáide Sábháilte Teicstíle @ga
label: Upute za sigurnu upotrebu tekstila @hr
label: Biztonságos textilhasználati útmutató @hu
label: Istruzioni per l'uso sicuro dei tessuti @it
label: Saugaus tekstilės naudojimo instrukcijos @lt
label: Norādījumi par tekstilizstrādājumu drošu lietošanu @lv
label: Istruzzjonijiet għall-Użu Sikur tat-Tessuti @mt
label: Instructies voor veilig gebruik van textiel @nl
label: Instrukcje bezpiecznego użytkowania wyrobów włókienniczych @pl
label: Instruções para o uso seguro de têxteis @pt
label: Instrucțiuni pentru utilizarea în siguranță a textilelor @ro
label: Pokyny na bezpečné používanie textílií @sk
label: Navodila za varno uporabo tekstila @sl
label: Anvisningar för säker användning av textilier @sv
comment: Instructions and guidelines for the safe use and maintenance of the textile product. @en
comment: Инструкции и насоки за безопасна употреба и поддръжка на текстилния продукт.
comment: Pokyny a směrnice pro bezpečné používání a údržbu textilního výrobku. @cs
comment: Anvisninger og retningslinjer for sikker brug og vedligeholdelse af tekstilproduktet. @da
comment: Anweisungen und Richtlinien für die sichere Verwendung und Pflege des Textilprodukts. @de
comment: Οδηγίες και κατευθυντήριες γραμμές για την ασφαλή χρήση και συντήρηση του κλωστοϋφαντουργικού προϊόντος. @el
comment: Instrucciones y directrices para el uso seguro y el mantenimiento del producto textil. @es
comment: Juhised ja suunised tekstiiltoote ohutuks kasutamiseks ja hooldamiseks. @et
comment: Ohjeet ja suuntaviivat tekstiilituotteen turvallista käyttöä ja kunnossapitoa varten. @fi
comment: Instructions et lignes directrices pour l'utilisation sûre et la maintenance du produit textile. @fr
comment: Treoracha agus treoirlínte d'úsáid agus cothabháil shábháilte an táirge teicstíle. @ga
comment: Upute i smjernice za sigurnu upotrebu i održavanje tekstilnog proizvoda. @hr
comment: Útmutatók és irányelvek a textiltermék biztonságos használatához és karbantartásához. @hu
comment: Istruzioni e linee guida per l'uso e la manutenzione sicuri del prodotto tessile. @it
comment: Tekstilės gaminio saugaus naudojimo ir priežiūros instrukcijos ir gairės. @lt
comment: Norādījumi un vadlīnijas par tekstilizstrādājuma drošu lietošanu un uzturēšanu. @lv
comment: Istruzzjonijiet u linji gwida għall-użu sikur u l-manutenzjoni tal-prodott tat-tessut. @mt
comment: Instructies en richtlijnen voor veilig gebruik en onderhoud van het textielproduct. @nl
comment: Instrukcje i wytyczne dotyczące bezpiecznego użytkowania i konserwacji wyrobu włókienniczego. @pl
comment: Instruções e diretrizes para o uso seguro e manutenção do produto têxtil. @pt
comment: Instrucțiuni și orientări pentru utilizarea și întreținerea în siguranță a produsului textil. @ro
comment: Pokyny a usmernenia na bezpečné používanie a údržbu textilného výrobku. @sk
comment: Navodila in smernice za varno uporabo in vzdrževanje tekstilnega izdelka. @sl
comment: Anvisningar och riktlinjer för säker användning och underhåll av textilprodukten. @sv
governed by: Best Practice
source: Source: ESPR - Article 7(2)(b), Annex I(a)
domain: Текстилен продукт
range: RelatedResource
sub property of: safeUseInstructions

Инструкции за края на жизнения цикъл на текстила
type: ObjectProperty
label: Textile End of Life Instructions @en
label: Pokyny pro konec životnosti textilu @cs
label: Anvisninger for udtjente tekstiler @da
label: Anweisungen für das Ende der Lebensdauer von Textilien @de
label: Οδηγίες για το τέλος του κύκλου ζωής των υφασμάτων @el
label: Instrucciones sobre el fin de vida del tejido @es
label: Tekstiili olelusringi lõpu juhised @et
label: Tekstiilin elinkaaren lopun ohjeet @fi
label: Instructions sur la fin de vie des textiles @fr
label: Treoracha ag Deireadh Ré na dTeicstílí @ga
label: Upute za kraj životnog vijeka tekstila @hr
label: Textil életciklusának végére vonatkozó utasítások @hu
label: Istruzioni per il fine vita dei tessuti @it
label: Tekstilės eksploatavimo pabaigos instrukcijos @lt
label: Tekstilizstrādājumu kalpošanas laika beigu norādījumi @lv
label: Istruzzjonijiet dwar it-Tmiem tal-Ħajja tat-Tessut @mt
label: Instructies voor het einde van de levensduur van textiel @nl
label: Instrukcje dotyczące zakończenia cyklu życia wyrobów włókienniczych @pl
label: Instruções de fim de vida dos têxteis @pt
label: Instrucțiuni privind sfârșitul ciclului de viață al textilelor @ro
label: Pokyny na konci životnosti textílií @sk
label: Navodila za konec življenjske dobe tekstila @sl
label: Anvisningar för uttjänta textilier @sv
comment: Instructions for the proper disassembly, recycling, or disposal of the textile product at the end of its life. @en
comment: Инструкции за правилното разглобяване, рециклиране или изхвърляне на текстилния продукт в края на жизнения му цикъл.
comment: Pokyny pro správnou demontáž, recyklaci nebo likvidaci textilního výrobku na konci jeho životnosti. @cs
comment: Anvisninger for korrekt demontering, genanvendelse eller bortskaffelse af tekstilproduktet ved slutningen af dets levetid. @da
comment: Anweisungen für die ordnungsgemäße Demontage, das Recycling oder die Entsorgung des Textilprodukts am Ende seiner Lebensdauer. @de
comment: Οδηγίες για τη σωστή αποσυναρμολόγηση, ανακύκλωση ή απόρριψη του κλωστοϋφαντουργικού προϊόντος στο τέλος της ζωής του. @el
comment: Instrucciones para el correcto desmontaje, reciclaje o eliminación del producto textil al final de su vida útil. @es
comment: Juhised tekstiiltoote nõuetekohaseks demonteerimiseks, ringlussevõtuks või kõrvaldamiseks selle olelusringi lõpus. @et
comment: Ohjeet tekstiilituotteen asianmukaiseen purkamiseen, kierrätykseen tai hävittämiseen sen elinkaaren lopussa. @fi
comment: Instructions pour le démontage, le recyclage ou l'élimination appropriés du produit textile à la fin de sa vie. @fr
comment: Treoracha maidir le díchóimeáil, athchúrsáil nó diúscairt cheart an táirge teicstíle ag deireadh a shaolré. @ga
comment: Upute za pravilno rastavljanje, recikliranje ili odlaganje tekstilnog proizvoda na kraju njegovog životnog vijeka. @hr
comment: Útmutatások a textiltermék életciklusának végén történő megfelelő szétszereléshez, újrahasznosításhoz vagy ártalmatlanításhoz. @hu
comment: Istruzioni per il corretto smontaggio, riciclaggio o smaltimento del prodotto tessile alla fine del suo ciclo di vita. @it
comment: Tinkamo tekstilės gaminio išardymo, perdirbimo ar šalinimo pasibaigus jo eksploatavimo laikui instrukcijos. @lt
comment: Norādījumi par tekstilizstrādājuma pareizu demontāžu, pārstrādi vai apglabāšanu tā kalpošanas laika beigās. @lv
comment: Istruzzjonijiet għaż-żarmar, ir-riċiklaġġ jew ir-rimi xieraq tal-prodott tat-tessut fi tmiem ħajtu. @mt
comment: Instructies voor de juiste demontage, recycling of verwijdering van het textielproduct aan het einde van zijn levensduur. @nl
comment: Instrukcje dotyczące prawidłowego demontażu, recyklingu lub utylizacji wyrobu włókienniczego po zakończeniu jego cyklu życia. @pl
comment: Instruções para a desmontagem, reciclagem ou eliminação adequada do produto têxtil no fim da sua vida útil. @pt
comment: Instrucțiuni pentru dezasamblarea, reciclarea sau eliminarea corespunzătoare a produsului textil la sfârșitul duratei sale de viață. @ro
comment: Pokyny na správnu demontáž, recykláciu alebo likvidáciu textilného výrobku na konci jeho životnosti. @sk
comment: Navodila za pravilno razstavljanje, recikliranje ali odstranjevanje tekstilnega izdelka ob koncu njegove življenjske dobe. @sl
comment: Anvisningar för korrekt demontering, återvinning eller bortskaffande av textilprodukten i slutet av dess livslängd. @sv
governed by: Best Practice
source: Source: ESPR - Article 7(2)(b), Annex I(a)
domain: Текстилен продукт
range: RelatedResource
sub property of: endOfLifeInstructions

Инструкции за ремонт на текстил
type: ObjectProperty
label: Textile Repair Instructions @en
label: Pokyny k opravě textilu @cs
label: Anvisninger om reparation af tekstiler @da
label: Reparaturanleitungen für Textilien @de
label: Οδηγίες επισκευής υφασμάτων @el
label: Instrucciones de reparación de tejidos @es
label: Tekstiili parandamise juhised @et
label: Tekstiilien korjausohjeet @fi
label: Instructions de réparation des textiles @fr
label: Treoracha Deisiúcháin Teicstíle @ga
label: Upute za popravak tekstila @hr
label: Textiljavítási útmutató @hu
label: Istruzioni per la riparazione dei tessuti @it
label: Tekstilės taisymo instrukcijos @lt
label: Tekstilizstrādājumu labošanas norādījumi @lv
label: Istruzzjonijiet dwar it-Tiswija tat-Tessuti @mt
label: Reparatie-instructies voor textiel @nl
label: Instrukcje naprawy wyrobów włókienniczych @pl
label: Instruções de reparação de têxteis @pt
label: Instrucțiuni de reparare a textilelor @ro
label: Pokyny na opravu textílií @sk
label: Navodila za popravilo tekstila @sl
label: Reparationsanvisningar för textil @sv
comment: Instructions on how to repair or replace components of the textile product. @en
comment: Инструкции как да се ремонтират или заменят компоненти на текстилния продукт.
comment: Pokyny, jak opravit nebo vyměnit součásti textilního výrobku. @cs
comment: Anvisninger i, hvordan man reparerer eller udskifter komponenter i tekstilproduktet. @da
comment: Anweisungen zur Reparatur oder zum Austausch von Komponenten des Textilprodukts. @de
comment: Οδηγίες σχετικά με τον τρόπο επισκευής ή αντικατάστασης εξαρτημάτων του κλωστοϋφαντουργικού προϊόντος. @el
comment: Instrucciones sobre cómo reparar o sustituir los componentes del producto textil. @es
comment: Juhised selle kohta, kuidas parandada või asendada tekstiiltoote komponente. @et
comment: Ohjeet tekstiilituotteen osien korjaamiseen tai vaihtamiseen. @fi
comment: Instructions sur la façon de réparer ou de remplacer les composants du produit textile. @fr
comment: Treoracha maidir le conas comhpháirteanna den táirge teicstíle a dheisiú nó a athsholáthar. @ga
comment: Upute o tome kako popraviti ili zamijeniti komponente tekstilnog proizvoda. @hr
comment: Útmutatás a textiltermék alkatrészeinek javításához vagy cseréjéhez. @hu
comment: Istruzioni su come riparare o sostituire i componenti del prodotto tessile. @it
comment: Instrukcijos, kaip taisyti ar keisti tekstilės gaminio komponentus. @lt
comment: Norādījumi par tekstilizstrādājuma sastāvdaļu labošanu vai nomaiņu. @lv
comment: Istruzzjonijiet dwar kif jissewwew jew jinbidlu komponenti tal-prodott tat-tessut. @mt
comment: Instructies voor het repareren of vervangen van onderdelen van het textielproduct. @nl
comment: Instrukcje dotyczące sposobów naprawy lub wymiany elementów wyrobu włókienniczego. @pl
comment: Instruções sobre como reparar ou substituir componentes do produto têxtil. @pt
comment: Instrucțiuni privind modul de reparare sau înlocuire a componentelor produsului textil. @ro
comment: Pokyny, ako opraviť alebo vymeniť komponenty textilného výrobku. @sk
comment: Navodila za popravilo ali zamenjavo sestavnih delov tekstilnega izdelka. @sl
comment: Anvisningar om hur man reparerar eller byter ut komponenter i textilprodukten. @sv
governed by: Best Practice
source: Source: ESPR - Article 7(2)(b), Annex I(a)
domain: Текстилен продукт
range: RelatedResource
sub property of: repairInstructions

Влакнест състав
type: ObjectProperty
label: Fibre Composition @en
label: Složení vláken @cs
label: Fibersammensætning @da
label: Faserzusammensetzung @de
label: Σύνθεση ινών @el
label: Composición de las fibras @es
label: Kiuline koostis @et
label: Kuitukoostumus @fi
label: Composition fibreuse @fr
label: Comhdhéanamh Snáithíneach @ga
label: Sastav vlakana @hr
label: Szálösszetétel @hu
label: Composizione fibrosa @it
label: Pluošto sudėtis @lt
label: Šķiedru sastāvs @lv
label: Kompożizzjoni tal-Fibri @mt
label: Vezelsamenstelling @nl
label: Skład surowcowy @pl
label: Composição das fibras @pt
label: Compoziția fibrelor @ro
label: Zloženie vlákien @sk
label: Sestava vlaken @sl
label: Fibersammansättning @sv
comment: Relates the textile product to its constituent fibres and their proportions. @en
comment: Свързва текстилния продукт с съставящите го влакна и техните пропорции.
comment: Vztahuje se na textilní výrobek z hlediska jeho základních vláken a jejich poměrů. @cs
comment: Knytter tekstilproduktet til dets indgående fibre og deres proportioner. @da
comment: Setzt das Textilprodukt mit seinen Bestandteilsfasern und deren Anteilen in Beziehung. @de
comment: Συσχετίζει το κλωστοϋφαντουργικό προϊόν με τις συστατικές του ίνες και τις αναλογίες τους. @el
comment: Relaciona el producto textil con sus fibras constituyentes y sus proporciones. @es
comment: Seostab tekstiiltoodet selle koostiskiudude ja nende proportsioonidega. @et
comment: Liittää tekstiilituotteen sen muodostaviin kuituihin ja niiden osuuksiin. @fi
comment: Relie le produit textile à ses fibres constitutives et à leurs proportions. @fr
comment: Nascann sé an táirge teicstíle lena shnáithíní comhpháirteacha agus a gcionmhaireachtaí. @ga
comment: Povezuje tekstilni proizvod s njegovim sastavnim vlaknima i njihovim omjerima. @hr
comment: Összekapcsolja a textilterméket az azt alkotó szálakkal és azok arányaival. @hu
comment: Mette in relazione il prodotto tessile con le sue fibre costituenti e le loro proporzioni. @it
comment: Sieja tekstilės gaminį su jį sudarančiais pluoštais ir jų proporcijomis. @lt
comment: Saista tekstilizstrādājumu ar to veidojošajām šķiedrām un to proporcijām. @lv
comment: Tqabbad il-prodott tat-tessut mal-fibri kostitwenti tiegħu u l-proporzjonijiet tagħhom. @mt
comment: Relateert het textielproduct aan zijn samenstellende vezels en de verhoudingen daarvan. @nl
comment: Odnosi wyrób włókienniczy do jego włókien składowych i ich proporcji. @pl
comment: Relaciona o produto têxtil com as suas fibras constituintes e as respetivas proporções. @pt
comment: Corelează produsul textil cu fibrele sale constitutive și proporțiile acestora. @ro
comment: Vzťahuje textilný výrobok na jeho základné vlákna a ich pomery. @sk
comment: Povezuje tekstilni izdelek s sestavnimi vlakni in njihovimi deleži. @sl
comment: Relaterar textilprodukten till dess ingående fibrer och deras proportioner. @sv
governed by: Textiles Labelling Regulation (EU) No 1007/2011
source: Source: ESPR - Article 7(2)(b), Annex I(a)
domain: Текстилен продукт
range: Component

Текстилни вещества, пораждащи безпокойство
type: ObjectProperty
label: Textile Substances of Concern @en
label: Textilní látky vzbuzující obavy @cs
label: Tekstil problematiske stoffer @da
label: Besorgniserregende Stoffe in Textilien @de
label: Ουσίες ανησυχίας στα υφάσματα @el
label: Sustancias preocupantes en los tejidos @es
label: Tekstiilis sisalduvad ohtlikud ained @et
label: Tekstiilien huolta aiheuttavat aineet @fi
label: Substances préoccupantes dans les textiles @fr
label: Substaintí is Údar Imní i dTeicstílí @ga
label: Zabrinjavajuće tvari u tekstilu @hr
label: Különös aggodalomra okot adó textilanyagok @hu
label: Sostanze problematiche nei tessuti @it
label: Tekstilės susirūpinimą keliančios medžiagos @lt
label: Tekstilizstrādājumos esošās vielas, kas rada bažas @lv
label: Sustanzi ta' Tħassib fit-Tessuti @mt
label: Zorgwekkende stoffen in textiel @nl
label: Substancje wzbudzające obawy w wyrobach włókienniczych @pl
label: Substâncias que suscitam preocupação nos têxteis @pt
label: Substanțe care prezintă motive de îngrijorare în textile @ro
label: Textilné látky vzbudzujúce obavy @sk
label: Snovi, ki zbujajo skrb, v tekstilu @sl
label: Särskilt farliga ämnen i textilier @sv
comment: Substances of concern present in the textile product. @en
comment: Вещества, пораждащи безпокойство, присъстващи в текстилния продукт.
comment: Látky vzbuzující obavy přítomné v textilním výrobku. @cs
comment: Problematiske stoffer til stede i tekstilproduktet. @da
comment: Im Textilprodukt enthaltene besorgniserregende Stoffe. @de
comment: Ουσίες ανησυχίας που υπάρχουν στο κλωστοϋφαντουργικό προϊόν. @el
comment: Sustancias preocupantes presentes en el producto textil. @es
comment: Tekstiiltootes esinevad ohtlikud ained. @et
comment: Tekstiilituotteessa olevat huolta aiheuttavat aineet. @fi
comment: Substances préoccupantes présentes dans le produit textile. @fr
comment: Substaintí is údar imní atá i láthair sa táirge teicstíle. @ga
comment: Zabrinjavajuće tvari prisutne u tekstilnom proizvodu. @hr
comment: A textiltermékben jelen lévő, különös aggodalomra okot adó anyagok. @hu
comment: Sostanze problematiche presenti nel prodotto tessile. @it
comment: Tekstilės gaminyje esančios susirūpinimą keliančios medžiagos. @lt
comment: Tekstilizstrādājumā klātesošās vielas, kas rada bažas. @lv
comment: Sustanzi ta' tħassib preżenti fil-prodott tat-tessut. @mt
comment: Zorgwekkende stoffen die aanwezig zijn in het textielproduct. @nl
comment: Substancje wzbudzające obawy obecne w wyrobie włókienniczym. @pl
comment: Substâncias que suscitam preocupação presentes no produto têxtil. @pt
comment: Substanțe care prezintă motive de îngrijorare prezente în produsul textil. @ro
comment: Látky vzbudzujúce obavy prítomné v textilnom výrobku. @sk
comment: Snovi, ki zbujajo skrb, prisotne v tekstilnem izdelku. @sl
comment: Särskilt farliga ämnen som finns i textilprodukten. @sv
governed by: REACH / ESPR
source: Source: ESPR - Article 7(2)(b), Annex I(a)
domain: Текстилен продукт
range: Component
sub property of: substancesOfConcern