EPDIndicators.jsonld
type: Ontology
imports: Product.jsonld
imports: EPDMetadata.jsonld
imports: EPDLifecycle.jsonld
description: Defines the specific environmental impact indicators used in Environmental Product Declarations.

Indicator
type: ObjectProperty
label: Показател @bg
label: Ukazatel @cs
label: Indikator @da
label: Δείκτης @el
label: Indicador @es
label: Indikaator @et
label: Indikaattori @fi
label: Indicateur @fr
label: Pokazatelj @hr
label: Indikátor @hu
label: Indicatore @it
label: Rodiklis @lt
label: Rādītājs @lv
label: Indikatur @mt
label: Wskaźnik @pl
label: Ukazovateľ @sk
label: Kazalnik @sl
label: Táscaire @ga
comment: A generic property representing an environmental impact indicator.
comment: Общо свойство, представляващо показател за въздействие върху околната среда. @bg
comment: Obecná vlastnost představující ukazatel dopadu na životní prostředí. @cs
comment: En generisk egenskab, der repræsenterer en miljøpåvirkningsindikator. @da
comment: Eine generische Eigenschaft, die einen Umweltwirkungsindikator darstellt. @de
comment: Μια γενική ιδιότητα που αντιπροσωπεύει έναν δείκτη περιβαλλοντικών επιπτώσεων. @el
comment: Una propiedad genérica que representa un indicador de impacto ambiental. @es
comment: Üldine omadus, mis esindab keskkonnamõju indikaatorit. @et
comment: Yleinen ominaisuus, joka edustaa ympäristövaikutusindikaattoria. @fi
comment: Une propriété générique représentant un indicateur d'impact environnemental. @fr
comment: Generičko svojstvo koje predstavlja pokazatelj utjecaja na okoliš. @hr
comment: Egy általános tulajdonság, amely egy környezeti hatásmutatót képvisel. @hu
comment: Una proprietà generica che rappresenta un indicatore di impatto ambientale. @it
comment: Bendroji savybė, reiškianti poveikio aplinkai rodiklį. @lt
comment: Vispārīga īpašība, kas atspoguļo ietekmes uz vidi rādītāju. @lv
comment: Proprjetà ġenerika li tirrappreżenta indikatur tal-impatt ambjentali. @mt
comment: Een generieke eigenschap die een milieueffectindicator vertegenwoordigt. @nl
comment: Właściwość ogólna reprezentująca wskaźnik wpływu na środowisko. @pl
comment: Uma propriedade genérica que representa um indicador de impacto ambiental. @pt
comment: O proprietate generică reprezentând un indicator de impact asupra mediului. @ro
comment: Všeobecná vlastnosť predstavujúca ukazovateľ vplyvu na životné prostredie. @sk
comment: Splošna lastnost, ki predstavlja kazalnik vpliva na okolje. @sl
comment: En generisk egenskap som representerar en miljöpåverkansindikator. @sv
comment: Airí ginearálta a léiríonn táscaire tionchair comhshaoil. @ga
domain: EPDBlock
term status: unstable

Global Warming Potential
type: ObjectProperty
label: Потенциал за глобално затопляне @bg
label: Potenciál globálního oteplování @cs
label: Global opvarmningspotentiale @da
label: Globales Erwärmungspotential @de
label: Δυναμικό Παγκόσμιας Θέρμανσης @el
label: Potencial de calentamiento global @es
label: Globaalse soojenemise potentsiaal @et
label: Ilmaston lämmitysvaikutuspotentiaali @fi
label: Potentiel de réchauffement global @fr
label: Potencijal globalnog zagrijavanja @hr
label: Globális felmelegedési potenciál @hu
label: Potenziale di riscaldamento globale @it
label: Globalinio atšilimo potencialas @lt
label: Globālās sasilšanas potenciāls @lv
label: Potenzjal ta' sħana globali @mt
label: Global warming potential @nl
label: Potencjał tworzenia efektu cieplarnianego @pl
label: Potencial de aquecimento global @pt
label: Potențial de încălzire globală @ro
label: Potenciál globálneho otepľovania @sk
label: Potencial globalnega segrevanja @sl
label: Global uppvärmningspotential @sv
label: Féidearthacht Teasa Domhanda @ga
unit: kg CO₂ eq
governed by: EN 15804:2012+A2:2019
sub property of: Indicator
domain: EPDBlock
range: ImpactValues
comment: Global Warming Potential
comment: Потенциал за глобално затопляне @bg
comment: Potenciál globálního oteplování @cs
comment: Global opvarmningspotentiale @da
comment: Globales Erwärmungspotential @de
comment: Δυναμικό Παγκόσμιας Θέρμανσης @el
comment: Potencial de calentamiento global @es
comment: Globaalse soojenemise potentsiaal @et
comment: Ilmaston lämmitysvaikutuspotentiaali @fi
comment: Potentiel de réchauffement global @fr
comment: Potencijal globalnog zagrijavanja @hr
comment: Globális felmelegedési potenciál @hu
comment: Potenziale di riscaldamento globale @it
comment: Globalinio atšilimo potencialas @lt
comment: Globālās sasilšanas potenciāls @lv
comment: Potenzjal ta' sħana globali @mt
comment: Global warming potential @nl
comment: Potencjał tworzenia efektu cieplarnianego @pl
comment: Potencial de aquecimento global @pt
comment: Potențial de încălzire globală @ro
comment: Potenciál globálneho otepľovania @sk
comment: Potencial globalnega segrevanja @sl
comment: Global uppvärmningspotential @sv
comment: Féidearthacht Teasa Domhanda @ga
term status: unstable

Global Warming Potential, Fossil
type: ObjectProperty
label: Потенциал за глобално затопляне, изкопаеми горива @bg
label: Potenciál globálního oteplování, fosilní @cs
label: Global opvarmningspotentiale, fossilt @da
label: Globales Erwärmungspotential, fossile Quellen @de
label: Δυναμικό Παγκόσμιας Θέρμανσης, ορυκτά καύσιμα @el
label: Potencial de calentamiento global, fósil @es
label: Globaalse soojenemise potentsiaal, fossiilne @et
label: Ilmaston lämmitysvaikutuspotentiaali, fossiilinen @fi
label: Potentiel de réchauffement global, fossile @fr
label: Potencijal globalnog zagrijavanja, fosilni @hr
label: Globális felmelegedési potenciál, fosszilis @hu
label: Potenziale di riscaldamento globale, fossile @it
label: Globalinio atšilimo potencialas, fosilinis @lt
label: Globālās sasilšanas potenciāls, fosilais @lv
label: Potenzjal ta' sħana globali, fossili @mt
label: Global warming potential, fossiel @nl
label: Potencjał tworzenia efektu cieplarnianego, paliwa kopalne @pl
label: Potencial de aquecimento global, fóssil @pt
label: Potențial de încălzire globală, fosil @ro
label: Potenciál globálneho otepľovania, fosílne @sk
label: Potencial globalnega segrevanja, fosilni @sl
label: Global uppvärmningspotential, fossil @sv
label: Féidearthacht Teasa Domhanda, Fósil @ga
unit: kg CO₂ eq
governed by: EN 15804:2012+A2:2019
sub property of: Indicator
domain: EPDBlock
range: ImpactValues
comment: Global Warming Potential, Fossil
comment: Потенциал за глобално затопляне, изкопаеми горива @bg
comment: Potenciál globálního oteplování, fosilní @cs
comment: Global opvarmningspotentiale, fossilt @da
comment: Globales Erwärmungspotential, fossile Quellen @de
comment: Δυναμικό Παγκόσμιας Θέρμανσης, ορυκτά καύσιμα @el
comment: Potencial de calentamiento global, fósil @es
comment: Globaalse soojenemise potentsiaal, fossiilne @et
comment: Ilmaston lämmitysvaikutuspotentiaali, fossiilinen @fi
comment: Potentiel de réchauffement global, fossile @fr
comment: Potencijal globalnog zagrijavanja, fosilni @hr
comment: Globális felmelegedési potenciál, fosszilis @hu
comment: Potenziale di riscaldamento globale, fossile @it
comment: Globalinio atšilimo potencialas, fosilinis @lt
comment: Globālās sasilšanas potenciāls, fosilais @lv
comment: Potenzjal ta' sħana globali, fossili @mt
comment: Global warming potential, fossiel @nl
comment: Potencjał tworzenia efektu cieplarnianego, paliwa kopalne @pl
comment: Potencial de aquecimento global, fóssil @pt
comment: Potențial de încălzire globală, fosil @ro
comment: Potenciál globálneho otepľovania, fosílne @sk
comment: Potencial globalnega segrevanja, fosilni @sl
comment: Global uppvärmningspotential, fossil @sv
comment: Féidearthacht Teasa Domhanda, Fósil @ga
term status: unstable

Global Warming Potential, Biogenic
type: ObjectProperty
label: Потенциал за глобално затопляне, биогенен @bg
label: Potenciál globálního oteplování, biogenní @cs
label: Global opvarmningspotentiale, biogen @da
label: Globales Erwärmungspotential, biogen @de
label: Δυναμικό Παγκόσμιας Θέρμανσης, βιογενές @el
label: Potencial de calentamiento global, biogénico @es
label: Globaalse soojenemise potentsiaal, biogeenne @et
label: Ilmaston lämmitysvaikutuspotentiaali, biogeeninen @fi
label: Potentiel de réchauffement global, biogénique @fr
label: Potencijal globalnog zagrijavanja, biogeni @hr
label: Globális felmelegedési potenciál, biogén @hu
label: Potenziale di riscaldamento globale, biogenico @it
label: Globalinio atšilimo potencialas, biogeninis @lt
label: Globālās sasilšanas potenciāls, biogēns @lv
label: Potenzjal ta' sħana globali, bijoġeniku @mt
label: Global warming potential, biogeen @nl
label: Potencjał tworzenia efektu cieplarnianego, biogeniczny @pl
label: Potencial de aquecimento global, biogênico @pt
label: Potențial de încălzire globală, biogenic @ro
label: Potenciál globálneho otepľovania, biogénny @sk
label: Potencial globalnega segrevanja, biogen @sl
label: Global uppvärmningspotential, biogen @sv
label: Féidearthacht Teasa Domhanda, Bithigineach @ga
unit: kg CO₂ eq
governed by: EN 15804:2012+A2:2019
sub property of: Indicator
domain: EPDBlock
range: ImpactValues
comment: Global Warming Potential, Biogenic
comment: Потенциал за глобално затопляне, биогенен @bg
comment: Potenciál globálního oteplování, biogenní @cs
comment: Global opvarmningspotentiale, biogen @da
comment: Globales Erwärmungspotential, biogen @de
comment: Δυναμικό Παγκόσμιας Θέρμανσης, βιογενές @el
comment: Potencial de calentamiento global, biogénico @es
comment: Globaalse soojenemise potentsiaal, biogeenne @et
comment: Ilmaston lämmitysvaikutuspotentiaali, biogeeninen @fi
comment: Potentiel de réchauffement global, biogénique @fr
comment: Potencijal globalnog zagrijavanja, biogeni @hr
comment: Globális felmelegedési potenciál, biogén @hu
comment: Potenziale di riscaldamento globale, biogenico @it
comment: Globalinio atšilimo potencialas, biogeninis @lt
comment: Globālās sasilšanas potenciāls, biogēns @lv
comment: Potenzjal ta' sħana globali, bijoġeniku @mt
comment: Global warming potential, biogeen @nl
comment: Potencjał tworzenia efektu cieplarnianego, biogeniczny @pl
comment: Potencial de aquecimento global, biogênico @pt
comment: Potențial de încălzire globală, biogenic @ro
comment: Potenciál globálneho otepľovania, biogénny @sk
comment: Potencial globalnega segrevanja, biogen @sl
comment: Global uppvärmningspotential, biogen @sv
comment: Féidearthacht Teasa Domhanda, Bithigineach @ga
term status: unstable

Global Warming Potential, Land Use and Land Use Change
type: ObjectProperty
label: Потенциал за глобално затопляне, земеползване и промяна на земеползването @bg
label: Potenciál globálního oteplování, využití půdy a změny využití půdy @cs
label: Global opvarmningspotentiale, arealanvendelse og arealændringer @da
label: Globales Erwärmungspotential, Landnutzung und Landnutzungsänderung @de
label: Δυναμικό Παγκόσμιας Θέρμανσης, χρήση γης και αλλαγή χρήσης γης @el
label: Potencial de calentamiento global, uso y cambio de uso del suelo @es
label: Globaalse soojenemise potentsiaal, maakasutus ja maakasutuse muutus @et
label: Ilmaston lämmitysvaikutuspotentiaali, maa- ja maankäytön muutos @fi
label: Potentiel de réchauffement global, utilisation et changement de l'utilisation des terres @fr
label: Potencijal globalnog zagrijavanja, korištenje zemljišta i promjena korištenja zemljišta @hr
label: Globális felmelegedési potenciál, földhasználat és földhasználat változás @hu
label: Potenziale di riscaldamento globale, uso e cambiamento del suolo @it
label: Globalinio atšilimo potencialas, žemės naudojimas ir jo pokyčiai @lt
label: Globālās sasilšanas potenciāls, zemes izmantošana un izmaiņas zemes izmantošanā @lv
label: Potenzjal ta' sħana globali, użu u bidla fl-użu tal-art @mt
label: Global warming potential, landgebruik en landgebruiksverandering @nl
label: Potencjał tworzenia efektu cieplarnianego, użytkowanie i zmiana użytkowania ziemi @pl
label: Potencial de aquecimento global, uso e alteração do uso do solo @pt
label: Potențial de încălzire globală, utilizarea și schimbarea utilizării terenurilor @ro
label: Potenciál globálneho otepľovania, využívanie pôdy a zmena využívania pôdy @sk
label: Potencial globalnega segrevanja, raba tal in spremembe rabe tal @sl
label: Global uppvärmningspotential, markanvändning och markanvändningsförändring @sv
label: Féidearthacht Teasa Domhanda, Úsáid Talún agus Athrú ar Úsáid Talún @ga
unit: kg CO₂ eq
governed by: EN 15804:2012+A2:2019
sub property of: Indicator
domain: EPDBlock
range: ImpactValues
comment: Global Warming Potential, Land Use and Land Use Change
comment: Потенциал за глобално затопляне, земеползване и промяна на земеползването @bg
comment: Potenciál globálního oteplování, využití půdy a změny využití půdy @cs
comment: Global opvarmningspotentiale, arealanvendelse og arealændringer @da
comment: Globales Erwärmungspotential, Landnutzung und Landnutzungsänderung @de
comment: Δυναμικό Παγκόσμιας Θέρμανσης, χρήση γης και αλλαγή χρήσης γης @el
comment: Potencial de calentamiento global, uso y cambio de uso del suelo @es
comment: Globaalse soojenemise potentsiaal, maakasutus ja maakasutuse muutus @et
comment: Ilmaston lämmitysvaikutuspotentiaali, maa- ja maankäytön muutos @fi
comment: Potentiel de réchauffement global, utilisation et changement de l'utilisation des terres @fr
comment: Potencijal globalnog zagrijavanja, korištenje zemljišta i promjena korištenja zemljišta @hr
comment: Globális felmelegedési potenciál, földhasználat és földhasználat változás @hu
comment: Potenziale di riscaldamento globale, uso e cambiamento del suolo @it
comment: Globalinio atšilimo potencialas, žemės naudojimas ir jo pokyčiai @lt
comment: Globālās sasilšanas potenciāls, zemes izmantošana un izmaiņas zemes izmantošanā @lv
comment: Potenzjal ta' sħana globali, użu u bidla fl-użu tal-art @mt
comment: Global warming potential, landgebruik en landgebruiksverandering @nl
comment: Potencjał tworzenia efektu cieplarnianego, użytkowanie i zmiana użytkowania ziemi @pl
comment: Potencial de aquecimento global, uso e alteração do uso do solo @pt
comment: Potențial de încălzire globală, utilizarea și schimbarea utilizării terenurilor @ro
comment: Potenciál globálneho otepľovania, využívanie pôdy a zmena využívania pôdy @sk
comment: Potencial globalnega segrevanja, raba tal in spremembe rabe tal @sl
comment: Global uppvärmningspotential, markanvändning och markanvändningsförändring @sv
comment: Féidearthacht Teasa Domhanda, Úsáid Talún agus Athrú ar Úsáid Talún @ga
term status: unstable

Global Warming Potential, Greenhouse Gases
type: ObjectProperty
label: Потенциал за глобално затопляне, парникови газове @bg
label: Potenciál globálního oteplování, skleníkové plyny @cs
label: Global opvarmningspotentiale, drivhusgasser @da
label: Globales Erwärmungspotential, Treibhausgase @de
label: Δυναμικό Παγκόσμιας Θέρμανσης, αέρια του θερμοκηπίου @el
label: Potencial de calentamiento global, gases de efecto invernadero @es
label: Globaalse soojenemise potentsiaal, kasvuhoonegaasid @et
label: Ilmaston lämmitysvaikutuspotentiaali, kasvihuonekaasut @fi
label: Potentiel de réchauffement global, gaz à effet de serre @fr
label: Potencijal globalnog zagrijavanja, staklenički plinovi @hr
label: Globális felmelegedési potenciál, üvegházhatású gázok @hu
label: Potenziale di riscaldamento globale, gas serra @it
label: Globalinio atšilimo potencialas, šiltnamio efektą sukeliančios dujos @lt
label: Globālās sasilšanas potenciāls, siltumnīcefekta gāzes @lv
label: Potenzjal ta' sħana globali, gassijiet serra @mt
label: Global warming potential, broeikasgassen @nl
label: Potencjał tworzenia efektu cieplarnianego, gazy cieplarniane @pl
label: Potencial de aquecimento global, gases de efeito estufa @pt
label: Potențial de încălzire globală, gaze cu efect de seră @ro
label: Potenciál globálneho otepľovania, skleníkové plyny @sk
label: Potencial globalnega segrevanja, toplogredni plini @sl
label: Global uppvärmningspotential, växthusgaser @sv
label: Féidearthacht Teasa Domhanda, Gáis Cheapacháin Teasa @ga
unit: kg CO₂ eq
governed by: EN 15804:2012+A2:2019
sub property of: Indicator
domain: EPDBlock
range: ImpactValues
comment: Global Warming Potential, Greenhouse Gases
comment: Потенциал за глобално затопляне, парникови газове @bg
comment: Potenciál globálního oteplování, skleníkové plyny @cs
comment: Global opvarmningspotentiale, drivhusgasser @da
comment: Globales Erwärmungspotential, Treibhausgase @de
comment: Δυναμικό Παγκόσμιας Θέρμανσης, αέρια του θερμοκηπίου @el
comment: Potencial de calentamiento global, gases de efecto invernadero @es
comment: Globaalse soojenemise potentsiaal, kasvuhoonegaasid @et
comment: Ilmaston lämmitysvaikutuspotentiaali, kasvihuonekaasut @fi
comment: Potentiel de réchauffement global, gaz à effet de serre @fr
comment: Potencijal globalnog zagrijavanja, staklenički plinovi @hr
comment: Globális felmelegedési potenciál, üvegházhatású gázok @hu
comment: Potenziale di riscaldamento globale, gas serra @it
comment: Globalinio atšilimo potencialas, šiltnamio efektą sukeliančios dujos @lt
comment: Globālās sasilšanas potenciāls, siltumnīcefekta gāzes @lv
comment: Potenzjal ta' sħana globali, gassijiet serra @mt
comment: Global warming potential, broeikasgassen @nl
comment: Potencjał tworzenia efektu cieplarnianego, gazy cieplarniane @pl
comment: Potencial de aquecimento global, gases de efeito estufa @pt
comment: Potențial de încălzire globală, gaze cu efect de seră @ro
comment: Potenciál globálneho otepľovania, skleníkové plyny @sk
comment: Potencial globalnega segrevanja, toplogredni plini @sl
comment: Global uppvärmningspotential, växthusgaser @sv
comment: Féidearthacht Teasa Domhanda, Gáis Cheapacháin Teasa @ga
term status: unstable

Ozone Depletion Potential
type: ObjectProperty
label: Потенциал за изчерпване на озона @bg
label: Potenciál ničení ozonu @cs
label: Ozonnedbrydningspotentiale @da
label: Ozonabbaupotenzial @de
label: Δυναμικό Καταστροφής του Όζοντος @el
label: Potencial de agotamiento del ozono @es
label: Osoonikihi kadumise potentsiaal @et
label: Otsonikerroksen heikkenemispotentiaali @fi
label: Potentiel d’appauvrissement de la couche d’ozone @fr
label: Potencijal za uništavanje ozonskog omotača @hr
label: Ózonréteg károsodási potenciál @hu
label: Potenziale di esaurimento dello strato di ozono @it
label: Ozoną mažinantis potencialas @lt
label: Ozona samazināšanās potenciāls @lv
label: Potenzjal ta' tnaqqis tal-ozonu @mt
label: Ozonelaagafbraakpotentieel @nl
label: Potencjał niszczenia warstwy ozonowej @pl
label: Potencial de esgotamento do ozono @pt
label: Potențial de epuizare a ozonului @ro
label: Potenciál poškodzovania ozónovej vrstvy @sk
label: Potencial za zmanjšanje ozonskega plašča @sl
label: Potential för nedbrytning av ozonskiktet @sv
label: Féidearthacht Laghdaithe Ózóin @ga
unit: kg CFC11 eq
governed by: EN 15804:2012+A2:2019
sub property of: Indicator
domain: EPDBlock
range: ImpactValues
comment: Ozone Depletion Potential
comment: Потенциал за изчерпване на озона @bg
comment: Potenciál ničení ozonu @cs
comment: Ozonnedbrydningspotentiale @da
comment: Ozonabbaupotenzial @de
comment: Δυναμικό Καταστροφής του Όζοντος @el
comment: Potencial de agotamiento del ozono @es
comment: Osoonikihi kadumise potentsiaal @et
comment: Otsonikerroksen heikkenemispotentiaali @fi
comment: Potentiel d’appauvrissement de la couche d’ozone @fr
comment: Potencijal za uništavanje ozonskog omotača @hr
comment: Ózonréteg károsodási potenciál @hu
comment: Potenziale di esaurimento dello strato di ozono @it
comment: Ozoną mažinantis potencialas @lt
comment: Ozona samazināšanās potenciāls @lv
comment: Potenzjal ta' tnaqqis tal-ozonu @mt
comment: Ozonelaagafbraakpotentieel @nl
comment: Potencjał niszczenia warstwy ozonowej @pl
comment: Potencial de esgotamento do ozono @pt
comment: Potențial de epuizare a ozonului @ro
comment: Potenciál poškodzovania ozónovej vrstvy @sk
comment: Potencial za zmanjšanje ozonskega plašča @sl
comment: Potential för nedbrytning av ozonskiktet @sv
comment: Féidearthacht Laghdaithe Ózóin @ga
term status: unstable

Acidification Potential
type: ObjectProperty
label: Потенциал за натрупване на киселини @bg
label: Potenciál acidifikace @cs
label: Forsuringspotential @da
label: Versauerungspotential @de
label: Δυναμικό Οξίνισης @el
label: Potencial de acidificación @es
label: Happestumise potentsiaal @et
label: Happamoitumispotentiaali @fi
label: Potentiel d'acidification @fr
label: Potencijal zakiseljavanja @hr
label: Savanyodási potenciál @hu
label: Potenziale di acidificazione @it
label: Rūgštėjimo potencialas @lt
label: Skābuma potenciāls @lv
label: Potenzjal ta' aċidifikazzjoni @mt
label: Verzuringspotentieel @nl
label: Potencjał zakwaszenia @pl
label: Potencial de acidificação @pt
label: Potențial de acidifiere @ro
label: Potenciál acidifikácie @sk
label: Potencial zakisanosti @sl
label: Försurningspotential @sv
label: Féidearthacht Aigéadú @ga
unit: mol H+ eq
governed by: EN 15804:2012+A2:2019
sub property of: Indicator
domain: EPDBlock
range: ImpactValues
comment: Acidification Potential
comment: Потенциал за натрупване на киселини @bg
comment: Potenciál acidifikace @cs
comment: Forsuringspotential @da
comment: Versauerungspotential @de
comment: Δυναμικό Οξίνισης @el
comment: Potencial de acidificación @es
comment: Happestumise potentsiaal @et
comment: Happamoitumispotentiaali @fi
comment: Potentiel d'acidification @fr
comment: Potencijal zakiseljavanja @hr
comment: Savanyodási potenciál @hu
comment: Potenziale di acidificazione @it
comment: Rūgštėjimo potencialas @lt
comment: Skābuma potenciāls @lv
comment: Potenzjal ta' aċidifikazzjoni @mt
comment: Verzuringspotentieel @nl
comment: Potencjał zakwaszenia @pl
comment: Potencial de acidificação @pt
comment: Potențial de acidifiere @ro
comment: Potenciál acidifikácie @sk
comment: Potencial zakisanosti @sl
comment: Försurningspotential @sv
comment: Féidearthacht Aigéadú @ga
term status: unstable

Eutrophication Potential, Freshwater
type: ObjectProperty
label: Потенциал за евтрофикация, прясна вода @bg
label: Potenciál eutrofikace, sladká voda @cs
label: Eutrofieringspotentiale, ferskvand @da
label: Eutrophierungspotential, Süßwasser @de
label: Δυναμικό Ευτροφισμού, γλυκό νερό @el
label: Potencial de eutrofización, agua dulce @es
label: Eutrofeerimise potentsiaal, magevesi @et
label: Eutrofikointipotentiaali, makea vesi @fi
label: Potentiel d'eutrophisation, eau douce @fr
label: Potencijal eutrofikacije, slatka voda @hr
label: Eutrofizációs potenciál, édesvíz @hu
label: Potenziale di eutrofizzazione, acqua dolce @it
label: Eutrofikacijos potencialas, gėlas vanduo @lt
label: Eutrofikācijas potenciāls, saldūdens @lv
label: Potenzjal ta' eutrofikazzjoni, ilma ħelu @mt
label: Eutrofiëringspotentieel, zoet water @nl
label: Potencjał eutrofizacji, woda słodka @pl
label: Potencial de eutrofização, água doce @pt
label: Potențial de eutrofizare, apă dulce @ro
label: Potenciál eutrofikácie, sladká voda @sk
label: Potencial eutrofikacije, sladka voda @sl
label: Eutrofieringspotential, sötvatten @sv
label: Féidearthacht Eutrófachta, fionnuisce @ga
unit: kg P eq
governed by: EN 15804:2012+A2:2019
sub property of: Indicator
domain: EPDBlock
range: ImpactValues
comment: Eutrophication Potential, Freshwater
comment: Потенциал за евтрофикация, прясна вода @bg
comment: Potenciál eutrofikace, sladká voda @cs
comment: Eutrofieringspotentiale, ferskvand @da
comment: Eutrophierungspotential, Süßwasser @de
comment: Δυναμικό Ευτροφισμού, γλυκό νερό @el
comment: Potencial de eutrofización, agua dulce @es
comment: Eutrofeerimise potentsiaal, magevesi @et
comment: Eutrofikointipotentiaali, makea vesi @fi
comment: Potentiel d'eutrophisation, eau douce @fr
comment: Potencijal eutrofikacije, slatka voda @hr
comment: Eutrofizációs potenciál, édesvíz @hu
comment: Potenziale di eutrofizzazione, acqua dolce @it
comment: Eutrofikacijos potencialas, gėlas vanduo @lt
comment: Eutrofikācijas potenciāls, saldūdens @lv
comment: Potenzjal ta' eutrofikazzjoni, ilma ħelu @mt
comment: Eutrofiëringspotentieel, zoet water @nl
comment: Potencjał eutrofizacji, woda słodka @pl
comment: Potencial de eutrofização, água doce @pt
comment: Potențial de eutrofizare, apă dulce @ro
comment: Potenciál eutrofikácie, sladká voda @sk
comment: Potencial eutrofikacije, sladka voda @sl
comment: Eutrofieringspotential, sötvatten @sv
comment: Féidearthacht Eutrófachta, fionnuisce @ga
term status: unstable

Eutrophication Potential, Marine
type: ObjectProperty
label: Потенциал за евтрофикация, морска вода @bg
label: Potenciál eutrofikace, mořská voda @cs
label: Eutrofieringspotentiale, havvand @da
label: Eutrophierungspotential, Meerwasser @de
label: Δυναμικό Ευτροφισμού, θαλασσινό νερό @el
label: Potencial de eutrofización, agua marina @es
label: Eutrofeerimise potentsiaal, merevesi @et
label: Eutrofikointipotentiaali, merivesi @fi
label: Potentiel d'eutrophisation, eau marine @fr
label: Potencijal eutrofikacije, morska voda @hr
label: Eutrofizációs potenciál, tengervíz @hu
label: Potenziale di eutrofizzazione, acqua marina @it
label: Eutrofikacijos potencialas, jūros vanduo @lt
label: Eutrofikācijas potenciāls, jūras ūdens @lv
label: Potenzjal ta' eutrofikazzjoni, ilma tal-baħar @mt
label: Eutrofiëringspotentieel, zeewater @nl
label: Potencjał eutrofizacji, woda morska @pl
label: Potencial de eutrofização, água do mar @pt
label: Potențial de eutrofizare, apă marină @ro
label: Potenciál eutrofikácie, morská voda @sk
label: Potencial eutrofikacije, morska voda @sl
label: Eutrofieringspotential, havsvatten @sv
label: Féidearthacht Eutrófachta, Uisce Muirí @ga
unit: kg N eq
governed by: EN 15804:2012+A2:2019
sub property of: Indicator
domain: EPDBlock
range: ImpactValues
comment: Eutrophication Potential, Marine
comment: Потенциал за евтрофикация, морска вода @bg
comment: Potenciál eutrofikace, mořská voda @cs
comment: Eutrofieringspotentiale, havvand @da
comment: Eutrophierungspotential, Meerwasser @de
comment: Δυναμικό Ευτροφισμού, θαλασσινό νερό @el
comment: Potencial de eutrofización, agua marina @es
comment: Eutrofeerimise potentsiaal, merevesi @et
comment: Eutrofikointipotentiaali, merivesi @fi
comment: Potentiel d'eutrophisation, eau marine @fr
comment: Potencijal eutrofikacije, morska voda @hr
comment: Eutrofizációs potenciál, tengervíz @hu
comment: Potenziale di eutrofizzazione, acqua marina @it
comment: Eutrofikacijos potencialas, jūros vanduo @lt
comment: Eutrofikācijas potenciāls, jūras ūdens @lv
comment: Potenzjal ta' eutrofikazzjoni, ilma tal-baħar @mt
comment: Eutrofiëringspotentieel, zeewater @nl
comment: Potencjał eutrofizacji, woda morska @pl
comment: Potencial de eutrofização, água do mar @pt
comment: Potențial de eutrofizare, apă marină @ro
comment: Potenciál eutrofikácie, morská voda @sk
comment: Potencial eutrofikacije, morska voda @sl
comment: Eutrofieringspotential, havsvatten @sv
comment: Féidearthacht Eutrófachta, Uisce Muirí @ga
term status: unstable

Eutrophication Potential, Terrestrial
type: ObjectProperty
label: Потенциал за евтрофикация, суша @bg
label: Potenciál eutrofikace, půda @cs
label: Eutrofieringspotentiale, terrestrisk @da
label: Eutrophierungspotential, terrestrisch @de
label: Δυναμικό Ευτροφισμού, χερσαίο @el
label: Potencial de eutrofización, terrestre @es
label: Eutrofeerimise potentsiaal, maismaa @et
label: Eutrofikointipotentiaali, maaperä @fi
label: Potentiel d'eutrophisation, terrestre @fr
label: Potencijal eutrofikacije, kopneni @hr
label: Eutrofizációs potenciál, szárazföldi @hu
label: Potenziale di eutrofizzazione, terrestre @it
label: Eutrofikacijos potencialas, sausumos @lt
label: Eutrofikācijas potenciāls, sauszemes @lv
label: Potenzjal ta' eutrofikazzjoni, terrestri @mt
label: Eutrofiëringspotentieel, terrestrisch @nl
label: Potencjał eutrofizacji, lądowy @pl
label: Potencial de eutrofização, terrestre @pt
label: Potențial de eutrofizare, terestru @ro
label: Potenciál eutrofikácie, terestrický @sk
label: Potencial eutrofikacije, kopenski @sl
label: Eutrofieringspotential, mark @sv
label: Féidearthacht Eutrófachta, Talún @ga
unit: mol N eq
governed by: EN 15804:2012+A2:2019
sub property of: Indicator
domain: EPDBlock
range: ImpactValues
comment: Eutrophication Potential, Terrestrial
comment: Потенциал за евтрофикация, суша @bg
comment: Potenciál eutrofikace, půda @cs
comment: Eutrofieringspotentiale, terrestrisk @da
comment: Eutrophierungspotential, terrestrisch @de
comment: Δυναμικό Ευτροφισμού, χερσαίο @el
comment: Potencial de eutrofización, terrestre @es
comment: Eutrofeerimise potentsiaal, maismaa @et
comment: Eutrofikointipotentiaali, maaperä @fi
comment: Potentiel d'eutrophisation, terrestre @fr
comment: Potencijal eutrofikacije, kopneni @hr
comment: Eutrofizációs potenciál, szárazföldi @hu
comment: Potenziale di eutrofizzazione, terrestre @it
comment: Eutrofikacijos potencialas, sausumos @lt
comment: Eutrofikācijas potenciāls, sauszemes @lv
comment: Potenzjal ta' eutrofikazzjoni, terrestri @mt
comment: Eutrofiëringspotentieel, terrestrisch @nl
comment: Potencjał eutrofizacji, lądowy @pl
comment: Potencial de eutrofização, terrestre @pt
comment: Potențial de eutrofizare, terestru @ro
comment: Potenciál eutrofikácie, terestrický @sk
comment: Potencial eutrofikacije, kopenski @sl
comment: Eutrofieringspotential, mark @sv
comment: Féidearthacht Eutrófachta, Talún @ga
term status: unstable

Photochemical Ozone Creation Potential
type: ObjectProperty
label: Потенциал за създаване на фотохимичен озон @bg
label: Potenciál tvorby fotochemického ozonu @cs
label: Fotokemisk ozondannelsespotentiale @da
label: Foto-chemisches Ozonbildungspotenzial @de
label: Δυναμικό Δημιουργίας Φωτοχημικού Όζοντος @el
label: Potencial de creación de ozono fotoquímico @es
label: Foto-keemilise osooni teke potentsiaal @et
label: Valokemiallisen otsonin muodostumispotentiaali @fi
label: Potentiel de création d’ozone photochimique @fr
label: Potencijal za stvaranje fotokemijskog ozona @hr
label: Fotokémiai ózonképződési potenciál @hu
label: Potenziale di formazione di ozono fotochimico @it
label: Fotocheminio ozono susidarymo potencialas @lt
label: Fotohīmiskā ozona veidošanās potenciāls @lv
label: Potenzjal ta' ħolqien ta' ozonu fotoċimiku @mt
label: Fotochemisch ozonvormingspotentieel @nl
label: Potencjał fotochemicznego tworzenia ozonu @pl
label: Potencial de criação de ozono fotoquímico @pt
label: Potențial de creare a ozonului fotochimic @ro
label: Potenciál fotochemickej tvorby ozónu @sk
label: Potencial za nastanek fotokemijskega ozona @sl
label: Potential för fotokemisk ozonbildning @sv
label: Féidearthacht Cruthaithe Ózóin Fótaimiúla @ga
unit: kg NMVOC eq
governed by: EN 15804:2012+A2:2019
sub property of: Indicator
domain: EPDBlock
range: ImpactValues
comment: Photochemical Ozone Creation Potential
comment: Потенциал за създаване на фотохимичен озон @bg
comment: Potenciál tvorby fotochemického ozonu @cs
comment: Fotokemisk ozondannelsespotentiale @da
comment: Foto-chemisches Ozonbildungspotenzial @de
comment: Δυναμικό Δημιουργίας Φωτοχημικού Όζοντος @el
comment: Potencial de creación de ozono fotoquímico @es
comment: Foto-keemilise osooni teke potentsiaal @et
comment: Valokemiallisen otsonin muodostumispotentiaali @fi
comment: Potentiel de création d’ozone photochimique @fr
comment: Potencijal za stvaranje fotokemijskog ozona @hr
comment: Fotokémiai ózonképződési potenciál @hu
comment: Potenziale di formazione di ozono fotochimico @it
comment: Fotocheminio ozono susidarymo potencialas @lt
comment: Fotohīmiskā ozona veidošanās potenciāls @lv
comment: Potenzjal ta' ħolqien ta' ozonu fotoċimiku @mt
comment: Fotochemisch ozonvormingspotentieel @nl
comment: Potencjał fotochemicznego tworzenia ozonu @pl
comment: Potencial de criação de ozono fotoquímico @pt
comment: Potențial de creare a ozonului fotochimic @ro
comment: Potenciál fotochemickej tvorby ozónu @sk
comment: Potencial za nastanek fotokemijskega ozona @sl
comment: Potential för fotokemisk ozonbildning @sv
comment: Féidearthacht Cruthaithe Ózóin Fótaimiúla @ga
term status: unstable

Abiotic Depletion Potential (elements)
type: ObjectProperty
label: Потенциал за изчерпване на абиотични елементи @bg
label: Potenciál vyčerpání abiotických prvků @cs
label: Abiotisk nedbrydningspotentiale (elementer) @da
label: Abiotisches Erschöpfungspotenzial (Elemente) @de
label: Δυναμικό Εξάντλησης Αβιοτικών Στοιχείων @el
label: Potencial de agotamiento abiótico (elementos) @es
label: Abiootiliste elementide ammendumispotentsiaal @et
label: Abioottisten alkuaineiden ehtymispotentiaali @fi
label: Potentiel d'épuisement abiotiques (éléments) @fr
label: Potencijal iscrpljivanja abiotičkih elemenata @hr
label: Abiotikus kimerülési potenciál (elemek) @hu
label: Potenziale di esaurimento abiotico (elementi) @it
label: Abiotinių elementų išeikvojimo potencialas @lt
label: Abiotisko elementu izsīkšanas potenciāls @lv
label: Potenzjal ta' tnaqqis abjotiku (elementi) @mt
label: Abiotisch uitputtingspotentieel (elementen) @nl
label: Potencjał wyczerpywania zasobów abiotycznych (pierwiastków) @pl
label: Potencial de esgotamento abiótico (elementos) @pt
label: Potențial de epuizare abiotică (elemente) @ro
label: Potenciál vyčerpania abiotických prvkov @sk
label: Potencial izčrpanja abiotičnih elementov @sl
label: Abiotisk uttömningspotential @sv
label: Féidearthacht Díothaithe Aibitheach (eilimintí) @ga
unit: kg Sb eq
governed by: EN 15804:2012+A2:2019
sub property of: Indicator
domain: EPDBlock
range: ImpactValues
term status: unstable
comment: Abiotic Depletion Potential (elements)
comment: Потенциал за изчерпване на абиотични елементи @bg
comment: Potenciál vyčerpání abiotických prvků @cs
comment: Abiotisk nedbrydningspotentiale (elementer) @da
comment: Abiotisches Erschöpfungspotenzial (Elemente) @de
comment: Δυναμικό Εξάντλησης Αβιοτικών Στοιχείων @el
comment: Potencial de agotamiento abiótico (elementos) @es
comment: Abiootiliste elementide ammendumispotentsiaal @et
comment: Abioottisten alkuaineiden ehtymispotentiaali @fi
comment: Potentiel d'épuisement abiotiques (éléments) @fr
comment: Potencijal iscrpljivanja abiotičkih elemenata @hr
comment: Abiotikus kimerülési potenciál (elemek) @hu
comment: Potenziale di esaurimento abiotico (elementi) @it
comment: Abiotinių elementų išeikvojimo potencialas @lt
comment: Abiotisko elementu izsīkšanas potenciāls @lv
comment: Potenzjal ta' tnaqqis abjotiku (elementi) @mt
comment: Abiotisch uitputtingspotentieel (elementen) @nl
comment: Potencjał wyczerpywania zasobów abiotycznych (pierwiastków) @pl
comment: Potencial de esgotamento abiótico (elementos) @pt
comment: Potențial de epuizare abiotică (elemente) @ro
comment: Potenciál vyčerpania abiotických prvkov @sk
comment: Potencial izčrpanja abiotičnih elementov @sl
comment: Abiotisk uttömningspotential @sv
comment: Féidearthacht Díothaithe Aibitheach (eilimintí) @ga

Abiotic Depletion Potential (fossil fuels)
type: ObjectProperty
label: Потенциал за изчерпване на абиотични горива @bg
label: Potenciál vyčerpání abiotických paliv @cs
label: Abiotisk nedbrydningspotentiale (fossile brændstoffer) @da
label: Abiotisches Erschöpfungspotenzial (fossile Brennstoffe) @de
label: Δυναμικό Εξάντλησης Αβιοτικών Καυσίμων @el
label: Potencial de agotamiento abiótico (combustibles fósiles) @es
label: Abiootiliste fossiilkütuste ammendumispotentsiaal @et
label: Abioottisten fossiilisten polttoaineiden ehtymispotentiaali @fi
label: Potentiel d'épuisement abiotiques (combustibles fossiles) @fr
label: Potencijal iscrpljivanja abiotičkih goriva @hr
label: Abiotikus kimerülési potenciál (fosszilis tüzelőanyagok) @hu
label: Potenziale di esaurimento abiotico (combustibili fossili) @it
label: Abiotinių išteklių išeikvojimo potencialas (fossiliniai kuras) @lt
label: Abiotisko kurināmo izsīkšanas potenciāls @lv
label: Potenzjal ta' tnaqqis abjotiku (fjuwils fossili) @mt
label: Abiotisch uitputtingspotentieel (fossiele brandstoffen) @nl
label: Potencjał wyczerpywania zasobów abiotycznych (paliwa kopalne) @pl
label: Potencial de esgotamento abiótico (combustíveis fósseis) @pt
label: Potențial de epuizare abiotică (combustibili fosili) @ro
label: Potenciál vyčerpania abiotických palív @sk
label: Potencial izčrpanja abiotičnih goriv @sl
label: Abiotisk uttömningspotential (fossila bränslen) @sv
label: Féidearthacht Díothaithe Aibitheach (breoslaí iontaise) @ga
unit: MJ
governed by: EN 15804:2012+A2:2019
sub property of: Indicator
domain: EPDBlock
range: ImpactValues
term status: unstable
comment: Abiotic Depletion Potential (fossil fuels)
comment: Потенциал за изчерпване на абиотични горива @bg
comment: Potenciál vyčerpání abiotických paliv @cs
comment: Abiotisk nedbrydningspotentiale (fossile brændstoffer) @da
comment: Abiotisches Erschöpfungspotenzial (fossile Brennstoffe) @de
comment: Δυναμικό Εξάντλησης Αβιοτικών Καυσίμων @el
comment: Potencial de agotamiento abiótico (combustibles fósiles) @es
comment: Abiootiliste fossiilkütuste ammendumispotentsiaal @et
comment: Abioottisten fossiilisten polttoaineiden ehtymispotentiaali @fi
comment: Potentiel d'épuisement abiotiques (combustibles fossiles) @fr
comment: Potencijal iscrpljivanja abiotičkih goriva @hr
comment: Abiotikus kimerülési potenciál (fosszilis tüzelőanyagok) @hu
comment: Potenziale di esaurimento abiotico (combustibili fossili) @it
comment: Abiotinių išteklių išeikvojimo potencialas (fossiliniai kuras) @lt
comment: Abiotisko kurināmo izsīkšanas potenciāls @lv
comment: Potenzjal ta' tnaqqis abjotiku (fjuwils fossili) @mt
comment: Abiotisch uitputtingspotentieel (fossiele brandstoffen) @nl
comment: Potencjał wyczerpywania zasobów abiotycznych (paliwa kopalne) @pl
comment: Potencial de esgotamento abiótico (combustíveis fósseis) @pt
comment: Potențial de epuizare abiotică (combustibili fosili) @ro
comment: Potenciál vyčerpania abiotických palív @sk
comment: Potencial izčrpanja abiotičnih goriv @sl
comment: Abiotisk uttömningspotential (fossila bränslen) @sv
comment: Féidearthacht Díothaithe Aibitheach (breoslaí iontaise) @ga

Water Depletion Potential
type: ObjectProperty
label: Потенциал за изчерпване на вода @bg
label: Potenciál vyčerpání vody @cs
label: Vandforbrugspotentiale @da
label: Wassererschöpfungspotenzial @de
label: Δυναμικό Εξάντλησης Νερού @el
label: Potencial de agotamiento de agua @es
label: Vee ammendumispotentsiaal @et
label: Veden ehtymispotentiaali @fi
label: Potentiel d'épuisement de l'eau @fr
label: Potencijal iscrpljivanja vode @hr
label: Vízfelhasználási potenciál @hu
label: Potenziale di esaurimento dell'acqua @it
label: Vandens išeikvojimo potencialas @lt
label: Ūdens izsīkšanas potenciāls @lv
label: Potenzjal ta' tnaqqis tal-ilma @mt
label: Wateruitputtingspotentieel @nl
label: Potencjał wyczerpywania zasobów wodnych @pl
label: Potencial de esgotamento hídrico @pt
label: Potențial de epuizare a apei @ro
label: Potenciál vyčerpania vody @sk
label: Potencial izčrpanja vode @sl
label: Vattenuttagspotential @sv
label: Féidearthacht Díothaithe Uisce @ga
unit: m³
governed by: EN 15804:2012+A2:2019
sub property of: Indicator
domain: EPDBlock
range: ImpactValues
term status: unstable
comment: Water Depletion Potential
comment: Потенциал за изчерпване на вода @bg
comment: Potenciál vyčerpání vody @cs
comment: Vandforbrugspotentiale @da
comment: Wassererschöpfungspotenzial @de
comment: Δυναμικό Εξάντλησης Νερού @el
comment: Potencial de agotamiento de agua @es
comment: Vee ammendumispotentsiaal @et
comment: Veden ehtymispotentiaali @fi
comment: Potentiel d'épuisement de l'eau @fr
comment: Potencijal iscrpljivanja vode @hr
comment: Vízfelhasználási potenciál @hu
comment: Potenziale di esaurimento dell'acqua @it
comment: Vandens išeikvojimo potencialas @lt
comment: Ūdens izsīkšanas potenciāls @lv
comment: Potenzjal ta' tnaqqis tal-ilma @mt
comment: Wateruitputtingspotentieel @nl
comment: Potencjał wyczerpywania zasobów wodnych @pl
comment: Potencial de esgotamento hídrico @pt
comment: Potențial de epuizare a apei @ro
comment: Potenciál vyčerpania vody @sk
comment: Potencial izčrpanja vode @sl
comment: Vattenuttagspotential @sv
comment: Féidearthacht Díothaithe Uisce @ga