DPP Ontology - EU Apparel Size System (EN 13402)
type: Ontology
version info: v3
title: Онтология на DPP - Система за размери на облекло в ЕС (EN 13402) @bg
title: Ontologie DPP - Systém velikostí oděvů EU (EN 13402) @cs
title: DPP-ontologi - EU's system for beklædningsstørrelser (EN 13402) @da
title: DPP-Ontologie - EU-Konfektionsgrößensystem (EN 13402) @de
title: Οντολογία DPP - Σύστημα μεγεθών ενδυμάτων ΕΕ (EN 13402) @el
title: Ontología DPP - Sistema de tallas de ropa de la UE (EN 13402) @es
title: DPP ontoloogia - ELi rõivasuuruste süsteem (EN 13402) @et
title: DPP-ontologia - EU:n vaatekokojärjestelmä (EN 13402) @fi
title: Ontologie DPP - Système des tailles de vêtements de l'UE (EN 13402) @fr
title: Ointeolaíocht DPP - Córas Méideanna Éadaí an AE (EN 13402) @ga
title: Ontologija DPP - Sustav veličina odjeće u EU-u (EN 13402) @hr
title: DPP ontológia - EU ruházati méretrendszer (EN 13402) @hu
title: Ontologia DPP - Sistema di taglie per abbigliamento UE (EN 13402) @it
title: DPP ontologija - ES drabužių dydžių sistema (EN 13402) @lt
title: DPP ontoloģija - ES apģērbu izmēru sistēma (EN 13402) @lv
title: Ontoloġija DPP - Sistema tad-Daqs tal-Ilbies tal-UE (EN 13402) @mt
title: DPP-ontologie - EU-kledingmatensysteem (EN 13402) @nl
title: Ontologia DPP - Europejski system rozmiarów odzieży (EN 13402) @pl
title: Ontologia DPP - Sistema de tamanhos de vestuário da UE (EN 13402) @pt
title: Ontologie DPP - Sistemul UE de mărimi pentru îmbrăcăminte (EN 13402) @ro
title: Ontológia DPP - Systém veľkostí odevov EÚ (EN 13402) @sk
title: Ontologija DPP - Sistem velikosti oblačil EU (EN 13402) @sl
title: DPP-ontologi - EU:s system för klädstorlekar (EN 13402) @sv
description: Defines the structured representation of EU apparel sizing based on body dimensions as specified in EN 13402.
description: Дефинира структурираното представяне на размерите на облеклото в ЕС въз основа на телесните размери, както е посочено в EN 13402. @bg
description: Definuje strukturovanou reprezentaci velikostí oděvů v EU na základě tělesných rozměrů, jak je specifikováno v EN 13402. @cs
description: Definerer den strukturerede repræsentation af EU's beklædningsstørrelser baseret på kropsdimensioner som specificeret i EN 13402. @da
description: Definiert die strukturierte Darstellung der EU-Bekleidungsgrößen basierend auf Körpermaßen gemäß EN 13402. @de
description: Ορίζει τη δομημένη αναπαράσταση των μεγεθών ενδυμάτων της ΕΕ με βάση τις διαστάσεις του σώματος όπως καθορίζεται στο πρότυπο EN 13402. @el
description: Define la representación estructurada de las tallas de ropa de la UE basadas en las dimensiones corporales según se especifica en la norma EN 13402. @es
description: Määratleb ELi rõivasuuruste struktureeritud esituse kehamõõtmete põhjal vastavalt standardile EN 13402. @et
description: Määrittää EU:n vaatekokojen strukturoidun esityksen vartalon mittojen perusteella standardin EN 13402 mukaisesti. @fi
description: Définit la représentation structurée des tailles de vêtements de l'UE en fonction des dimensions corporelles, tel que spécifié dans la norme EN 13402. @fr
description: Sainmhíníonn sé léiriú struchtúrtha de mhéideanna éadaí an AE bunaithe ar thoisí an choirp mar a shonraítear in EN 13402. @ga
description: Definira strukturirani prikaz veličina odjeće u EU-u na temelju tjelesnih dimenzija kako je navedeno u normi EN 13402. @hr
description: Meghatározza az EU ruházati méretezés strukturált megjelenítését a testméretek alapján az EN 13402 szabványnak megfelelően. @hu
description: Definisce la rappresentazione strutturata delle taglie di abbigliamento dell'UE basate sulle dimensioni del corpo come specificato nella norma EN 13402. @it
description: Apibrėžia struktūrizuotą ES drabužių dydžių vaizdavimą pagal kūno matmenis, kaip nurodyta EN 13402. @lt
description: Nosaka ES apģērbu izmēru strukturētu atspoguļojumu, pamatojoties uz ķermeņa izmēriem, kā norādīts EN 13402. @lv
description: Tiddefinixxi r-rappreżentazzjoni strutturata tad-daqs tal-ilbies tal-UE bbażata fuq id-dimensjonijiet tal-ġisem kif speċifikat f'EN 13402. @mt
description: Definieert de gestructureerde weergave van EU-kledingmaten op basis van lichaamsafmetingen zoals gespecificeerd in EN 13402. @nl
description: Definiuje ustrukturyzowaną reprezentację europejskich rozmiarów odzieży na podstawie wymiarów ciała zgodnie z normą EN 13402. @pl
description: Define a representação estruturada do tamanho de vestuário da UE com base nas dimensões corporais, conforme especificado na norma EN 13402. @pt
description: Definește reprezentarea structurată a mărimilor de îmbrăcăminte din UE pe baza dimensiunilor corporale, așa cum se specifică în EN 13402. @ro
description: Definuje štruktúrované vyjadrenie veľkostí odevov v EÚ na základe telesných rozmerov, ako sa uvádza v norme EN 13402. @sk
description: Opredeljuje strukturirano predstavitev velikosti oblačil v EU na podlagi telesnih mer, kot določa standard EN 13402. @sl
description: Definierar den strukturerade representationen av EU:s klädstorlekar baserat på kroppsmått enligt EN 13402. @sv
imports: Product.jsonld

EU Apparel Size Object
type: Class
label: Обект за размер на облекло в ЕС @bg
label: Objekt velikosti oděvu EU @cs
label: EU-beklædningsstørrelsesobjekt @da
label: EU-Bekleidungsgrößenobjekt @de
label: Αντικείμενο μεγέθους ενδυμάτων ΕΕ @el
label: Objeto de talla de ropa de la UE @es
label: ELi rõivasuuruse objekt @et
label: EU-vaatekohteen objekti @fi
label: Objet de taille de vêtement de l'UE @fr
label: Réad Méide Éadaí an AE @ga
label: Objekt veličine odjeće u EU-u @hr
label: EU ruházati méret objektum @hu
label: Oggetto taglia abbigliamento UE @it
label: ES drabužių dydžio objektas @lt
label: ES apģērbu izmēra objekts @lv
label: Oġġett tad-Daqs tal-Ilbies tal-UE @mt
label: EU-kledingmaatobject @nl
label: Obiekt rozmiaru odzieży UE @pl
label: Objeto de tamanho de vestuário da UE @pt
label: Obiect de mărime de îmbrăcăminte UE @ro
label: Objekt veľkosti odevu EÚ @sk
label: Objekt velikosti oblačila EU @sl
label: EU-klädstorleksobjekt @sv
comment: A structured representation of an EU size according to EN 13402.
comment: Структурирано представяне на размер в ЕС според EN 13402. @bg
comment: Strukturovaná reprezentace velikosti EU podle EN 13402. @cs
comment: En struktureret repræsentation af en EU-størrelse i henhold til EN 13402. @da
comment: Eine strukturierte Darstellung einer EU-Größe nach EN 13402. @de
comment: Μια δομημένη αναπαράσταση ενός μεγέθους ΕΕ σύμφωνα με το πρότυπο EN 13402. @el
comment: Una representación estructurada de una talla de la UE según EN 13402. @es
comment: ELi suuruse struktureeritud esitus vastavalt standardile EN 13402. @et
comment: EU-koon strukturoitu esitys standardin EN 13402 mukaisesti. @fi
comment: Une représentation structurée d'une taille de l'UE selon EN 13402. @fr
comment: Léiriú struchtúrtha ar mhéid de chuid an AE de réir EN 13402. @ga
comment: Strukturirani prikaz veličine u EU-u prema EN 13402. @hr
comment: Egy EU-méret strukturált megjelenítése az EN 13402 szerint. @hu
comment: Una rappresentazione strutturata di una taglia UE secondo EN 13402. @it
comment: Struktūruotas ES dydžio vaizdavimas pagal EN 13402. @lt
comment: Strukturēts ES izmēra atspoguļojums saskaņā ar EN 13402. @lv
comment: Rappreżentazzjoni strutturata ta' daqs tal-UE skont EN 13402. @mt
comment: Een gestructureerde weergave van een EU-maat volgens EN 13402. @nl
comment: Ustrukturyzowana reprezentacja rozmiaru UE zgodnie z EN 13402. @pl
comment: Uma representação estruturada de um tamanho da UE de acordo com a norma EN 13402. @pt
comment: O reprezentare structurată a unei mărimi UE conform EN 13402. @ro
comment: Štruktúrované vyjadrenie veľkosti EÚ podľa EN 13402. @sk
comment: Strukturirana predstavitev velikosti EU v skladu z EN 13402. @sl
comment: En strukturerad representation av en EU-storlek enligt EN 13402. @sv

EU Apparel Size
type: ObjectProperty
label: Размер на облеклото в ЕС @bg
label: Velikost oděvu EU @cs
label: EU-beklædningsstørrelse @da
label: EU-Bekleidungsgröße @de
label: Μέγεθος ενδυμάτων ΕΕ @el
label: Talla de ropa de la UE @es
label: ELi rõivasuurus @et
label: EU-vaatekoko @fi
label: Taille de vêtements de l'UE @fr
label: Méid Éadaí an AE @ga
label: Veličina odjeće u EU-u @hr
label: EU ruházati méret @hu
label: Taglia di abbigliamento UE @it
label: ES drabužių dydis @lt
label: ES apģērbu izmērs @lv
label: Daqs tal-Ilbies tal-UE @mt
label: EU-kledingmaat @nl
label: Rozmiar odzieży UE @pl
label: Tamanho de vestuário da UE @pt
label: Mărime de îmbrăcăminte UE @ro
label: Veľkosť odevu EÚ @sk
label: Velikost oblačila EU @sl
label: EU-klädstorlek @sv
comment: The structured EU specific size of the product based on body dimensions (e.g., EN 13402).
comment: Структурираният специфичен за ЕС размер на продукта въз основа на телесните размери (напр. EN 13402). @bg
comment: Strukturovaná specifická velikost produktu pro EU na základě tělesných rozměrů (např. EN 13402). @cs
comment: Den strukturerede EU-specifikke størrelse af produktet baseret på kropsdimensioner (f.eks. EN 13402). @da
comment: Die strukturierte EU-spezifische Größe des Produkts basierend auf Körpermaßen (z. B. EN 13402). @de
comment: Το δομημένο ειδικό για την ΕΕ μέγεθος του προϊόντος βάσει των διαστάσεων του σώματος (π.χ. EN 13402). @el
comment: El tamaño estructurado específico de la UE del producto basado en las dimensiones corporales (por ejemplo, EN 13402). @es
comment: Toote struktureeritud ELi-spetsiifiline suurus kehamõõtmete põhjal (nt EN 13402). @et
comment: Tuotteen strukturoitu EU-kohtainen koko vartalon mittojen perusteella (esim. EN 13402). @fi
comment: La taille structurée spécifique à l'UE du produit basée sur les dimensions corporelles (par ex. EN 13402). @fr
comment: Méid struchtúrtha sainiúil do AE an táirge bunaithe ar thoisí coirp (m.sh., EN 13402). @ga
comment: Strukturirana specifična veličina proizvoda u EU-u na temelju tjelesnih dimenzija (npr. EN 13402). @hr
comment: A termék strukturált EU-specifikus mérete a testméretek alapján (pl. EN 13402). @hu
comment: La taglia strutturata specifica dell'UE del prodotto basata sulle dimensioni del corpo (es. EN 13402). @it
comment: Struktūruotas konkretus ES produkto dydis pagal kūno matmenis (pvz., EN 13402). @lt
comment: Produkta strukturētais ES specifiskais izmērs, pamatojoties uz ķermeņa izmēriem (piemēram, EN 13402). @lv
comment: Id-daqs strutturat speċifiku għall-UE tal-prodott ibbażat fuq id-dimensjonijiet tal-ġisem (eż., EN 13402). @mt
comment: De gestructureerde EU-specifieke maat van het product op basis van lichaamsafmetingen (bijv. EN 13402). @nl
comment: Ustrukturyzowany rozmiar produktu specyficzny dla UE na podstawie wymiarów ciała (np. EN 13402). @pl
comment: O tamanho estruturado do produto específico da UE com base nas dimensões corporais (por exemplo, EN 13402). @pt
comment: Mărimea structurată specifică UE a produsului pe baza dimensiunilor corporale (de exemplu, EN 13402). @ro
comment: Štruktúrovaná špecifická veľkosť výrobku pre EÚ na základe telesných rozmerov (napr. EN 13402). @sk
comment: Strukturirana specifična velikost izdelka v EU na podlagi telesnih mer (npr. EN 13402). @sl
comment: Den strukturerade EU-specifika storleken på produkten baserad på kroppsmått (t.ex. EN 13402). @sv
domain: Product
range: EU Apparel Size Object

Size Designation
type: DatatypeProperty
label: Обозначение на размера @bg
label: Označení velikosti @cs
label: Størrelsesbetegnelse @da
label: Größenbezeichnung @de
label: Ονομασία μεγέθους @el
label: Designación de talla @es
label: Suuruse tähistus @et
label: Koon merkintä @fi
label: Désignation de la taille @fr
label: Ainmniú Méide @ga
label: Oznaka veličine @hr
label: Méretjelölés @hu
label: Designazione della taglia @it
label: Dydžio žymėjimas @lt
label: Izmēra apzīmējums @lv
label: Deżinjazzjoni tad-Daqs @mt
label: Maataanduiding @nl
label: Oznaczenie rozmiaru @pl
label: Designação de tamanho @pt
label: Desemnarea mărimii @ro
label: Označenie veľkosti @sk
label: Oznaka velikosti @sl
label: Storleksbeteckning @sv
comment: Identification of the clothing size by means of alphanumeric characters.
comment: Идентификация на размера на облеклото чрез буквено-цифрови знаци. @bg
comment: Identifikace velikosti oblečení pomocí alfanumerických znaků. @cs
comment: Identifikation af tøjstørrelsen ved hjælp af alfanumeriske tegn. @da
comment: Identifikation der Konfektionsgröße durch alphanumerische Zeichen. @de
comment: Αναγνώριση του μεγέθους ενδυμάτων μέσω αλφαριθμητικών χαρακτήρων. @el
comment: Identificación de la talla de ropa mediante caracteres alfanuméricos. @es
comment: Riietusesuuruse identifitseerimine tähtnumbriliste märkide abil. @et
comment: Vaatekoon tunnistaminen aakkosnumeerisilla merkeillä. @fi
comment: Identification de la taille des vêtements au moyen de caractères alphanumériques. @fr
comment: Sainaithint mhéid na n-éadaí trí charachtair alfa-uimhriúla. @ga
comment: Identifikacija veličine odjeće pomoću alfanumeričkih znakova. @hr
comment: A ruházati méret azonosítása alfanumerikus karakterekkel. @hu
comment: Identificazione della taglia di abbigliamento mediante caratteri alfanumerici. @it
comment: Drabužio dydžio identifikavimas naudojant raidinius-skaitmeninius simbolius. @lt
comment: Apģērba izmēra identifikācija ar burtciparu rakstzīmēm. @lv
comment: Identifikazzjoni tad-daqs tal-ilbies permezz ta' karattri alfanumeriċi. @mt
comment: Identificatie van de kledingmaat door middel van alfanumerieke tekens. @nl
comment: Identyfikacja rozmiaru odzieży za pomocą znaków alfanumerycznych. @pl
comment: Identificação do tamanho do vestuário através de caracteres alfanuméricos. @pt
comment: Identificarea mărimii îmbrăcămintei prin intermediul caracterelor alfanumerice. @ro
comment: Identifikácia veľkosti oblečenia pomocou alfanumerických znakov. @sk
comment: Identifikacija velikosti oblačil s pomočjo alfanumeričnih znakov. @sl
comment: Identifiering av klädstorlek med hjälp av alfanumeriska tecken. @sv
domain: EU Apparel Size Object
range: string

Cup Size
type: DatatypeProperty
label: Размер на чашката @bg
label: Velikost košíčku @cs
label: Skålstørrelse @da
label: Körbchengröße @de
label: Μέγεθος cup @el
label: Talla de copa @es
label: Korvi suurus @et
label: Kuppikoko @fi
label: Taille de bonnet @fr
label: Méid an Chupáin @ga
label: Veličina košarice @hr
label: Kosárméret @hu
label: Taglia coppa @it
label: Kauselio dydis @lt
label: Bļodiņas izmērs @lv
label: Daqs tat-Tazza @mt
label: Cupmaat @nl
label: Rozmiar miseczki @pl
label: Tamanho da copa @pt
label: Mărime cupă @ro
label: Veľkosť košíčka @sk
label: Velikost košarice @sl
label: Kupstorlek @sv
comment: Difference between bust girth and underbust girth.
comment: Разлика между гръдната обиколка и обиколката под гърдите. @bg
comment: Rozdíl mezi obvodem hrudníku a obvodem pod prsy. @cs
comment: Forskellen mellem brystvidde og underbrystvidde. @da
comment: Differenz zwischen Brustumfang und Unterbrustumfang. @de
comment: Διαφορά μεταξύ περιμέτρου στήθους και περιμέτρου κάτω από το στήθος. @el
comment: Diferencia entre el contorno de pecho y el contorno bajo el pecho. @es
comment: Rinnaümbermõõdu ja rinnaaluse ümbermõõdu vahe. @et
comment: Rinnanympäryksen ja rinnan alusympäryksen välinen ero. @fi
comment: Différence entre le tour de poitrine et le tour de dessous de poitrine. @fr
comment: An difríocht idir imlíne brollaigh agus imlíne faoi bhun an bhrollaigh. @ga
comment: Razlika između opsega prsa i opsega ispod prsa. @hr
comment: A mellbőség és a mell alatti bőség közötti különbség. @hu
comment: Differenza tra la circonferenza del seno e la circonferenza sottoseno. @it
comment: Skirtumas tarp krūtinės apimties ir apimties po krūtine. @lt
comment: Starpība starp krūšu apkārtmēru un apkārtmēru zem krūtīm. @lv
comment: Id-differenza bejn id-daqs tas-sider u d-daqs ta' taħt is-sider. @mt
comment: Verschil tussen borstomvang en onderborstomvang. @nl
comment: Różnica między obwodem klatki piersiowej a obwodem pod biustem. @pl
comment: Diferença entre o perímetro do peito e o perímetro debaixo do peito. @pt
comment: Diferența dintre circumferința bustului și circumferința de sub bust. @ro
comment: Rozdiel medzi obvodom pŕs a obvodom pod prsiami. @sk
comment: Razlika med obsegom prsi in obsegom pod prsmi. @sl
comment: Skillnaden mellan bystvidd och underbystvidd. @sv
domain: EU Apparel Size Object
range: string

Primary Dimension
type: ObjectProperty
label: Основен размер @bg
label: Primární rozměr @cs
label: Primær dimension @da
label: Primäre Abmessung @de
label: Κύρια διάσταση @el
label: Dimensión primaria @es
label: Põhimõõde @et
label: Ensisijainen mitta @fi
label: Dimension principale @fr
label: Toise Príomhúil @ga
label: Primarna dimenzija @hr
label: Elsődleges méret @hu
label: Dimensione primaria @it
label: Pagrindinis matmuo @lt
label: Primārais izmērs @lv
label: Dimensjoni Primarja @mt
label: Primaire afmeting @nl
label: Wymiar główny @pl
label: Dimensão primária @pt
label: Dimensiune principală @ro
label: Primárny rozmer @sk
label: Primär dimension @sv
comment: The primary body measurement (e.g., chest girth).
comment: Основното измерване на тялото (напр. гръдна обиколка). @bg
comment: Primární tělesné měření (např. obvod hrudníku). @cs
comment: Den primære kropsmåling (f.eks. brystvidde). @da
comment: Das primäre Körpermaß (z. B. Brustumfang). @de
comment: Η κύρια μέτρηση σώματος (π.χ. περίμετρος στήθους). @el
comment: La medida corporal principal (por ejemplo, contorno de pecho). @es
comment: Peamine kehamõõt (nt rinnaümbermõõt). @et
comment: Ensisijainen vartalon mitta (esim. rinnanympärys). @fi
comment: La mesure corporelle principale (par ex., tour de poitrine). @fr
comment: Príomhthomhas an choirp (m.sh., imlíne an chliabh). @ga
comment: Primarno mjerenje tijela (npr. opseg prsa). @hr
comment: Az elsődleges testméret (pl. mellbőség). @hu
comment: La misura corporea principale (es. circonferenza torace). @it
comment: Pagrindinis kūno matmuo (pvz., krūtinės apimtis). @lt
comment: Primārais ķermeņa mērījums (piemēram, krūšu apkārtmērs). @lv
comment: Il-kejl ewlieni tal-ġisem (eż., daqs tas-sider). @mt
comment: De primaire lichaamsmeting (bijv. borstomvang). @nl
comment: Główny wymiar ciała (np. obwód klatki piersiowej). @pl
comment: A medida corporal primária (por exemplo, perímetro do peito). @pt
comment: Măsura corporală principală (de exemplu, circumferința pieptului). @ro
comment: Primárne meranie tela (napr. obvod hrudníka). @sk
comment: Primarna telesna mera (npr. obseg prsi). @sl
comment: Det primära kroppsmåttet (t.ex. bröstvidd). @sv
domain: EU Apparel Size Object
range: Body Dimension Value

Primary Dimension Value
type: DatatypeProperty
label: Стойност на основния размер @bg
label: Hodnota primárního rozměru @cs
label: Værdi for primær dimension @da
label: Wert der primären Abmessung @de
label: Τιμή κύριας διάστασης @el
label: Valor de la dimensión primaria @es
label: Põhimõõtme väärtus @et
label: Ensisijaisen mitan arvo @fi
label: Valeur de la dimension principale @fr
label: Luach an Toise Phríomhúil @ga
label: Vrijednost primarne dimenzije @hr
label: Elsődleges méret értéke @hu
label: Valore della dimensione primaria @it
label: Pagrindinio matmens vertė @lt
label: Primārā izmēra vērtība @lv
label: Valur tad-Dimensjoni Primarja @mt
label: Waarde van primaire afmeting @nl
label: Wartość wymiaru głównego @pl
label: Valor da dimensão primária @pt
label: Valoarea dimensiunii principale @ro
label: Hodnota primárneho rozmeru @sk
label: Vrednost primarne dimenzije @sl
label: Värde för primär dimension @sv
comment: The range or value of the primary dimension.
comment: Обхватът или стойността на основния размер. @bg
comment: Rozsah nebo hodnota primárního rozměru. @cs
comment: Området eller værdien af den primære dimension. @da
comment: Der Bereich oder Wert der primären Abmessung. @de
comment: Το εύρος ή η τιμή της κύριας διάστασης. @el
comment: El rango o valor de la dimensión primaria. @es
comment: Põhimõõtme vahemik või väärtus. @et
comment: Ensisijaisen mitan alue tai arvo. @fi
comment: La plage ou la valeur de la dimension principale. @fr
comment: Raon nó luach an toise phríomhúil. @ga
comment: Raspon ili vrijednost primarne dimenzije. @hr
comment: Az elsődleges méret tartománya vagy értéke. @hu
comment: L'intervallo o il valore della dimensione primaria. @it
comment: Pagrindinio matmens diapazonas arba vertė. @lt
comment: Primārā izmēra diapazons vai vērtība. @lv
comment: Il-firxa jew il-valur tad-dimensjoni primarja. @mt
comment: Het bereik of de waarde van de primaire afmeting. @nl
comment: Zakres lub wartość wymiaru głównego. @pl
comment: O intervalo ou valor da dimensão primária. @pt
comment: Intervalul sau valoarea dimensiunii principale. @ro
comment: Rozsah alebo hodnota primárneho rozmeru. @sk
comment: Razpon ali vrednost primarne dimenzije. @sl
comment: Intervallet eller värdet för den primära dimensionen. @sv
domain: EU Apparel Size Object
range: string

Secondary Dimensions
type: ObjectProperty
label: Вторични размери @bg
label: Sekundární rozměry @cs
label: Sekundære dimensioner @da
label: Sekundäre Abmessungen @de
label: Δευτερεύουσες διαστάσεις @el
label: Dimensiones secundarias @es
label: Sekundaarsed mõõtmed @et
label: Toissijaiset mitat @fi
label: Dimensions secondaires @fr
label: Toisí Tánaisteacha @ga
label: Sekundarne dimenzije @hr
label: Másodlagos méretek @hu
label: Dimensioni secondarie @it
label: Antriniai matmenys @lt
label: Sekundārie izmēri @lv
label: Dimensjonijiet Sekondarji @mt
label: Secundaire afmetingen @nl
label: Wymiary dodatkowe @pl
label: Dimensões secundárias @pt
label: Dimensiuni secundare @ro
label: Sekundárne rozmery @sk
label: Sekundära dimensioner @sv
comment: Additional body measurements required for precision fit.
comment: Допълнителни измервания на тялото, необходими за прецизно прилягане. @bg
comment: Další tělesné míry potřebné pro přesné padnutí. @cs
comment: Yderligere kropsmål kræves for præcis pasform. @da
comment: Zusätzliche Körpermaße für eine präzise Passform erforderlich. @de
comment: Πρόσθετες μετρήσεις σώματος που απαιτούνται για εφαρμογή ακριβείας. @el
comment: Medidas corporales adicionales necesarias para un ajuste preciso. @es
comment: Täiendavad kehamõõtmed, mis on vajalikud täpseks sobivuseks. @et
comment: Lisävartalon mitat, joita tarvitaan tarkkaan istuvuuteen. @fi
comment: Mesures corporelles supplémentaires nécessaires pour un ajustement précis. @fr
comment: Tomhais choirp bhreise ag teastáil le haghaidh feisteas beacht. @ga
comment: Dodatne tjelesne mjere potrebne za precizno pristajanje. @hr
comment: További testméretek a pontos illeszkedéshez. @hu
comment: Misure corporee aggiuntive richieste per una vestibilità precisa. @it
comment: Papildomi kūno matavimai, reikalingi tiksliam prigludimui. @lt
comment: Papildu ķermeņa mērījumi, kas nepieciešami precīzai atbilstībai. @lv
comment: Kejl addizzjonali tal-ġisem meħtieġ għal qies preċiż. @mt
comment: Aanvullende lichaamsmaten vereist voor een nauwkeurige pasvorm. @nl
comment: Dodatkowe pomiary ciała wymagane do precyzyjnego dopasowania. @pl
comment: Medidas corporais adicionais necessárias para um ajuste preciso. @pt
comment: Măsurători corporale suplimentare necesare pentru o potrivire precisă. @ro
comment: Dodatočné telesné miery potrebné pre presné sadnutie. @sk
comment: Dodatne telesne mere, potrebne za natančno prileganje. @sl
comment: Ytterligare kroppsmått krävs för exakt passform. @sv
domain: EU Apparel Size Object
related match: size
related match: sizeCode

Dimension Name
type: ObjectProperty
label: Име на размера @bg
label: Název rozměru @cs
label: Dimensionsnavn @da
label: Name der Abmessung @de
label: Όνομα διάστασης @el
label: Nombre de la dimensión @es
label: Mõõtme nimi @et
label: Mitan nimi @fi
label: Nom de la dimension @fr
label: Ainm an Toise @ga
label: Naziv dimenzije @hr
label: Méret neve @hu
label: Nome della dimensione @it
label: Matmens pavadinimas @lt
label: Izmēra nosaukums @lv
label: Isem id-Dimensjoni @mt
label: Naam van de afmeting @nl
label: Nazwa wymiaru @pl
label: Nome da dimensão @pt
label: Numele dimensiunii @ro
label: Názov rozmeru @sk
label: Ime dimenzije @sl
label: Dimensionsnamn @sv
comment: The name of the secondary dimension (e.g., waist girth).
comment: Името на вторичния размер (напр. обиколка на талията). @bg
comment: Název sekundárního rozměru (např. obvod pasu). @cs
comment: Navnet på den sekundære dimension (f.eks. taljevidde). @da
comment: Der Name der sekundären Abmessung (z. B. Taillenumfang). @de
comment: Το όνομα της δευτερεύουσας διάστασης (π.χ. περίμετρος μέσης). @el
comment: El nombre de la dimensión secundaria (por ejemplo, contorno de cintura). @es
comment: Sekundaarse mõõtme nimi (nt vööümbermõõt). @et
comment: Toissijaisen mitan nimi (esim. vyötärönympärys). @fi
comment: Le nom de la dimension secondaire (par ex., tour de taille). @fr
comment: Ainm an toise thánaistigh (m.sh., imlíne an choim). @ga
comment: Naziv sekundarne dimenzije (npr. opseg struka). @hr
comment: A másodlagos méret neve (pl. derékbőség). @hu
comment: Il nome della dimensione secondaria (es. circonferenza vita). @it
comment: Antrinio matmens pavadinimas (pvz., juosmens apimtis). @lt
comment: Sekundārā izmēra nosaukums (piemēram, vidukļa apkārtmērs). @lv
comment: L-isem tad-dimensjoni sekondarja (eż., daqs tal-qadd). @mt
comment: De naam van de secundaire afmeting (bijv. tailleomvang). @nl
comment: Nazwa dodatkowego wymiaru (np. obwód talii). @pl
comment: O nome da dimensão secundária (por exemplo, perímetro da cintura). @pt
comment: Numele dimensiunii secundare (de exemplu, circumferința taliei). @ro
comment: Názov sekundárneho rozmeru (napr. obvod pása). @sk
comment: Ime sekundarne dimenzije (npr. obseg pasu). @sl
comment: Namnet på den sekundära dimensionen (t.ex. midjevidd). @sv
range: Body Dimension Value
related match: name
related match: characteristicName

Dimension Value
type: DatatypeProperty
label: Стойност на размера @bg
label: Hodnota rozměru @cs
label: Dimensionsværdi @da
label: Wert der Abmessung @de
label: Τιμή διάστασης @el
label: Valor de la dimensión @es
label: Mõõtme väärtus @et
label: Mitan arvo @fi
label: Valeur de la dimension @fr
label: Luach an Toise @ga
label: Vrijednost dimenzije @hr
label: Méret értéke @hu
label: Valore della dimensione @it
label: Matmens vertė @lt
label: Izmēra vērtība @lv
label: Valur tad-Dimensjoni @mt
label: Waarde van de afmeting @nl
label: Wartość wymiaru @pl
label: Valor da dimensão @pt
label: Valoarea dimensiunii @ro
label: Hodnota rozmeru @sk
label: Vrednost dimenzije @sl
label: Dimensionsvärde @sv
comment: The value or range of the secondary dimension.
comment: Стойността или обхватът на вторичния размер. @bg
comment: Hodnota nebo rozsah sekundárního rozměru. @cs
comment: Værdien eller området for den sekundære dimension. @da
comment: Der Wert oder Bereich der sekundären Abmessung. @de
comment: Η τιμή ή το εύρος της δευτερεύουσας διάστασης. @el
comment: El valor o rango de la dimensión secundaria. @es
comment: Sekundaarse mõõtme väärtus või vahemik. @et
comment: Toissijaisen mitan arvo tai alue. @fi
comment: La valeur ou la plage de la dimension secondaire. @fr
comment: Luach nó raon an toise thánaistigh. @ga
comment: Vrijednost ili raspon sekundarne dimenzije. @hr
comment: A másodlagos méret értéke vagy tartománya. @hu
comment: Il valore o l'intervallo della dimensione secondaria. @it
comment: Antrinio matmens vertė arba diapazonas. @lt
comment: Sekundārā izmēra vērtība vai diapazons. @lv
comment: Il-valur jew il-firxa tad-dimensjoni sekondarja. @mt
comment: De waarde of het bereik van de secundaire afmeting. @nl
comment: Wartość lub zakres dodatkowego wymiaru. @pl
comment: O valor ou intervalo da dimensão secundária. @pt
comment: Valoarea sau intervalul dimensiunii secundare. @ro
comment: Hodnota alebo rozsah sekundárneho rozmeru. @sk
comment: Vrednost ali razpon sekundarne dimenzije. @sl
comment: Värdet eller intervallet för den sekundära dimensionen. @sv
range: string
related match: value
related match: characteristicValue

Body Dimension Value
type: Class
label: Стойност на телесния размер @bg
label: Hodnota tělesného rozměru @cs
label: Kropsdimensionsværdi @da
label: Körpermaßwert @de
label: Τιμή διάστασης σώματος @el
label: Valor de la dimensión corporal @es
label: Kehamõõtme väärtus @et
label: Vartalon mitan arvo @fi
label: Valeur de la dimension corporelle @fr
label: Luach Toise an Choirp @ga
label: Vrijednost tjelesne dimenzije @hr
label: Testméret értéke @hu
label: Valore della dimensione corporea @it
label: Kūno matmens vertė @lt
label: Ķermeņa izmēra vērtība @lv
label: Valur tad-Dimensjoni tal-Ġisem @mt
label: Lichaamsafmetingswaarde @nl
label: Wartość wymiaru ciała @pl
label: Valor da dimensão corporal @pt
label: Valoarea dimensiunii corporale @ro
label: Hodnota telesného rozmeru @sk
label: Vrednost telesne mere @sl
label: Kroppsdimensionsvärde @sv
comment: An enumeration of allowed body dimensions for apparel sizing.
comment: Списък с разрешените телесни размери за определяне на размерите на облеклото. @bg
comment: Výčet povolených tělesných rozměrů pro určování velikostí oděvů. @cs
comment: En opregning af tilladte kropsdimensioner for beklædningsstørrelser. @da
comment: Eine Aufzählung der zulässigen Körpermaße für die Konfektionsgrößenbestimmung. @de
comment: Μια απαρίθμηση των επιτρεπόμενων διαστάσεων σώματος για τη διαστασιολόγηση ενδυμάτων. @el
comment: Una enumeración de las dimensiones corporales permitidas para el tallaje de ropa. @es
comment: Rõivasuuruste jaoks lubatud kehamõõtmete loetelu. @et
comment: Luettelo sallituista vartalon mitoista vaatekokojen määrittämiseksi. @fi
comment: Une énumération des dimensions corporelles autorisées pour les tailles de vêtements. @fr
comment: Áireamh de thoisí coirp a cheadaítear le haghaidh méideanna éadaí. @ga
comment: Prikaz dopuštenih tjelesnih dimenzija za određivanje veličina odjeće. @hr
comment: A ruházati méretezéshez engedélyezett testméretek felsorolása. @hu
comment: Un'enumerazione delle dimensioni corporee consentite per il dimensionamento dell'abbigliamento. @it
comment: Leidžiamų kūno matmenų, skirtų drabužių dydžiams, sąrašas. @lt
comment: Atļauto ķermeņa izmēru uzskaitījums apģērbu izmēru noteikšanai. @lv
comment: Elenku ta' dimensjonijiet tal-ġisem permessi għad-daqsijiet tal-ilbies. @mt
comment: Een opsomming van toegestane lichaamsafmetingen voor kledingmaten. @nl
comment: Wyliczenie dozwolonych wymiarów ciała dla rozmiarówki odzieży. @pl
comment: Uma enumeração de dimensões corporais permitidas para tamanhos de vestuário. @pt
comment: O enumerare a dimensiunilor corporale permise pentru mărimile de îmbrăcăminte. @ro
comment: Výpočet povolených telesných rozmerov pre určovanie veľkostí odevov. @sk
comment: Naštevanje dovoljenih telesnih mer za določanje velikosti oblačil. @sl
comment: En uppräkning av tillåtna kroppsmått för klädstorlekar. @sv
subclass of: Resource
one of: Chest girth
one of: Neck girth
one of: Waist girth
one of: Hip girth
one of: Height
one of: Bust girth
one of: Underbust girth
one of: Foot length
one of: Arm length
one of: Inside leg length
related match: QuantitativeValue

Chest girth
type: Body Dimension Value
label: Гръдна обиколка @bg
label: Obvod hrudníku @cs
label: Brystvidde @da
label: Brustumfang @de
label: Περίμετρος στήθους @el
label: Contorno de pecho @es
label: Rinnaümbermõõt @et
label: Rinnanympärys @fi
label: Tour de poitrine @fr
label: Imlíne cliabh @ga
label: Opseg prsa @hr
label: Mellbőség @hu
label: Circonferenza torace @it
label: Krūtinės apimtis @lt
label: Krūšu apkārtmērs @lv
label: Daqs tas-sider @mt
label: Borstomvang @nl
label: Obwód klatki piersiowej @pl
label: Perímetro do peito @pt
label: Circumferința pieptului @ro
label: Obvod hrudníka @sk
label: Obseg prsi @sl
label: Bröstvidd @sv
comment: The measurement of the chest girth.
comment: Измерване на гръдната обиколка. @bg
comment: Měření obvodu hrudníku. @cs
comment: Måling af brystvidde. @da
comment: Die Messung des Brustumfangs. @de
comment: Μέτρηση της περιμέτρου του στήθους. @el
comment: La medida del contorno de pecho. @es
comment: Rinnaümbermõõdu mõõtmine. @et
comment: Rinnanympäryksen mittaus. @fi
comment: La mesure du tour de poitrine. @fr
comment: Tomhas imlíne an chliabh. @ga
comment: Mjerenje opsega prsa. @hr
comment: A mellbőség mérése. @hu
comment: La misurazione della circonferenza del torace. @it
comment: Krūtinės apimties matavimas. @lt
comment: Krūšu apkārtmēra mērījums. @lv
comment: Il-kejl tad-daqs tas-sider. @mt
comment: De meting van de borstomvang. @nl
comment: Pomiar obwodu klatki piersiowej. @pl
comment: A medição do perímetro do peito. @pt
comment: Măsurarea circumferinței pieptului. @ro
comment: Meranie obvodu hrudníka. @sk
comment: Merjenje obsega prsi. @sl
comment: Mätning av bröstvidd. @sv
related match: size
related match: sizeCode

Neck girth
type: Body Dimension Value
label: Обиколка на врата @bg
label: Obvod krku @cs
label: Halsvidde @da
label: Halsumfang @de
label: Περίμετρος λαιμού @el
label: Contorno de cuello @es
label: Kaelaümbermõõt @et
label: Kaulanympärys @fi
label: Tour de cou @fr
label: Imlíne muiníl @ga
label: Opseg vrata @hr
label: Nyakbőség @hu
label: Circonferenza collo @it
label: Kaklo apimtis @lt
label: Kakla apkārtmērs @lv
label: Daqs tal-għonq @mt
label: Halsomvang @nl
label: Obwód szyi @pl
label: Perímetro do pescoço @pt
label: Circumferința gâtului @ro
label: Obseg vratu @sl
label: Halsvidd @sv
comment: The measurement of the neck girth.
comment: Измерване на обиколката на врата. @bg
comment: Měření obvodu krku. @cs
comment: Måling af halsvidde. @da
comment: Die Messung des Halsumfangs. @de
comment: Μέτρηση της περιμέτρου του λαιμού. @el
comment: La medida del contorno de cuello. @es
comment: Kaelaümbermõõdu mõõtmine. @et
comment: Kaulanympäryksen mittaus. @fi
comment: La mesure du tour de cou. @fr
comment: Tomhas imlíne an mhuiníl. @ga
comment: Mjerenje opsega vrata. @hr
comment: A nyakbőség mérése. @hu
comment: La misurazione della circonferenza del collo. @it
comment: Kaklo apimties matavimas. @lt
comment: Kakla apkārtmēra mērījums. @lv
comment: Il-kejl tad-daqs tal-għonq. @mt
comment: De meting van de halsomvang. @nl
comment: Pomiar obwodu szyi. @pl
comment: A medição do perímetro do pescoço. @pt
comment: Măsurarea circumferinței gâtului. @ro
comment: Meranie obvodu krku. @sk
comment: Merjenje obsega vratu. @sl
comment: Mätning av halsvidd. @sv
related match: size
related match: sizeCode

Waist girth
type: Body Dimension Value
label: Обиколка на талията @bg
label: Obvod pasu @cs
label: Taljevidde @da
label: Taillenumfang @de
label: Περίμετρος μέσης @el
label: Contorno de cintura @es
label: Vööümbermõõt @et
label: Vyötärönympärys @fi
label: Tour de taille @fr
label: Imlíne coim @ga
label: Opseg struka @hr
label: Derékbőség @hu
label: Circonferenza vita @it
label: Juosmens apimtis @lt
label: Vidukļa apkārtmērs @lv
label: Daqs tal-qadd @mt
label: Tailleomvang @nl
label: Obwód talii @pl
label: Perímetro da cintura @pt
label: Circumferința taliei @ro
label: Obvod pása @sk
label: Obseg pasu @sl
label: Midjevidd @sv
comment: The measurement of the waist girth.
comment: Измерване на обиколката на талията. @bg
comment: Měření obvodu pasu. @cs
comment: Måling af taljevidde. @da
comment: Die Messung des Taillenumfangs. @de
comment: Μέτρηση της περιμέτρου της μέσης. @el
comment: La medida del contorno de cintura. @es
comment: Vööümbermõõdu mõõtmine. @et
comment: Vyötärönympäryksen mittaus. @fi
comment: La mesure du tour de taille. @fr
comment: Tomhas imlíne an choim. @ga
comment: Mjerenje opsega struka. @hr
comment: A derékbőség mérése. @hu
comment: La misurazione della circonferenza della vita. @it
comment: Juosmens apimties matavimas. @lt
comment: Vidukļa apkārtmēra mērījums. @lv
comment: Il-kejl tad-daqs tal-qadd. @mt
comment: De meting van de tailleomvang. @nl
comment: Pomiar obwodu talii. @pl
comment: A medição do perímetro da cintura. @pt
comment: Măsurarea circumferinței taliei. @ro
comment: Meranie obvodu pása. @sk
comment: Merjenje obsega pasu. @sl
comment: Mätning av midjevidd. @sv
related match: size
related match: sizeCode

Hip girth
type: Body Dimension Value
label: Обиколка на ханша @bg
label: Obvod boků @cs
label: Hoftevidde @da
label: Hüftumfang @de
label: Περίμετρος γοφών @el
label: Contorno de cadera @es
label: Puusaümbermõõt @et
label: Lantionympärys @fi
label: Tour de hanches @fr
label: Imlíne cromáin @ga
label: Opseg bokova @hr
label: Csípőbőség @hu
label: Circonferenza fianchi @it
label: Klubų apimtis @lt
label: Gurnu apkārtmērs @lv
label: Daqs tal-ġenbejn @mt
label: Heupomvang @nl
label: Obwód bioder @pl
label: Perímetro da anca @pt
label: Circumferința șoldurilor @ro
label: Obvod bokov @sk
label: Obseg bokov @sl
label: Höftvidd @sv
comment: The measurement of the hip girth.
comment: Измерване на обиколката на ханша. @bg
comment: Měření obvodu boků. @cs
comment: Måling af hoftevidde. @da
comment: Die Messung des Hüftumfangs. @de
comment: Μέτρηση της περιμέτρου των γοφών. @el
comment: La medida del contorno de cadera. @es
comment: Puusaümbermõõdu mõõtmine. @et
comment: Lantionympäryksen mittaus. @fi
comment: La mesure du tour de hanches. @fr
comment: Tomhas imlíne an chromáin. @ga
comment: Mjerenje opsega bokova. @hr
comment: A csípőbőség mérése. @hu
comment: La misurazione della circonferenza dei fianchi. @it
comment: Klubų apimties matavimas. @lt
comment: Gurnu apkārtmēra mērījums. @lv
comment: Il-kejl tad-daqs tal-ġenbejn. @mt
comment: De meting van de heupomvang. @nl
comment: Pomiar obwodu bioder. @pl
comment: A medição do perímetro da anca. @pt
comment: Măsurarea circumferinței șoldurilor. @ro
comment: Meranie obvodu bokov. @sk
comment: Merjenje obsega bokov. @sl
comment: Mätning av höftvidd. @sv
related match: size
related match: sizeCode

Height
type: Body Dimension Value
label: Височина @bg
label: Výška @cs
label: Højde @da
label: Körpergröße @de
label: Ύψος @el
label: Estatura @es
label: Pikkus @et
label: Pituus @fi
label: Taille @fr
label: Airde @ga
label: Visina @hr
label: Testmagasság @hu
label: Altezza @it
label: Ūgis @lt
label: Augums @lv
label: Għoli @mt
label: Lichaamslengte @nl
label: Wzrost @pl
label: Altura @pt
label: Înălțime @ro
label: Višina @sl
label: Kroppslängd @sv
comment: The measurement of the body height.
comment: Измерване на височината на тялото. @bg
comment: Měření tělesné výšky. @cs
comment: Måling af kropshøjde. @da
comment: Die Messung der Körpergröße. @de
comment: Μέτρηση του ύψους του σώματος. @el
comment: La medida de la estatura corporal. @es
comment: Kehapikkuse mõõtmine. @et
comment: Vartalon pituuden mittaus. @fi
comment: La mesure de la taille corporelle. @fr
comment: Tomhas airde an choirp. @ga
comment: Mjerenje visine tijela. @hr
comment: A testmagasság mérése. @hu
comment: La misurazione dell'altezza del corpo. @it
comment: Kūno ūgio matavimas. @lt
comment: Ķermeņa auguma mērījums. @lv
comment: Il-kejl tal-għoli tal-ġisem. @mt
comment: De meting van de lichaamslengte. @nl
comment: Pomiar wzrostu ciała. @pl
comment: A medição da altura corporal. @pt
comment: Măsurarea înălțimii corpului. @ro
comment: Meranie telesnej výšky. @sk
comment: Merjenje telesne višine. @sl
comment: Mätning av kroppslängd. @sv
related match: height

Bust girth
type: Body Dimension Value
label: Обиколка на бюста @bg
label: Obvod přes prsa @cs
label: Brystvidde @da
label: Brustumfang @de
label: Περίμετρος στήθους @el
label: Contorno de busto @es
label: Rinnaümbermõõt @et
label: Rinnanympärys @fi
label: Tour de poitrine @fr
label: Imlíne brollaigh @ga
label: Opseg prsa @hr
label: Mellbőség @hu
label: Circonferenza seno @it
label: Krūtinės apimtis @lt
label: Krūšu apkārtmērs @lv
label: Daqs tal-bust @mt
label: Borstomvang @nl
label: Obwód biustu @pl
label: Perímetro do busto @pt
label: Circumferința bustului @ro
label: Obvod pŕs @sk
label: Obseg prsi @sl
label: Bystvidd @sv
comment: The measurement of the bust girth.
comment: Измерване на обиколката на бюста. @bg
comment: Měření obvodu přes prsa. @cs
comment: Måling af brystvidde. @da
comment: Die Messung des Brustumfangs. @de
comment: Μέτρηση της περιμέτρου του στήθους. @el
comment: La medida del contorno de busto. @es
comment: Rinnaümbermõõdu mõõtmine. @et
comment: Rinnanympäryksen mittaus. @fi
comment: La mesure du tour de poitrine. @fr
comment: Tomhas imlíne an bhrollaigh. @ga
comment: Mjerenje opsega prsa. @hr
comment: A mellbőség mérése. @hu
comment: La misurazione della circonferenza del seno. @it
comment: Krūtinės apimties matavimas. @lt
comment: Krūšu apkārtmēra mērījums. @lv
comment: Il-kejl tad-daqs tal-bust. @mt
comment: De meting van de borstomvang. @nl
comment: Pomiar obwodu biustu. @pl
comment: A medição do perímetro do busto. @pt
comment: Măsurarea circumferinței bustului. @ro
comment: Meranie obvodu pŕs. @sk
comment: Merjenje obsega prsi. @sl
comment: Mätning av bystvidd. @sv
related match: size
related match: sizeCode

Underbust girth
type: Body Dimension Value
label: Обиколка под гърдите @bg
label: Obvod pod prsy @cs
label: Underbrystvidde @da
label: Unterbrustumfang @de
label: Περίμετρος κάτω από το στήθος @el
label: Contorno bajo pecho @es
label: Rinnaalune ümbermõõt @et
label: Rinnan alusympärys @fi
label: Tour de dessous de poitrine @fr
label: Imlíne faoi bhun an bhrollaigh @ga
label: Opseg ispod prsa @hr
label: Mell alatti bőség @hu
label: Circonferenza sottoseno @it
label: Apimtis po krūtine @lt
label: Apkārtmērs zem krūtīm @lv
label: Daqs ta' taħt il-bust @mt
label: Onderborstomvang @nl
label: Obwód pod biustem @pl
label: Perímetro debaixo do peito @pt
label: Circumferință sub bust @ro
label: Obvod pod prsiami @sk
label: Obseg pod prsmi @sl
label: Underbystvidd @sv
comment: The measurement of the underbust girth.
comment: Измерване на обиколката под гърдите. @bg
comment: Měření obvodu pod prsy. @cs
comment: Måling af underbrystvidde. @da
comment: Die Messung des Unterbrustumfangs. @de
comment: Μέτρηση της περιμέτρου κάτω από το στήθος. @el
comment: La medida del contorno bajo pecho. @es
comment: Rinnaaluse ümbermõõdu mõõtmine. @et
comment: Rinnan alusympäryksen mittaus. @fi
comment: La mesure du tour de dessous de poitrine. @fr
comment: Tomhas imlíne faoi bhun an bhrollaigh. @ga
comment: Mjerenje opsega ispod prsa. @hr
comment: A mell alatti bőség mérése. @hu
comment: La misurazione della circonferenza sottoseno. @it
comment: Apimties po krūtine matavimas. @lt
comment: Apkārtmēra zem krūtīm mērījums. @lv
comment: Il-kejl tad-daqs ta' taħt il-bust. @mt
comment: De meting van de onderborstomvang. @nl
comment: Pomiar obwodu pod biustem. @pl
comment: A medição do perímetro debaixo do peito. @pt
comment: Măsurarea circumferinței sub bust. @ro
comment: Meranie obvodu pod prsiami. @sk
comment: Merjenje obsega pod prsmi. @sl
comment: Mätning av underbystvidd. @sv
related match: size
related match: sizeCode

Foot length
type: Body Dimension Value
label: Дължина на стъпалото @bg
label: Délka chodidla @cs
label: Fodlængde @da
label: Fußlänge @de
label: Μήκος ποδιού @el
label: Longitud del pie @es
label: Jalaba pikkus @et
label: Jalan pituus @fi
label: Longueur du pied @fr
label: Fad coise @ga
label: Duljina stopala @hr
label: Lábfej hossza @hu
label: Lunghezza del piede @it
label: Pėdos ilgis @lt
label: Pēdas garums @lv
label: Tul is-sieq @mt
label: Voetlengte @nl
label: Długość stopy @pl
label: Comprimento do pé @pt
label: Lungimea tălpii @ro
label: Dĺžka chodidla @sk
label: Dolžina stopala @sl
label: Fotlängd @sv
comment: The measurement of the foot length.
comment: Измерване на дължината на стъпалото. @bg
comment: Měření délky chodidla. @cs
comment: Måling af fodlængde. @da
comment: Die Messung der Fußlänge. @de
comment: Μέτρηση του μήκους του ποδιού. @el
comment: La medida de la longitud del pie. @es
comment: Jalaba pikkuse mõõtmine. @et
comment: Jalan pituuden mittaus. @fi
comment: La mesure de la longueur du pied. @fr
comment: Tomhas fhad na coise. @ga
comment: Mjerenje duljine stopala. @hr
comment: A lábfej hosszának mérése. @hu
comment: La misurazione della lunghezza del piede. @it
comment: Pėdos ilgio matavimas. @lt
comment: Pēdas garuma mērījums. @lv
comment: Il-kejl tat-tul tas-sieq. @mt
comment: De meting van de voetlengte. @nl
comment: Pomiar długości stopy. @pl
comment: A medição do comprimento do pé. @pt
comment: Măsurarea lungimii tălpii. @ro
comment: Meranie dĺžky chodidla. @sk
comment: Merjenje dolžine stopala. @sl
comment: Mätning av fotlängd. @sv
related match: size
related match: sizeCode

Arm length
type: Body Dimension Value
label: Дължина на ръката @bg
label: Délka paže @cs
label: Armlængde @da
label: Armlänge @de
label: Μήκος χεριού @el
label: Longitud del brazo @es
label: Käe pikkus @et
label: Käsivarren pituus @fi
label: Longueur du bras @fr
label: Fad láimhe @ga
label: Duljina ruke @hr
label: Kar hossza @hu
label: Lunghezza del braccio @it
label: Rankos ilgis @lt
label: Rokas garums @lv
label: Tul id-driegħ @mt
label: Armlengte @nl
label: Długość ramienia @pl
label: Comprimento do braço @pt
label: Lungimea brațului @ro
label: Dĺžka paže @sk
label: Dolžina roke @sl
label: Armlängd @sv
comment: The measurement of the arm length.
comment: Измерване на дължината на ръката. @bg
comment: Měření délky paže. @cs
comment: Måling af armlængde. @da
comment: Die Messung der Armlänge. @de
comment: Μέτρηση του μήκους του χεριού. @el
comment: La medida de la longitud del brazo. @es
comment: Käe pikkuse mõõtmine. @et
comment: Käsivarren pituuden mittaus. @fi
comment: La mesure de la longueur du bras. @fr
comment: Tomhas fhad na láimhe. @ga
comment: Mjerenje duljine ruke. @hr
comment: A kar hosszának mérése. @hu
comment: La misurazione della lunghezza del braccio. @it
comment: Rankos ilgio matavimas. @lt
comment: Rokas garuma mērījums. @lv
comment: Il-kejl tat-tul tad-driegħ. @mt
comment: De meting van de armlengte. @nl
comment: Pomiar długości ramienia. @pl
comment: A medição do comprimento do braço. @pt
comment: Măsurarea lungimii brațului. @ro
comment: Meranie dĺžky paže. @sk
comment: Merjenje dolžine roke. @sl
comment: Mätning av armlängd. @sv
related match: size
related match: sizeCode

Inside leg length
type: Body Dimension Value
label: Дължина на вътрешната страна на крака @bg
label: Vnitřní délka nohy @cs
label: Indvendig benlængde @da
label: Innere Beinlänge @de
label: Εσωτερικό μήκος ποδιού @el
label: Longitud interior de la pierna @es
label: Sisejala pikkus @et
label: Sisäsauman pituus @fi
label: Longueur de l'entrejambe @fr
label: Fad cos istigh @ga
label: Duljina unutarnje strane noge @hr
label: Belső szárhossz @hu
label: Lunghezza interno gamba @it
label: Vidinė kojos ilgio @lt
label: Kājas iekšējais garums @lv
label: Tul ta' ġewwa tar-riġel @mt
label: Binnenbeenlengte @nl
label: Długość nogawki wewnętrznej @pl
label: Comprimento interior da perna @pt
label: Lungimea interioară a piciorului @ro
label: Vnútorná dĺžka nohy @sk
label: Notranja dolžina noge @sl
label: Innerbenslängd @sv
comment: The measurement of the inside leg length.
comment: Измерване на дължината на вътрешната страна на крака. @bg
comment: Měření vnitřní délky nohy. @cs
comment: Måling af indvendig benlængde. @da
comment: Die Messung der inneren Beinlänge. @de
comment: Μέτρηση του εσωτερικού μήκους του ποδιού. @el
comment: La medida de la longitud interior de la pierna. @es
comment: Sisejala pikkuse mõõtmine. @et
comment: Sisäsauman pituuden mittaus. @fi
comment: La mesure de la longueur de l'entrejambe. @fr
comment: Tomhas fhad cos istigh. @ga
comment: Mjerenje duljine unutarnje strane noge. @hr
comment: A belső szárhossz mérése. @hu
comment: La misurazione della lunghezza interno gamba. @it
comment: Vidinės kojos ilgio matavimas. @lt
comment: Kājas iekšējā garuma mērījums. @lv
comment: Il-kejl tat-tul ta' ġewwa tar-riġel. @mt
comment: De meting van de binnenbeenlengte. @nl
comment: Pomiar długości nogawki wewnętrznej. @pl
comment: A medição do comprimento interior da perna. @pt
comment: Măsurarea lungimii interioare a piciorului. @ro
comment: Meranie vnútornej dĺžky nohy. @sk
comment: Merjenje notranje dolžine noge. @sl
comment: Mätning av innerbenslängd. @sv
related match: size
related match: sizeCode