DPP Battery Sector Ontology
type: Ontology
version info: v3
title: Онтология на сектора на батериите по DPP @bg
title: Ontologie odvětví baterií DPP @cs
title: DPP-batterisektorens ontologi @da
title: DPP-Batteriesektor-Ontologie @de
title: Οντολογία τομέα μπαταριών DPP @el
title: Ontología del sector de las baterías DPP @es
title: DPP patareide sektori ontoloogia @et
title: DPP-akkualan ontologia @fi
title: Ontologie du secteur des batteries DPP @fr
title: Teangeolaíocht Earnáil na gCeallraí DPP @ga
title: Ontologija sektora baterija DPP-a @hr
title: DPP akkumulátor ágazati ontológia @hu
title: Ontologia del settore delle batterie DPP @it
title: DPP baterijų sektoriaus ontologija @lt
title: DPP akumulatoru nozares ontoloģija @lv
title: Ontoloġija tas-Settur tal-Batteriji tad-DPP @mt
title: DPP-batterijsectorontologie @nl
title: Ontologia sektora baterii DPP @pl
title: Ontologia do Setor de Baterias DPP @pt
title: Ontologia sectorului de baterii DPP @ro
title: Ontológia odvetvia batérií DPP @sk
title: Ontologija sektorja baterij DPP @sl
title: DPP-batterisektorns ontologi @sv
description: Defines the specific data model for the EU Battery Passport, including battery-specific properties, materials, and regulatory information.
description: Определя специфичния модел на данните за паспорта на батерията на ЕС, включително специфични за батерията свойства, материали и регулаторна информация. @bg
description: Definuje specifický datový model pro pas baterie EU, včetně vlastností specifických pro baterii, materiálů a regulačních informací. @cs
description: Definerer den specifikke datamodel for EU-batteripasset, herunder batterispecifikke egenskaber, materialer og lovgivningsmæssige oplysninger. @da
description: Definiert das spezifische Datenmodell für den EU-Batteriepass, einschließlich batteriespezifischer Eigenschaften, Materialien und regulatorischer Informationen. @de
description: Καθορίζει το ειδικό μοντέλο δεδομένων για το διαβατήριο μπαταριών της ΕΕ, συμπεριλαμβανομένων των ειδικών για τις μπαταρίες ιδιοτήτων, υλικών και κανονιστικών πληροφοριών. @el
description: Define el modelo de datos específico para el pasaporte de baterías de la UE, incluidas las propiedades, los materiales y la información reglamentaria específicos de las baterías. @es
description: Määratleb ELi akupassi spetsiifilise andmemudeli, sealhulgas akuspetsiifilised omadused, materjalid ja regulatiivse teabe. @et
description: Määrittelee EU:n akupassin erityisen tietomallin, mukaan lukien akkukohtaiset ominaisuudet, materiaalit ja sääntelytiedot. @fi
description: Définit le modèle de données spécifique pour le passeport européen des batteries, y compris les propriétés, les matériaux et les informations réglementaires spécifiques aux batteries. @fr
description: Sainmhíníonn sé an tsamhail sonraí shonrach do Phas Ceallraí an AE, lena n-áirítear airíonna, ábhair agus faisnéis rialála a bhaineann go sonrach le ceallraí. @ga
description: Definira specifični podatkovni model za putovnicu za baterije EU-a, uključujući svojstva, materijale i regulatorne informacije specifične za baterije. @hr
description: Meghatározza az uniós akkumulátor-útlevél egyedi adatmodelljét, beleértve az akkumulátor-specifikus tulajdonságokat, anyagokat és szabályozási információkat. @hu
description: Definisce il modello di dati specifico per il passaporto delle batterie dell'UE, comprese le proprietà, i materiali e le informazioni normative specifiche delle batterie. @it
description: Apibrėžia konkretų ES baterijos paso duomenų modelį, įskaitant konkrečias baterijos savybes, medžiagas ir reguliavimo informaciją. @lt
description: Definē īpašu datu modeli ES bateriju pasei, tostarp baterijām raksturīgās īpašības, materiālus un normatīvo informāciju. @lv
description: Jiddefinixxi l-mudell tad-dejta speċifiku għall-Passaport tal-Batteriji tal-UE, inklużi l-proprjetajiet, il-materjali u l-informazzjoni regolatorja speċifiċi għall-batteriji. @mt
description: Definieert het specifieke gegevensmodel voor het EU-batterijpaspoort, met inbegrip van batterijspecifieke eigenschappen, materialen en regelgevingsinformatie. @nl
description: Definiuje specyficzny model danych dla unijnego paszportu baterii, w tym właściwości, materiały i informacje regulacyjne dotyczące baterii. @pl
description: Define o modelo de dados específico para o Passaporte de Bateria da UE, incluindo propriedades, materiais e informações regulamentares específicas da bateria. @pt
description: Definește modelul de date specific pentru pașaportul european pentru baterii, inclusiv proprietățile, materialele și informațiile de reglementare specifice bateriilor. @ro
description: Definuje špecifický dátový model pre pas batérie EÚ vrátane vlastností, materiálov a regulačných informácií špecifických pre batérie. @sk
description: Določa posebni podatkovni model za potni list EU za baterije, vključno z lastnostmi, materiali in regulativnimi informacijami, specifičnimi za baterije. @sl
description: Definierar den specifika datamodellen för EU:s batteripass, inklusive batterispecifika egenskaper, material och lagstadgad information. @sv
imports: Product.jsonld
imports: EPD.jsonld
imports: DoPC.jsonld
imports: RelatedResource.jsonld
imports: Organization.jsonld

Battery Product
type: Class
subclass of: Product
label: Продукт батерия @bg
label: Bateriový produkt @cs
label: Batteriprodukt @da
label: Batterieprodukt @de
label: Προϊόν μπαταρίας @el
label: Producto de batería @es
label: Akutoode @et
label: Akkutuote @fi
label: Produit de batterie @fr
label: Táirge Ceallraí @ga
label: Baterijski proizvod @hr
label: Akkumulátor termék @hu
label: Prodotto a batteria @it
label: Baterijos gaminys @lt
label: Akumulatora produkts @lv
label: Prodott tal-batterija @mt
label: Batterijproduct @nl
label: Produkt bateryjny @pl
label: Produto de bateria @pt
label: Produs de baterie @ro
label: Batériový produkt @sk
label: Baterijski izdelek @sl
comment: Data model for the Battery Passport according to EU Battery Regulation.
comment: Модел на данни за паспорта на батерията съгласно Регламента на ЕС за батериите. @bg
comment: Datový model pro pas baterie podle nařízení EU o bateriích. @cs
comment: Datamodel for batteripasset i henhold til EU's batteriforordning. @da
comment: Datenmodell für den Batteriepass gemäß der EU-Batterieverordnung. @de
comment: Μοντέλο δεδομένων για το διαβατήrio μπαταριών σύμφωνα με τον κανονισμό της ΕΕ για τις μπαταρίες. @el
comment: Modelo de datos para el pasaporte de baterías según el Reglamento de baterías de la UE. @es
comment: Akupassi andmemudel vastavalt ELi akumäärustikule. @et
comment: Akkupassin tietomalli EU:n akkuasetuksen mukaisesti. @fi
comment: Modèle de données pour le passeport des batteries conformément au règlement de l'UE sur les batteries. @fr
comment: Mionsamhail sonraí don Phas Ceallraí de réir Rialachán an AE maidir le Ceallraí. @ga
comment: Podatkovni model za putovnicu za baterije u skladu s Uredbom EU-a o baterijama. @hr
comment: Az akkumulátor-útlevél adatmodellje az EU akkumulátor-rendelete szerint. @hu
comment: Modello di dati per il passaporto delle batterie secondo il regolamento UE sulle batterie. @it
comment: Baterijos paso duomenų modelis pagal ES baterijų reglamentą. @lt
comment: Bateriju pases datu modelis saskaņā ar ES Bateriju regulu. @lv
comment: Mudell tad-dejta għall-Passaport tal-Batteriji skont ir-Regolament tal-UE dwar il-Batteriji. @mt
comment: Gegevensmodel voor het batterijpaspoort volgens de EU-batterijverordening. @nl
comment: Model danych dla paszportu baterii zgodnie z rozporządzeniem UE w sprawie baterii. @pl
comment: Modelo de dados para o Passaporte de Bateria de acordo com o Regulamento de Baterias da UE. @pt
comment: Model de date pentru pașaportul pentru baterii în conformitate cu Regulamentul UE privind bateriile. @ro
comment: Dátový model pre pas batérie podľa nariadenia EÚ o batériách. @sk
comment: Podatkovni model za potni list za baterije v skladu z uredbo EU o baterijah. @sl
comment: Datamodell för batteripasset enligt EU:s batteriförordning. @sv

Performance and Durability
type: Class
governed by: DIN DKE SPEC 99100
source: Source: ESPR - Annex XIII (1)
label: Производителност и издръжливост @bg
label: Výkon a životnost @cs
label: Ydeevne og holdbarhed @da
label: Leistung und Haltbarkeit @de
label: Απόδοση και ανθεκτικότητα @el
label: Rendimiento y durabilidad @es
label: Toimivus ja vastupidavus @et
label: Suorituskyky ja kestävyys @fi
label: Performance et durabilité @fr
label: Feidhmíocht agus Marthanacht @ga
label: Performanse i trajnost @hr
label: Teljesítmény és tartósság @hu
label: Prestazioni e durata @it
label: Našumas ir ilgaamžiškumas @lt
label: Veiktspēja un izturība @lv
label: Prestazzjoni u Durabilità @mt
label: Prestaties en duurzaamheid @nl
label: Wydajność i trwałość @pl
label: Desempenho e Durabilidade @pt
label: Performanță și durabilitate @ro
label: Výkon a životnosť @sk
label: Zmogljivost in trajnost @sl
label: Prestanda och hållbarhet @sv
comment: Container for performance and durability parameters of the battery.
comment: Контейнер за параметрите на производителността и издръжливостта на батерията. @bg
comment: Kontejner pro parametry výkonu a životnosti baterie. @cs
comment: Beholder til ydeevne- og holdbarhedsparametre for batteriet. @da
comment: Container für Leistungs- und Haltbarkeitsparameter der Batterie. @de
comment: Δοχείο για τις παραμέτρους απόδοσης και ανθεκτικότητας της μπαταρίας. @el
comment: Contenedor para los parámetros de rendimiento y durabilidad de la batería. @es
comment: Aku jõudluse ja vastupidavuse parameetrite konteiner. @et
comment: Säiliö akun suorituskyky- ja kestävyysparametreille. @fi
comment: Conteneur pour les paramètres de performance et de durabilité de la batterie. @fr
comment: Coimeádán do pharaiméadair feidhmíochta agus marthanachta na ceallraí. @ga
comment: Spremnik za parametre performansi i trajnosti baterije. @hr
comment: Konténer az akkumulátor teljesítmény- és tartóssági paramétereihez. @hu
comment: Contenitore per i parametri di prestazione e durata della batteria. @it
comment: Konteineris akumuliatoriaus našumo ir ilgaamžiškumo parametrams. @lt
comment: Konteiners akumulatora veiktspējas un izturības parametriem. @lv
comment: Kontenitur għall-parametri tal-prestazzjoni u d-durabilità tal-batterija. @mt
comment: Container voor prestatie- en duurzaamheidsparameters van de batterij. @nl
comment: Pojemnik na parametry wydajności i trwałości baterii. @pl
comment: Recipiente para parâmetros de desempenho e durabilidade da bateria. @pt
comment: Container pentru parametrii de performanță și durabilitate ai bateriei. @ro
comment: Kontajner pre parametre výkonu a životnosti batérie. @sk
comment: Vsebnik za parametre zmogljivosti in trajnosti baterije. @sl
comment: Behållare för prestanda- och hållbarhetsparametrar för batteriet. @sv
related match: PropertyValue
related match: AdditionalProductClassificationDetails

Source: ESPR - Annex XIII (1)
label: Source: ESPR - Annex XIII (1g, 1h, 4d)
label: Source: ESPR - Annex XIII (1i); Art. 10
label: Source: ESPR - Annex XIII (1n); Art. 10
label: Source: ESPR - Annex XIII (1o); Art. 10
label: Source: ESPR - Annex XIII (1j, 1k, 4a); Annex IV
label: Source: ESPR - Annex XIII (1l); Annex VII Part B (4)
label: Source: ESPR - Annex XIII (4d); Annex VII Part B (4)
label: Source: ESPR - Annex XIII (1a)
label: Source: ESPR - Annex VII Part B (1)
label: Source: ESPR - Annex XIII (1m)
label: Source: ESPR - Annex XIII (1a); Annex VI Part A (2)
label: Source: ESPR - Annex XIII (1a); Annex VI Part A (5)
label: Source: ESPR - Annex XIII 4(c)
label: Source: ESPR - Annex XIII (1s); Art. 13(4); Annex VI Part B
label: Source: ESPR - Annex XIII (1s); Art. 13(5)
label: Source: ESPR - Article 7(2) via Annex XIII (1c)
label: Source: ESPR - Annex VI Part A (9)
label: Source: ESPR - Annex XIII (1s); Art. 74 1(e)
label: Source: ESPR - Annex XIII (3); Annex VIII Part A 2(h)
label: Source: ESPR - Annex XIII (1c); Art. 7(2)
label: Source: ESPR - Annex XIII (1c); Art. 7 1(g)
label: Source: ESPR - Annex XIII, Article 7(1)
label: Source: ESPR - Art. 52(3)
label: Source: ESPR - Art. 49(d)
label: Source: ESPR - Annex XIII (1b); Annex VI Part A (7)
label: Source: ESPR - Annex XIII (1b); Annex VI Part A (10)
label: Source: ESPR - Annex XIII (2a)
label: Source: ESPR - Annex XIII (1b); Annex VI Part A (8)
label: Source: ESPR - Annex XIII (1s); Art. 74 1(f)
label: Source: ESPR - Annex XIII (2c)
label: Source: ESPR - Annex XIII (2b)
label: Source: ESPR - Annex XIII (2d); Art. 74(2)
label: Source: ESPR - Art. 74(1)
label: Source: ESPR - Annex XIII (1e); Art. 8(1)
label: Source: ESPR - Annex XIII (1f)
label: Source: ESPR - Annex XIII (1g); Annex IV Part A (1)
label: Source: ESPR - Annex VII Part A (1)
label: Source: ESPR - Annex IV Part A (2)
label: Source: ESPR - Annex VII Part A (EV)
label: Source: ESPR - Annex XIII (4d); Article 3 1(27)
label: Source: ESPR - Annex XIII (1h)
label: Source: ESPR - Annex XIII (1i); Art. 10; Annex IV Part B (4)
label: Source: ESPR - Art. 10; Annex IV (3); Annex VII Part A (2)
label: Source: ESPR - Annex IV Part A (4)
label: Source: ESPR - Annex XIII (1i)
label: Source: ESPR - Annex IV Part B (2)
label: Source: ESPR - Annex XIII (1n); Art. 10; Annex IV (6)
label: Source: ESPR - Annex XIII 1(n); Annex IV (6)
label: Source: ESPR - Art. 10; Annex VII Part A (3)
label: Source: ESPR - Art. 14: Annex VII Part A (4)
label: Source: ESPR - Annex XIII (1o); Art. 10: Annex IV Part A (3)
label: Source: ESPR - Annex IV, Part A(3)
label: Source: ESPR - Annex IV, Part A(5); Annex XIII (1); Annex XIII (4a)
label: Source: ESPR - Annex IV A(5)
label: Source: ESPR - Annex XIII (4d); Art. 14: Annex VII Part B (5)
label: Source: ESPR - Annex XIII (1j)
label: Source: ESPR - Annex XIII (1p)
label: Source: ESPR - Annex VII Part B (2)
label: Source: ESPR - Annex VII Part B (3)
label: Source: ESPR - Annex XIII (1k)
label: Source: ESPR - Annex XIII (1l)
label: Source: ESPR - Annex VII Part B (4)
label: Source: ESPR - Annex XIII (4d)

Capacity, Energy and Voltage
type: Class
governed by: DIN DKE SPEC 99100
source: Source: ESPR - Annex XIII (1)
label: Капацитет, енергия и напрежение @bg
label: Kapacita, energie a napětí @cs
label: Kapacitet, energi og spænding @da
label: Kapazität, Energie und Spannung @de
label: Χωρητικότητα, Ενέργεια και Τάση @el
label: Capacidad, Energía y Voltaje @es
label: Mahtuvus, energia ja pinge @et
label: Kapasiteetti, energia ja jännite @fi
label: Capacité, Énergie et Tension @fr
label: Acmhainn, Fuinneamh agus Voltas @ga
label: Kapacitet, energija i napon @hr
label: Kapacitás, energia és feszültség @hu
label: Capacità, Energia e Tensione @it
label: Talpa, energija ir įtampa @lt
label: Kapacitāte, enerģija un spriegums @lv
label: Kapaċità, Enerġija u Vultaġġ @mt
label: Capaciteit, Energie en Spanning @nl
label: Pojemność, energia i napięcie @pl
label: Capacidade, Energia e Tensão @pt
label: Capacitate, Energie și Tensiune @ro
label: Kapacita, energia a napätie @sk
label: Zmogljivost, energija in napetost @sl
label: Kapacitet, energi och spänning @sv
comment: Information regarding the battery's capacity, energy, state of charge, and voltage limits.
comment: Информация относно капацитета, енергията, състоянието на зареждане и ограниченията на напрежението на батерията. @bg
comment: Informace o kapacitě, energii, stavu nabití a mezních hodnotách napětí baterie. @cs
comment: Oplysninger om batteriets kapacitet, energi, opladningstilstand og spændingsgrænser. @da
comment: Informationen zur Kapazität, Energie, zum Ladezustand und zu den Spannungsgrenzen der Batterie. @de
comment: Πληροφορίες σχετικά με τη χωρητικότητα, την ενέργεια, την κατάσταση φόρτισης και τα όρια τάσης της μπαταρίας. @el
comment: Información sobre la capacidad, la energía, el estado de carga y los límites de voltaje de la batería. @es
comment: Teave aku mahtuvuse, energia, laetuse ja pingepiiride kohta. @et
comment: Tietoja akun kapasiteetista, energiasta, lataustilasta ja jänniterajoista. @fi
comment: Informations concernant la capacité, l'énergie, l'état de charge et les limites de tension de la batterie. @fr
comment: Faisnéis maidir le hacmhainn, fuinneamh, staid luchtaithe, agus teorainneacha voltais na ceallraí. @ga
comment: Informacije o kapacitetu, energiji, stanju napunjenosti i ograničenjima napona baterije. @hr
comment: Információk az akkumulátor kapacitásáról, energiájáról, töltöttségi állapotáról és feszültséghatárértékeiről. @hu
comment: Informazioni sulla capacità, l'energia, lo stato di carica e i limiti di tensione della batteria. @it
comment: Informacija apie akumuliatoriaus talpą, energiją, įkrovos būseną ir įtampos ribas. @lt
comment: Informācija par akumulatora ietilpību, enerģiju, uzlādes stāvokli un sprieguma ierobežojumiem. @lv
comment: Informazzjoni dwar il-kapaċità, l-enerġija, l-istat ta 'ċarġ, u l-limiti tal-vultaġġ tal-batterija. @mt
comment: Informatie over de capaciteit, energie, laadtoestand en spanningslimieten van de batterij. @nl
comment: Informacje dotyczące pojemności, energii, stanu naładowania i limitów napięcia akumulatora. @pl
comment: Informações sobre a capacidade, energia, estado de carga e limites de tensão da bateria. @pt
comment: Informații referitoare la capacitatea, energia, starea de încărcare și limitele de tensiune ale bateriei. @ro
comment: Informácie o kapacite, energii, stave nabitia a medzných hodnotách napätia batérie. @sk
comment: Informacije o zmogljivosti, energiji, stanju napolnjenosti in mejnih napetostih baterije. @sl
comment: Information om batteriets kapacitet, energi, laddningstillstånd och spänningsgränser. @sv
related match: PropertyValue
related match: AdditionalProductClassificationDetails

Power Capability
type: Class
governed by: DIN DKE SPEC 99100
source: Source: ESPR - Annex XIII (1)
label: Мощност @bg
label: Výkonová schopnost @cs
label: Effektkapacitet @da
label: Leistungsfähigkeit @de
label: Ικανότητα ισχύος @el
label: Capacidad de potencia @es
label: Võimsusvõimekus @et
label: Tehokyky @fi
label: Capacité de puissance @fr
label: Cumas Cumhachta @ga
label: Kapacitet snage @hr
label: Teljesítményképesség @hu
label: Capacità di potenza @it
label: Galingumas @lt
label: Jaudas spēja @lv
label: Kapaċità tal-Qawwa @mt
label: Vermogenscapaciteit @nl
label: Zdolność mocowa @pl
label: Capacidade de Potência @pt
label: Capacitate de putere @ro
label: Výkonová schopnosť @sk
label: Zmogljivost moči @sl
comment: Information regarding the battery's power capability, power fade, and maximum permitted power.
comment: Информация относно мощността на батерията, затихването на мощността и максимално допустимата мощност. @bg
comment: Informace o výkonové schopnosti baterie, poklesu výkonu a maximálním povoleném výkonu. @cs
comment: Oplysninger om batteriets effektkapacitet, effekttab og maksimalt tilladt effekt. @da
comment: Informationen zur Leistungsfähigkeit, zum Leistungsabfall und zur maximal zulässigen Leistung der Batterie. @de
comment: Πληροφορίες σχετικά με την ικανότητα ισχύος της μπαταρίας, την εξασθένιση της ισχύος και τη μέγιστη επιτρεπόμενη ισχύ. @el
comment: Información sobre la capacidad de potencia de la batería, la disminución de potencia y la potencia máxima permitida. @es
comment: Teave aku võimsusvõimekuse, võimsuse vähenemise ja maksimaalse lubatud võimsuse kohta. @et
comment: Tietoja akun tehokyvystä, tehon heikkenemisestä ja suurimmasta sallitusta tehosta. @fi
comment: Informations concernant la capacité de puissance de la batterie, la perte de puissance et la puissance maximale autorisée. @fr
comment: Faisnéis maidir le cumas cumhachta na ceallraí, an mheathchumhacht, agus an chumhacht uasta a cheadaítear. @ga
comment: Informacije o kapacitetu snage baterije, smanjenju snage i najvećoj dopuštenoj snazi. @hr
comment: Információk az akkumulátor teljesítményképességéről, teljesítménycsökkenéséről és a megengedett legnagyobb teljesítményről. @hu
comment: Informazioni sulla capacità di potenza della batteria, sulla diminuzione di potenza e sulla potenza massima consentita. @it
comment: Informacija apie akumuliatoriaus galingumą, galios sumažėjimą ir didžiausią leistiną galią. @lt
comment: Informācija par akumulatora jaudas spēju, jaudas samazināšanos un maksimālo atļauto jaudu. @lv
comment: Informazzjoni dwar il-kapaċità tal-qawwa tal-batterija, it-tnaqqis tal-qawwa, u l-qawwa massima permessa. @mt
comment: Informatie over het vermogen, de vermogensafname en het maximaal toegestane vermogen van de batterij. @nl
comment: Informacje dotyczące zdolności mocowej akumulatora, spadku mocy i maksymalnej dozwolonej mocy. @pl
comment: Informações sobre a capacidade de potência da bateria, a perda de potência e a potência máxima permitida. @pt
comment: Informații privind capacitatea de putere a bateriei, diminuarea puterii și puterea maximă admisă. @ro
comment: Informácie o výkonovej schopnosti batérie, poklese výkonu a maximálnom povolenom výkone. @sk
comment: Informacije o zmogljivosti moči baterije, upadu moči in največji dovoljeni moči. @sl
comment: Information om batteriets effektkapacitet, effektminskning och maximalt tillåten effekt. @sv
related match: PropertyValue
related match: ProductCharacteristic

Round Trip Efficiency and Self-Discharge
type: Class
governed by: DIN DKE SPEC 99100
source: Source: ESPR - Annex XIII (1)
label: Ефективност на двупосочен цикъл и саморазреждане @bg
label: Účinnost zpáteční cesty a samovybíjení @cs
label: Tur-retur-effektivitet og selvafladning @da
label: Round-Trip-Effizienz und Selbstentladung @de
label: Απόδοση αμφίδρομης διαδρομής και αυτοεκφόρτιση @el
label: Eficiencia de ida y vuelta y autodescarga @es
label: Edasi-tagasi kasutegur ja isetühjenemine @et
label: Kiertotehokkuus ja itsepurkautuminen @fi
label: Efficacité aller-retour et autodécharge @fr
label: Éifeachtúlacht Turais Babhta agus Féin-Urscaoileadh @ga
label: Učinkovitost povratnog ciklusa i samopražnjenje @hr
label: Körutazás hatékonysága és önkisülés @hu
label: Efficienza del ciclo completo e autoscarica @it
label: Abipusio ciklo efektyvumas ir savaiminis išsikrovimas @lt
label: Divvirzienu efektivitāte un pašizlāde @lv
label: Effiċjenza tar-Ritorn u Awto-Kwittanza @mt
label: Ronde-trip efficiëntie en zelfontlading @nl
label: Sprawność cyklu zamkniętego i samorozładowanie @pl
label: Eficiência de ida e volta e autodescarga @pt
label: Eficiență dus-întors și autodescărcare @ro
label: Účinnosť spiatočnej cesty a samovybíjanie @sk
label: Učinkovitost povratnega cikla in samopraznjenje @sl
label: Tur-och-retur-effektivitet och självurladdning @sv
comment: Information regarding the battery's round trip energy efficiency and self-discharge rates.
comment: Информация относно енергийната ефективност на двупосочния цикъл на батерията и скоростта на саморазреждане. @bg
comment: Informace o energetické účinnosti baterie při zpáteční cestě a rychlosti samovybíjení. @cs
comment: Oplysninger om batteriets tur-retur-energieffektivitet og selvafladningshastigheder. @da
comment: Informationen zur Round-Trip-Energieeffizienz und den Selbstentladungsraten der Batterie. @de
comment: Πληροφορίες σχετικά με την ενεργειακή απόδοση αμφίδρομης διαδρομής της μπαταρίας και τους ρυθμούς αυτοεκφόρτισης. @el
comment: Información sobre la eficiencia energética de ida y vuelta de la batería y las tasas de autodescarga. @es
comment: Teave aku edasi-tagasi energiatõhususe ja isetühjenemise määrade kohta. @et
comment: Tietoja akun kiertotehokkuudesta ja itsepurkautumisnopeuksista. @fi
comment: Informations concernant l'efficacité énergétique aller-retour de la batterie et les taux d'autodécharge. @fr
comment: Faisnéis maidir le héifeachtúlacht fuinnimh turas babhta na ceallraí agus rátaí féin-urscaoilte. @ga
comment: Informacije o energetskoj učinkovitosti povratnog ciklusa baterije i stopama samopražnjenja. @hr
comment: Információk az akkumulátor körutazásának energiahatékonyságáról és önkisülési arányairól. @hu
comment: Informazioni sull'efficienza energetica del ciclo completo della batteria e sui tassi di autoscarica. @it
comment: Informacija apie akumuliatoriaus abipusio ciklo energijos vartojimo efektyvumą ir savaiminio išsikrovimo greitį. @lt
comment: Informācija par akumulatora divvirzienu energoefektivitāti un pašizlādes ātrumu. @lv
comment: Informazzjoni dwar l-effiċjenza tal-enerġija tar-ritorn tal-batterija u r-rati ta 'awto-kwittanza. @mt
comment: Informatie over de energie-efficiëntie van de batterij en de zelfontladingssnelheden. @nl
comment: Informacje dotyczące sprawności energetycznej cyklu zamkniętego akumulatora i szybkości samorozładowania. @pl
comment: Informações sobre a eficiência energética de ida e volta da bateria e as taxas de autodescarga. @pt
comment: Informații privind eficiența energetică dus-întors a bateriei și ratele de autodescărcare. @ro
comment: Informácie o energetickej účinnosti batérie pri spiatočnej ceste a rýchlosti samovybíjania. @sk
comment: Informacije o energijski učinkovitosti povratnega cikla baterije in stopnjah samopraznjenja. @sl
comment: Information om batteriets tur-och-retur-energieffektivitet och självurladdningshastigheter. @sv

Internal Resistance
type: Class
governed by: DIN DKE SPEC 99100
source: Source: ESPR - Annex XIII (1)
label: Вътрешно съпротивление @bg
label: Vnitřní odpor @cs
label: Indre modstand @da
label: Innenwiderstand @de
label: Εσωτερική αντίσταση @el
label: Resistencia interna @es
label: Sisetakistus @et
label: Sisäinen vastus @fi
label: Résistance interne @fr
label: Friotaíocht Inmheánach @ga
label: Unutarnji otpor @hr
label: Belső ellenállás @hu
label: Resistenza interna @it
label: Vidinė varža @lt
label: Iekšējā pretestība @lv
label: Reżistenza Interna @mt
label: Interne weerstand @nl
label: Rezystancja wewnętrzna @pl
label: Resistência interna @pt
label: Rezistență internă @ro
label: Vnútorný odpor @sk
label: Notranja upornost @sl
label: Inre resistans @sv
comment: Information regarding the battery's internal resistance and its increase over time.
comment: Информация относно вътрешното съпротивление на батерията и неговото увеличаване с течение на времето. @bg
comment: Informace o vnitřním odporu baterie a jeho nárůstu v průběhu času. @cs
comment: Oplysninger om batteriets indre modstand og dens stigning over tid. @da
comment: Informationen über den Innenwiderstand der Batterie und dessen Anstieg im Laufe der Zeit. @de
comment: Πληροφορίες σχετικά με την εσωτερική αντίσταση της μπαταρίας και την αύξησή της με την πάροδο του χρόνου. @el
comment: Información sobre la resistencia interna de la batería y su aumento con el tiempo. @es
comment: Teave aku sisetakistuse ja selle suurenemise kohta aja jooksul. @et
comment: Tietoja akun sisäisestä vastuksesta ja sen kasvusta ajan myötä. @fi
comment: Informations concernant la résistance interne de la batterie et son augmentation dans le temps. @fr
comment: Faisnéis maidir le friotaíocht inmheánach na ceallraí agus an méadú a thagann uirthi le himeacht ama. @ga
comment: Informacije o unutarnjem otporu baterije i njegovom povećanju tijekom vremena. @hr
comment: Információk az akkumulátor belső ellenállásáról és annak időbeli növekedéséről. @hu
comment: Informazioni sulla resistenza interna della batteria e sul suo aumento nel tempo. @it
comment: Informacija apie akumuliatoriaus vidinę varžą ir jos didėjimą laikui bėgant. @lt
comment: Informācija par akumulatora iekšējo pretestību un tās pieaugumu laika gaitā. @lv
comment: Informazzjoni dwar ir-reżistenza interna tal-batterija u ż-żieda tagħha maż-żmien. @mt
comment: Informatie over de interne weerstand van de batterij en de toename ervan in de tijd. @nl
comment: Informacje dotyczące rezystancji wewnętrznej akumulatora i jej wzrostu w czasie. @pl
comment: Informações sobre a resistência interna da bateria e seu aumento ao longo do tempo. @pt
comment: Informații privind rezistența internă a bateriei și creșterea acesteia în timp. @ro
comment: Informácie o vnútornom odpore batérie a jeho náraste v priebehu času. @sk
comment: Informacije o notranji upornosti baterije in njenem povečanju skozi čas. @sl
comment: Information om batteriets inre resistans och dess ökning över tid. @sv
related match: StructuredValue

Battery Lifetime
type: Class
governed by: DIN DKE SPEC 99100
source: Source: ESPR - Annex XIII (1)
label: Живот на батерията @bg
label: Životnost baterie @cs
label: Batteriets levetid @da
label: Batterielebensdauer @de
label: Διάρκεια ζωής μπαταρίας @el
label: Vida útil de la batería @es
label: Aku eluiga @et
label: Akun käyttöikä @fi
label: Durée de vie de la batterie @fr
label: Saolré na Ceallraí @ga
label: Životni vijek baterije @hr
label: Akkumulátor élettartama @hu
label: Durata della batteria @it
label: Baterijos veikimo laikas @lt
label: Baterijas kalpošanas laiks @lv
label: Ħajja tal-Batterija @mt
label: Levensduur van de batterij @nl
label: Żywotność baterii @pl
label: Vida útil da bateria @pt
label: Durata de viață a bateriei @ro
label: Životnosť batérie @sk
label: Življenjska doba baterije @sl
label: Batteriets livslängd @sv
comment: Information regarding the expected lifetime of the battery in years and cycles, including reference tests.
comment: Информация относно очаквания живот на батерията в години и цикли, включително референтни тестове. @bg
comment: Informace o očekávané životnosti baterie v letech a cyklech, včetně referenčních testů. @cs
comment: Oplysninger om batteriets forventede levetid i år og cyklusser, inklusive referencetest. @da
comment: Informationen zur erwarteten Lebensdauer der Batterie in Jahren und Zyklen, einschließlich Referenztests. @de
comment: Πληροφορίες σχετικά με την αναμενόμενη διάρκεια ζωής της μπαταρίας σε έτη και κύκλους, συμπεριλαμβανομένων των δοκιμών αναφοράς. @el
comment: Información sobre la vida útil esperada de la batería en años y ciclos, incluidas las pruebas de referencia. @es
comment: Teave aku eeldatava eluea kohta aastates ja tsüklites, sealhulgas võrdluskatsed. @et
comment: Tietoja akun odotetusta käyttöiästä vuosina ja jaksoina, mukaan lukien vertailutestit. @fi
comment: Informations concernant la durée de vie prévue de la batterie en années et en cycles, y compris les tests de référence. @fr
comment: Faisnéis maidir le saolré ionchasach na ceallraí i mblianta agus i dtimthriallta, lena n-áirítear tástálacha tagartha. @ga
comment: Informacije o očekivanom životnom vijeku baterije u godinama i ciklusima, uključujući referentne testove. @hr
comment: Információk az akkumulátor várható élettartamáról években és ciklusokban, beleértve a referenciateszteket is. @hu
comment: Informazioni sulla durata prevista della batteria in anni e cicli, compresi i test di riferimento. @it
comment: Informacija apie numatomą baterijos veikimo laiką metais ir ciklais, įskaitant etaloninius bandymus. @lt
comment: Informācija par paredzamo baterijas kalpošanas laiku gados un ciklos, ieskaitot atsauces testus. @lv
comment: Informazzjoni dwar il-ħajja mistennija tal-batterija fi snin u ċikli, inklużi testijiet ta' referenza. @mt
comment: Informatie over de verwachte levensduur van de batterij in jaren en cycli, inclusief referentietests. @nl
comment: Informacje dotyczące oczekiwanej żywotności baterii w latach i cyklach, w tym testy referencyjne. @pl
comment: Informações sobre a vida útil esperada da bateria em anos e ciclos, incluindo testes de referência. @pt
comment: Informații privind durata de viață preconizată a bateriei în ani și cicluri, inclusiv teste de referință. @ro
comment: Informácie o očakávanej životnosti batérie v rokoch a cykloch vrátane referenčných testov. @sk
comment: Informacije o pričakovani življenjski dobi baterije v letih in ciklih, vključno z referenčnimi preskusi. @sl
comment: Information om batteriets förväntade livslängd i år och cykler, inklusive referenstester. @sv
related match: StructuredValue

Temperature Conditions
type: Class
governed by: DIN DKE SPEC 99100
source: Source: ESPR - Annex XIII (1)
label: Температурни условия @bg
label: Teplotní podmínky @cs
label: Temperaturforhold @da
label: Temperaturbedingungen @de
label: Συνθήκες θερμοκρασίας @el
label: Condiciones de temperatura @es
label: Temperatuuritingimused @et
label: Lämpötilaolosuhteet @fi
label: Conditions de température @fr
label: Dálaí Teochta @ga
label: Temperaturni uvjeti @hr
label: Hőmérsékleti viszonyok @hu
label: Condizioni di temperatura @it
label: Temperatūros sąlygos @lt
label: Temperatūras apstākļi @lv
label: Kundizzjonijiet tat-Temperatura @mt
label: Temperatuurcondities @nl
label: Warunki temperaturowe @pl
label: Condições de temperatura @pt
label: Condiții de temperatură @ro
label: Teplotné podmienky @sk
label: Temperaturni pogoji @sl
label: Temperaturförhållanden @sv
comment: Information regarding the temperature ranges the battery can withstand and time spent in extreme temperatures.
comment: Информация относно температурните диапазони, които батерията може да издържи, и времето, прекарано при екстремни температури. @bg
comment: Informace o teplotních rozsazích, které baterie vydrží, a době strávené v extrémních teplotách. @cs
comment: Oplysninger om de temperaturområder, batteriet kan modstå, og den tid, det har været udsat for ekstreme temperaturer. @da
comment: Informationen über die Temperaturbereiche, denen die Batterie standhalten kann, und die Zeit, die sie bei extremen Temperaturen verbracht hat. @de
comment: Πληροφορίες σχετικά με τα εύρη θερμοκρασιών που μπορεί να αντέξει η μπαταρία και το χρόνο που δαπανάται σε ακραίες θερμοκρασίες. @el
comment: Información sobre los rangos de temperatura que la batería puede soportar y el tiempo que pasa a temperaturas extremas. @es
comment: Teave temperatuurivahemike kohta, mida aku talub, ja äärmuslikes temperatuurides veedetud aja kohta. @et
comment: Tietoja lämpötila-alueista, joita akku kestää, ja äärilämpötiloissa vietetystä ajasta. @fi
comment: Informations concernant les plages de température que la batterie peut supporter et le temps passé à des températures extrêmes. @fr
comment: Faisnéis maidir leis na raonta teochta is féidir leis an gceallraí a sheasamh agus an t-am a chaitear i dteochtaí foircneacha. @ga
comment: Informacije o temperaturnim rasponima koje baterija može podnijeti i vremenu provedenom na ekstremnim temperaturama. @hr
comment: Információk a hőmérsékleti tartományokról, amelyeket az akkumulátor kibír, és a szélsőséges hőmérsékleten töltött időről. @hu
comment: Informazioni sugli intervalli di temperatura che la batteria può sopportare e sul tempo trascorso a temperature estreme. @it
comment: Informacija apie temperatūrų diapazonus, kuriuos baterija gali atlaikyti, ir laiką, praleistą ekstremaliose temperatūrose. @lt
comment: Informācija par temperatūras diapazoniem, ko akumulators var izturēt, un laiku, kas pavadīts ekstremālās temperatūrās. @lv
comment: Informazzjoni dwar il-firxiet tat-temperatura li l-batterija tista 'tiflaħ u l-ħin mgħoddi f'temperaturi estremi. @mt
comment: Informatie over de temperatuurbereiken die de batterij kan weerstaan en de tijd die in extreme temperaturen wordt doorgebracht. @nl
comment: Informacje dotyczące zakresów temperatur, które bateria może wytrzymać, oraz czasu spędzonego w ekstremalnych temperaturach. @pl
comment: Informações sobre as faixas de temperatura que a bateria pode suportar e o tempo gasto em temperaturas extremas. @pt
comment: Informații privind intervalele de temperatură pe care bateria le poate suporta și timpul petrecut la temperaturi extreme. @ro
comment: Informácie o teplotných rozsahoch, ktoré batéria vydrží, a o čase strávenom v extrémnych teplotách. @sk
comment: Informacije o temperaturnih območjih, ki jih baterija lahko prenese, in času, preživetem pri ekstremnih temperaturah. @sl
comment: Information om de temperaturområden som batteriet tål och den tid som tillbringats i extrema temperaturer. @sv
related match: PropertyValue

Negative Events and Accidents
type: Class
governed by: DIN DKE SPEC 99100
source: Source: ESPR - Annex XIII (1)
label: Негативни събития и инциденти @bg
label: Negativní události a nehody @cs
label: Negative begivenheder og ulykker @da
label: Negative Ereignisse und Unfälle @de
label: Αρνητικά Γεγονότα και Ατυχήματα @el
label: Eventos negativos y accidentes @es
label: Negatiivsed sündmused ja õnnetused @et
label: Negatiiviset tapahtumat ja onnettomuudet @fi
label: Événements négatifs et accidents @fr
label: Teagmhais Dhiúltacha agus Timpistí @ga
label: Negativni događaji i nesreće @hr
label: Negatív események és balesetek @hu
label: Eventi negativi e incidenti @it
label: Neigiami įvykiai ir nelaimingi atsitikimai @lt
label: Negatīvi notikumi un nelaimes gadījumi @lv
label: Avvenimenti u Inċidenti Negattivi @mt
label: Negatieve gebeurtenissen en ongevallen @nl
label: Negatywne zdarzenia i wypadki @pl
label: Eventos negativos e acidentes @pt
label: Evenimente negative și accidente @ro
label: Negatívne udalosti a nehody @sk
label: Negativni dogodki in nesreče @sl
label: Negativa händelser och olyckor @sv
comment: Information regarding negative events such as deep discharges, overcharges, and accidents.
comment: Информация относно негативни събития като дълбоки разряди, презареждания и инциденти. @bg
comment: Informace o negativních událostech, jako jsou hluboké vybití, přebití a nehody. @cs
comment: Oplysninger om negative begivenheder såsom dybe afladninger, overopladninger og ulykker. @da
comment: Informationen über negative Ereignisse wie Tiefentladungen, Überladungen und Unfälle. @de
comment: Πληροφορίες σχετικά με αρνητικά συμβάντα όπως βαθιές εκφορτίσεις, υπερφορτίσεις και ατυχήματα. @el
comment: Información sobre eventos negativos como descargas profundas, sobrecargas y accidentes. @es
comment: Teave negatiivsete sündmuste kohta, nagu sügavtühjenemised, ülelaadimised ja õnnetused. @et
comment: Tietoja negatiivisista tapahtumista, kuten syväpurkauksista, ylilatauksista ja onnettomuuksista. @fi
comment: Informations concernant les événements négatifs tels que les décharges profondes, les surcharges et les accidents. @fr
comment: Faisnéis maidir le teagmhais dhiúltacha amhail scaoileadh domhain, ró-mhuirearú, agus timpistí. @ga
comment: Informacije o negativnim događajima kao što su duboka pražnjenja, prekomjerna punjenja i nesreće. @hr
comment: Információk a negatív eseményekről, például a mélykisülésekről, a túltöltésekről és a balesetekről. @hu
comment: Informazioni su eventi negativi come scariche profonde, sovraccarichi e incidenti. @it
comment: Informacija apie neigiamus įvykius, tokius kaip gilūs iškrovimai, perkrovimai ir nelaimingi atsitikimai. @lt
comment: Informācija par negatīviem notikumiem, piemēram, dziļām izlādēm, pārlādēm un nelaimes gadījumiem. @lv
comment: Informazzjoni dwar avvenimenti negattivi bħal skariki fil-fond, ħlas żejjed, u inċidenti. @mt
comment: Informatie over negatieve gebeurtenissen zoals diepe ontladingen, overladingen en ongevallen. @nl
comment: Informacje dotyczące negatywnych zdarzeń, takich jak głębokie rozładowania, przeładowania i wypadki. @pl
comment: Informações sobre eventos negativos, como descargas profundas, sobrecargas и acidentes. @pt
comment: Informații privind evenimentele negative, cum ar fi descărcările profunde, supraîncărcările și accidentele. @ro
comment: Informácie o negatívnych udalostiach, ako sú hlboké vybitia, prebitia a nehody. @sk
comment: Informacije o negativnih dogodkih, kot so globoke izpraznitve, prenapolnjenost in nesreče. @sl
comment: Information om negativa händelser såsom djupa urladdningar, överladdningar och olyckor. @sv
related match: Event

Manufacturing place
type: DatatypeProperty
governed by: DIN DKE SPEC 99100
source: Source: ESPR - Annex XIII (1)
label: Място на производство @bg
label: Místo výroby @cs
label: Fremstillingssted @da
label: Herstellungsort @de
label: Τόπος κατασκευής @el
label: Lugar de fabricación @es
label: Tootmiskoht @et
label: Valmistuspaikka @fi
label: Lieu de fabrication @fr
label: Áit déantúsaíochta @ga
label: Mjesto proizvodnje @hr
label: Gyártási hely @hu
label: Luogo di fabbricazione @it
label: Gamybos vieta @lt
label: Ražošanas vieta @lv
label: Post tal-manifattura @mt
label: Productieplaats @nl
label: Miejsce produkcji @pl
label: Local de fabrico @pt
label: Locul de fabricație @ro
label: Miesto výroby @sk
label: Kraj izdelave @sl
label: Tillverkningsplats @sv
comment: A battery passport must include the manufacturing place (geographical location of a battery manufacturing plant). The manufacturing place must also be provided on the battery label.
comment: Паспортът на батерията трябва да включва мястото на производство (географското местоположение на завода за производство на батерии). Мястото на производство трябва да бъде посочено и на етикета на батерията. @bg
comment: Pasy baterie musí obsahovat místo výroby (zeměpisnou polohu výrobního závodu baterií). Místo výroby musí být také uvedeno na štítku baterie. @cs
comment: Et batteripas skal indeholde fremstillingsstedet (geografisk placering af et batteriproduktionsanlæg). Fremstillingsstedet skal også være angivet på batterietiketten. @da
comment: Ein Batteriepass muss den Herstellungsort (geografischer Standort eines Batterieherstellungswerks) enthalten. Der Herstellungsort muss auch auf dem Batterieetikett angegeben werden. @de
comment: Ένα διαβατήριο μπαταρίας πρέπει να περιλαμβάνει τον τόπο κατασκευής (γεωγραφική θέση μιας μονάδας κατασκευής μπαταριών). Ο τόπος κατασκευής πρέπει επίσης να αναγράφεται στην ετικέτα της μπαταρίας. @el
comment: El pasaporte de una batería debe incluir el lugar de fabricación (ubicación geográfica de una planta de fabricación de baterías). El lugar de fabricación también debe figurar en la etiqueta de la batería. @es
comment: Aku pass peab sisaldama tootmiskohta (akutehase geograafilist asukohta). Tootmiskoht peab olema märgitud ka aku etiketil. @et
comment: Akkupassiin on sisällyttävä valmistuspaikka (akkutehtaan maantieteellinen sijainti). Valmistuspaikka on ilmoitettava myös akun etiketissä. @fi
comment: Un passeport de batterie doit inclure le lieu de fabrication (emplacement géographique d'une usine de fabrication de batteries). Le lieu de fabrication doit également être indiqué sur l'étiquette de la batterie. @fr
comment: Ní mór an áit déantúsaíochta (suíomh geografach gléasra déantúsaíochta ceallraí) a bheith i bpas ceallraí. Ní mór an áit déantúsaíochta a chur ar fáil ar lipéad na ceallraí freisin. @ga
comment: Putovnica baterije mora sadržavati mjesto proizvodnje (geografski položaj postrojenja za proizvodnju baterija). Mjesto proizvodnje također mora biti navedeno na naljepnici baterije. @hr
comment: Az akkumulátor-útlevélnek tartalmaznia kell a gyártás helyét (az akkumulátorgyártó üzem földrajzi elhelyezkedését). A gyártás helyét az akkumulátor címkéjén is fel kell tüntetni. @hu
comment: Un passaporto della batteria deve includere il luogo di fabbricazione (posizione geografica di un impianto di produzione di batterie). Il luogo di fabbricazione deve essere riportato anche sull'etichetta della batteria. @it
comment: Baterijos pase turi būti nurodyta pagaminimo vieta (baterijų gamyklos geografinė vieta). Gamybos vieta taip pat turi būti nurodyta ant baterijos etiketės. @lt
comment: Baterijas pasē jānorāda ražošanas vieta (bateriju ražotnes ģeogrāfiskā atrašanās vieta). Ražošanas vieta jānorāda arī uz baterijas etiķetes. @lv
comment: Passaport tal-batterija għandu jinkludi l-post tal-manifattura (post ġeografiku ta' impjant tal-manifattura tal-batteriji). Il-post tal-manifattura għandu jiġi pprovdut ukoll fuq it-tikketta tal-batterija. @mt
comment: Een batterijpaspoort moet de productieplaats (geografische locatie van een batterijfabriek) vermelden. De productieplaats moet ook op het batterijlabel worden vermeld. @nl
comment: Paszport baterii musi zawierać miejsce produkcji (położenie geograficzne zakładu produkującego baterie). Miejsce produkcji musi być również podane na etykiecie baterii. @pl
comment: Um passaporte de bateria deve incluir o local de fabrico (localização geográfica de uma fábrica de baterias). O local de fabrico também deve ser fornecido na etiqueta da bateria. @pt
comment: Un pașaport de baterie trebuie să includă locul de fabricație (locația geografică a unei fabrici de baterii). Locul de fabricație trebuie, de asemenea, să fie furnizat pe eticheta bateriei. @ro
comment: Cestovný pas batérie musí obsahovať miesto výroby (geografickú polohu závodu na výrobu batérií). Miesto výroby musí byť uvedené aj na štítku batérie. @sk
comment: Potni list za baterijo mora vsebovati kraj izdelave (geografsko lokacijo obrata za proizvodnjo baterij). Kraj izdelave mora biti naveden tudi na nalepki baterije. @sl
comment: Ett batteripass måste innehålla tillverkningsplatsen (geografisk plats för en batteritillverkningsanläggning). Tillverkningsplatsen måste också anges på batterietiketten. @sv
domain: Battery Product
range: xsd:string

Manufacturing date
type: DatatypeProperty
governed by: DIN DKE SPEC 99100
source: Source: ESPR - Annex XIII (1)
label: Дата на производство @bg
label: Datum výroby @cs
label: Fremstillingsdato @da
label: Herstellungsdatum @de
label: Ημερομηνία κατασκευής @el
label: Fecha de fabricación @es
label: Tootmiskuupäev @et
label: Valmistuspäivämäärä @fi
label: Date de fabrication @fr
label: Dáta monaraithe @ga
label: Datum proizvodnje @hr
label: Gyártás dátuma @hu
label: Data di fabbricazione @it
label: Pagaminimo data @lt
label: Ražošanas datums @lv
label: Data tal-manifattura @mt
label: Productiedatum @nl
label: Data produkcji @pl
label: Data de fabrico @pt
label: Data fabricației @ro
label: Dátum výroby @sk
label: Datum izdelave @sl
label: Tillverkningsdatum @sv
comment: A battery passport must include the date of manufacture (month and year). The manufacturing date must also be provided on the battery label. Format YYYY-MM-DD (ISO 8601).
comment: Паспортът на батерията трябва да включва датата на производство (месец и година). Датата на производство трябва да бъде посочена и на етикета на батерията. Формат ГГГГ-ММ-ДД (ISO 8601). @bg
comment: Pasy baterie musí obsahovat datum výroby (měsíc a rok). Datum výroby musí být také uvedeno na štítku baterie. Formát RRRR-MM-DD (ISO 8601). @cs
comment: Et batteripas skal indeholde fremstillingsdatoen (måned og år). Fremstillingsdatoen skal også være angivet på batterietiketten. Format ÅÅÅÅ-MM-DD (ISO 8601). @da
comment: Ein Batteriepass muss das Herstellungsdatum (Monat und Jahr) enthalten. Das Herstellungsdatum muss auch auf dem Batterieetikett angegeben werden. Format JJJJ-MM-TT (ISO 8601). @de
comment: Ένα διαβατήριο μπαταρίας πρέπει να περιλαμβάνει την ημερομηνία κατασκευής (μήνας και έτος). Η ημερομηνία κατασκευής πρέπει επίσης να αναγράφεται στην ετικέτα της μπαταρίας. Μορφή ΕΕΕΕ-ΜΜ-ΗΗ (ISO 8601). @el
comment: El pasaporte de una batería debe incluir la fecha de fabricación (mes y año). La fecha de fabricación también debe figurar en la etiqueta de la batería. Formato AAAA-MM-DD (ISO 8601). @es
comment: Aku pass peab sisaldama valmistamise kuupäeva (kuu ja aasta). Valmistamiskuupäev peab olema märgitud ka aku etiketil. Vorming AAAA-KK-PP (ISO 8601). @et
comment: Akkupassiin on sisällyttävä valmistuspäivämäärä (kuukausi ja vuosi). Valmistuspäivämäärä on ilmoitettava myös akun etiketissä. Muoto VVVV-KK-PP (ISO 8601). @fi
comment: Un passeport de batterie doit inclure la date de fabrication (mois et année). La date de fabrication doit également être indiquée sur l'étiquette de la batterie. Format AAAA-MM-JJ (ISO 8601). @fr
comment: Ní mór dáta monaraithe (mí agus bliain) a bheith ar phas ceallraí. Ní mór an dáta monaraithe a chur ar fáil ar lipéad na ceallraí freisin. Formáid BBBB-MM-DD (ISO 8601). @ga
comment: Putovnica baterije mora sadržavati datum proizvodnje (mjesec i godina). Datum proizvodnje također mora biti naveden na naljepnici baterije. Format GGGG-MM-DD (ISO 8601). @hr
comment: Az akkumulátor-útlevélnek tartalmaznia kell a gyártás dátumát (hónap és év). A gyártás dátumát az akkumulátor címkéjén is fel kell tüntetni. Formátum ÉÉÉÉ-HH-NN (ISO 8601). @hu
comment: Un passaporto della batteria deve includere la data di fabbricazione (mese e anno). La data di fabbricazione deve essere riportata anche sull'etichetta della batteria. Formato AAAA-MM-GG (ISO 8601). @it
comment: Baterijos pase turi būti nurodyta pagaminimo data (mėnuo ir metai). Pagaminimo data taip pat turi būti nurodyta ant baterijos etiketės. Formatas YYYY-MM-DD (ISO 8601). @lt
comment: Baterijas pasē jānorāda izgatavošanas datums (mēnesis un gads). Izgatavošanas datums jānorāda arī uz baterijas etiķetes. Formāts GGGG-MM-DD (ISO 8601). @lv
comment: Passaport tal-batterija għandu jinkludi d-data tal-manifattura (xahar u sena). Id-data tal-manifattura għandha tiġi pprovduta wkoll fuq it-tikketta tal-batterija. Format SSSS-XX-JJ (ISO 8601). @mt
comment: Een batterijpaspoort moet de productiedatum (maand en jaar) bevatten. De productiedatum moet ook op het batterijlabel worden vermeld. Formaat JJJJ-MM-DD (ISO 8601). @nl
comment: Paszport baterii musi zawierać datę produkcji (miesiąc i rok). Data produkcji musi być również podana na etykiecie baterii. Format RRRR-MM-DD (ISO 8601). @pl
comment: Um passaporte de bateria deve incluir a data de fabrico (mês e ano). A data de fabrico também deve ser fornecida na etiqueta da bateria. Formato AAAA-MM-DD (ISO 8601). @pt
comment: Un pașaport de baterie trebuie să includă data fabricației (luna și anul). Data fabricației trebuie, de asemenea, să fie furnizată pe eticheta bateriei. Format AAAA-LL-ZZ (ISO 8601). @ro
comment: Cestovný pas batérie musí obsahovať dátum výroby (mesiac a rok). Dátum výroby musí byť uvedený aj na štítku batérie. Formát RRRR-MM-DD (ISO 8601). @sk
comment: Potni list za baterijo mora vsebovati datum izdelave (mesec in leto). Datum izdelave mora biti naveden tudi na nalepki baterije. Oblika LLLL-MM-DD (ISO 8601). @sl
comment: Ett batteripass måste innehålla tillverkningsdatum (månad och år). Tillverkningsdatumet måste också anges på batterietiketten. Format ÅÅÅÅ-MM-DD (ISO 8601). @sv
domain: Battery Product
range: xsd:date

Date of putting the battery into service
type: DatatypeProperty
governed by: DIN DKE SPEC 99100
source: Source: ESPR - Annex XIII (1)
label: Дата на въвеждане на батерията в експлоатация @bg
label: Datum uvedení baterie do provozu @cs
label: Dato for ibrugtagning af batteriet @da
label: Datum der Inbetriebnahme der Batterie @de
label: Ημερομηνία έναρξης λειτουργίας της μπαταρίας @el
label: Fecha de puesta en servicio de la batería @es
label: Aku kasutuselevõtu kuupäev @et
label: Akun käyttöönoton päivämäärä @fi
label: Date de mise en service de la batterie @fr
label: Dáta curtha i seirbhís na ceallraí @ga
label: Datum stavljanja baterije u uporabu @hr
label: Az akkumulátor üzembe helyezésének dátuma @hu
label: Data di messa in servizio della batteria @it
label: Baterijos paleidimo data @lt
label: Baterijas nodošanas ekspluatācijā datums @lv
label: Data tat-tqegħid tal-batterija fis-servizz @mt
label: Datum van ingebruikname van de batterij @nl
label: Data oddania baterii do użytku @pl
label: Data de colocação da bateria em serviço @pt
label: Data punerii în funcțiune a bateriei @ro
label: Dátum uvedenia batérie do prevádzky @sk
label: Datum začetka uporabe baterije @sl
label: Datum för när batteriet togs i bruk @sv
comment: Where appropriate, the battery passport must include information on the date of putting the battery into service. Format YYYY-MM-DD (ISO 8601).
comment: Когато е целесъобразно, паспортът на батерията трябва да включва информация за датата на въвеждане на батерията в експлоатация. Формат ГГГГ-ММ-ДД (ISO 8601). @bg
comment: V příslušných případech musí pas baterie obsahovat informace o datu uvedení baterie do provozu. Formát RRRR-MM-DD (ISO 8601). @cs
comment: Hvor det er relevant, skal batteripasset indeholde oplysninger om datoen for batteriets ibrugtagning. Format ÅÅÅÅ-MM-DD (ISO 8601). @da
comment: Gegebenenfalls muss der Batteriepass Informationen über das Datum der Inbetriebnahme der Batterie enthalten. Format JJJJ-MM-TT (ISO 8601). @de
comment: Κατά περίπτωση, το διαβατήριο της μπαταρίας πρέπει να περιλαμβάνει πληροφορίες σχετικά με την ημερομηνία έναρξης λειτουργίας της μπαταρίας. Μορφή ΕΕΕΕ-ΜΜ-ΗΗ (ISO 8601). @el
comment: Cuando proceda, el pasaporte de la batería deberá incluir información sobre la fecha de puesta en servicio de la batería. Formato AAAA-MM-DD (ISO 8601). @es
comment: Vajaduse korral peab aku pass sisaldama teavet aku kasutuselevõtu kuupäeva kohta. Vorming AAAA-KK-PP (ISO 8601). @et
comment: Tarvittaessa akkupassiin on sisällyttävä tiedot akun käyttöönottopäivästä. Muoto VVVV-KK-PP (ISO 8601). @fi
comment: Le cas échéant, le passeport de la batterie doit inclure des informations sur la date de mise en service de la batterie. Format AAAA-MM-JJ (ISO 8601). @fr
comment: I gcás inarb iomchuí, ní mór faisnéis a bheith ar phas na ceallraí maidir le dáta chur i seirbhís na ceallraí. Formáid BBBB-MM-DD (ISO 8601). @ga
comment: Prema potrebi, putovnica baterije mora sadržavati podatke o datumu stavljanja baterije u uporabu. Format GGGG-MM-DD (ISO 8601). @hr
comment: Adott esetben az akkumulátor-útlevélnek tartalmaznia kell az akkumulátor üzembe helyezésének dátumára vonatkozó információkat. Formátum ÉÉÉÉ-HH-NN (ISO 8601). @hu
comment: Se del caso, il passaporto della batteria deve includere informazioni sulla data di messa in servizio della batteria. Formato AAAA-MM-GG (ISO 8601). @it
comment: Atitinkamais atvejais baterijos pase turi būti pateikta informacija apie baterijos paleidimo datą. Formatas YYYY-MM-DD (ISO 8601). @lt
comment: Attiecīgā gadījumā baterijas pasē jāiekļauj informācija par baterijas nodošanas ekspluatācijā datumu. Formāts GGGG-MM-DD (ISO 8601). @lv
comment: Fejn xieraq, il-passaport tal-batterija għandu jinkludi informazzjoni dwar id-data tat-tqegħid tal-batterija fis-servizz. Format SSSS-XX-JJ (ISO 8601). @mt
comment: Indien van toepassing moet het batterijpaspoort informatie bevatten over de datum van ingebruikname van de batterij. Formaat JJJJ-MM-DD (ISO 8601). @nl
comment: W stosownych przypadkach paszport baterii musi zawierać informacje o dacie oddania baterii do użytku. Format RRRR-MM-DD (ISO 8601). @pl
comment: Se for o caso, o passaporte da bateria deve incluir informações sobre a data de colocação da bateria em serviço. Formato AAAA-MM-DD (ISO 8601). @pt
comment: Dacă este cazul, pașaportul bateriei trebuie să includă informații despre data punerii în funcțiune a bateriei. Format AAAA-LL-ZZ (ISO 8601). @ro
comment: V prípade potreby musí cestovný pas batérie obsahovať informácie o dátume uvedenia batérie do prevádzky. Formát RRRR-MM-DD (ISO 8601). @sk
comment: Kadar je to primerno, mora potni list za baterijo vsebovati podatke o datumu začetka uporabe baterije. Oblika LLLL-MM-DD (ISO 8601). @sl
comment: I förekommande fall måste batteripasset innehålla information om datumet då batteriet togs i bruk. Format ÅÅÅÅ-MM-DD (ISO 8601). @sv
domain: Battery Product
range: xsd:date
related match: Date

Warranty period of the battery
type: DatatypeProperty
governed by: DIN DKE SPEC 99100
source: Source: ESPR - Annex XIII (1)
label: Гаранционен срок на батерията @bg
label: Záruční doba baterie @cs
label: Garantiperiode for batteriet @da
label: Garantiezeit der Batterie @de
label: Περίοδος εγγύησης της μπαταρίας @el
label: Período de garantía de la batería @es
label: Aku garantiiperiood @et
label: Akun takuuaika @fi
label: Période de garantie de la batterie @fr
label: Tréimhse bharántais na ceallraí @ga
label: Jamstveni rok baterije @hr
label: Az akkumulátor garanciaideje @hu
label: Periodo di garanzia della batteria @it
label: Baterijos garantinis laikotarpis @lt
label: Baterijas garantijas periods @lv
label: Perjodu ta' garanzija tal-batterija @mt
label: Garantieperiode van de batterij @nl
label: Okres gwarancji baterii @pl
label: Período de garantia da bateria @pt
label: Perioada de garanție a bateriei @ro
label: Záručná doba batérie @sk
label: Garancijska doba baterije @sl
label: Garantiperiod för batteriet @sv
comment: The battery passport must include information about the period for which the commercial warranty applies.
comment: Паспортът на батерията трябва да включва информация за периода, за който се прилага търговската гаранция. @bg
comment: Pasy baterie musí obsahovat informace o době, po kterou platí obchodní záruka. @cs
comment: Batteripasset skal indeholde oplysninger om den periode, som den kommercielle garanti gælder for. @da
comment: Der Batteriepass muss Informationen über den Zeitraum enthalten, für den die kommerzielle Garantie gilt. @de
comment: Το διαβατήριο της μπαταρίας πρέπει να περιλαμβάνει πληροφορίες σχετικά με την περίοδο για την οποία ισχύει η εμπορική εγγύηση. @el
comment: El pasaporte de la batería debe incluir información sobre el período durante el cual se aplica la garantía comercial. @es
comment: Aku pass peab sisaldama teavet ajavahemiku kohta, milleks kaubanduslik garantii kehtib. @et
comment: Akkupassin on sisällettävä tiedot ajanjaksosta, jolle kaupallinen takuu on voimassa. @fi
comment: Le passeport de la batterie doit inclure des informations sur la période pendant laquelle la garantie commerciale s'applique. @fr
comment: Ní mór faisnéis a bheith i bpas na ceallraí faoin tréimhse a bhfuil feidhm ag an mbarántas tráchtála ina leith. @ga
comment: Putovnica baterije mora sadržavati informacije o razdoblju za koje se primjenjuje komercijalno jamstvo. @hr
comment: Az akkumulátor-útlevélnek tartalmaznia kell a kereskedelmi garancia érvényességi idejére vonatkozó információkat. @hu
comment: Il passaporto della batteria deve includere informazioni sul periodo di applicazione della garanzia commerciale. @it
comment: Baterijos pase turi būti pateikta informacija apie laikotarpį, kuriam taikoma komercinė garantija. @lt
comment: Baterijas pasē jāiekļauj informācija par periodu, uz kuru attiecas komerciālā garantija. @lv
comment: Il-passaport tal-batterija għandu jinkludi informazzjoni dwar il-perjodu li għalih tapplika l-garanzija kummerċjali. @mt
comment: Het batterijpaspoort moet informatie bevatten over de periode waarvoor de commerciële garantie geldt. @nl
comment: Paszport baterii musi zawierać informacje o okresie obowiązywania gwarancji handlowej. @pl
comment: O passaporte da bateria deve incluir informações sobre o período a que se aplica a garantia comercial. @pt
comment: Pașaportul bateriei trebuie să includă informații despre perioada pentru care se aplică garanția comercială. @ro
comment: Cestovný pas batérie musí obsahovať informácie o období, na ktoré sa vzťahuje obchodná záruka. @sk
comment: Potni list baterije mora vsebovati informacije o obdobju, za katero velja komercialna garancija. @sl
comment: Batteripasset måste innehålla information om den period för vilken den kommersiella garantin gäller. @sv
domain: Battery Product
range: xsd:string
related match: durationOfWarranty
related match: WarrantyPromise

Battery category
type: DatatypeProperty
governed by: DIN DKE SPEC 99100
source: Source: ESPR - Annex XIII (1)
label: Категория батерии @bg
label: Kategorie baterie @cs
label: Batterikategori @da
label: Batteriekategorie @de
label: Κατηγορία μπαταρίας @el
label: Categoría de batería @es
label: Aku kategooria @et
label: Akkuluokka @fi
label: Catégorie de batterie @fr
label: Catagóir ceallraí @ga
label: Kategorija baterije @hr
label: Akkumulátor kategória @hu
label: Categoria di batteria @it
label: Baterijos kategorija @lt
label: Baterijas kategorija @lv
label: Kategorija tal-batterija @mt
label: Batterijcategorie @nl
label: Kategoria baterii @pl
label: Categoria da bateria @pt
label: Categoria bateriei @ro
label: Kategória batérie @sk
comment: A battery passport must include the battery category. The battery category must be provided on the battery label. Categories: LMT battery, electric vehicle battery, or industrial battery.
comment: Паспортът на батерията трябва да включва категорията на батерията. Категорията на батерията трябва да бъде посочена на етикета на батерията. Категории: LMT батерия, батерия за електрически превозни средства или промишлена батерия. @bg
comment: Pasy baterie musí obsahovat kategorii baterie. Kategorie baterie musí být uvedena na štítku baterie. Kategorie: Baterie LMT, baterie pro elektrická vozidla nebo průmyslová baterie. @cs
comment: Et batteripas skal indeholde batterikategorien. Batterikategorien skal være angivet på batterietiketten. Kategorier: LMT-batteri, elbilbatteri eller industribatteri. @da
comment: Ein Batteriepass muss die Batteriekategorie enthalten. Die Batteriekategorie muss auf dem Batterieetikett angegeben werden. Kategorien: LMT-Batterie, Elektrofahrzeugbatterie oder Industriebatterie. @de
comment: Το διαβατήριο μιας μπαταρίας πρέπει να περιλαμβάνει την κατηγορία της μπαταρίας. Η κατηγορία της μπαταρίας πρέπει να αναγράφεται στην ετικέτα της μπαταρίας. Κατηγορίες: μπαταρία LMT, μπαταρία ηλεκτρικού οχήματος ή βιομηχανική μπαταρία. @el
comment: El pasaporte de una batería debe incluir la categoría de la batería. La categoría de la batería debe figurar en la etiqueta de la batería. Categorías: batería LMT, batería de vehículo eléctrico o batería industrial. @es
comment: Aku pass peab sisaldama aku kategooriat. Aku kategooria peab olema märgitud aku sildile. Kategooriad: LMT-aku, elektrisõiduki aku või tööstusaku. @et
comment: Akkupassiin on sisällyttävä akkuluokka. Akkuluokka on ilmoitettava akun etiketissä. Luokat: LMT-akku, sähköajoneuvon akku tai teollisuusparisto. @fi
comment: Un passeport de batterie doit inclure la catégorie de la batterie. La catégorie de la batterie doit être indiquée sur l'étiquette de la batterie. Catégories : batterie LMT, batterie de véhicule électrique ou batterie industrielle. @fr
comment: Ní mór catagóir na ceallraí a bheith i bpas ceallraí. Ní mór catagóir na ceallraí a bheith curtha ar fáil ar lipéad na ceallraí. Catagóirí: ceallraí LMT, ceallraí feithicle leictreach, nó ceallraí tionsclaíoch. @ga
comment: Putovnica baterije mora sadržavati kategoriju baterije. Kategorija baterije mora biti navedena na naljepnici baterije. Kategorije: LMT baterija, baterija za električna vozila ili industrijska baterija. @hr
comment: Az akkumulátor-útlevélnek tartalmaznia kell az akkumulátor kategóriáját. Az akkumulátor kategóriáját fel kell tüntetni az akkumulátor címkéjén. Kategóriák: LMT akkumulátor, elektromos jármű akkumulátor vagy ipari akkumulátor. @hu
comment: Il passaporto di una batteria deve includere la categoria della batteria. La categoria della batteria deve essere riportata sull'etichetta della batteria. Categorie: batteria LMT, batteria per veicoli elettrici o batteria industriale. @it
comment: Baterijos pase turi būti nurodyta baterijos kategorija. Baterijos kategorija turi būti nurodyta ant baterijos etiketės. Kategorijos: LMT baterija, elektrinių transporto priemonių baterija arba pramoninė baterija. @lt
comment: Baterijas pasē jāiekļauj baterijas kategorija. Baterijas kategorija jānorāda uz baterijas etiķetes. Kategorijas: LMT baterija, elektriskā transportlīdzekļa baterija vai rūpnieciskā baterija. @lv
comment: Passaport tal-batterija għandu jinkludi l-kategorija tal-batterija. Il-kategorija tal-batterija għandha tiġi pprovduta fuq it-tikketta tal-batterija. Kategoriji: batterija LMT, batterija ta' vettura elettrika, jew batterija industrijali. @mt
comment: Een batterijpaspoort moet de batterijcategorie bevatten. De batterijcategorie moet op het batterijlabel worden vermeld. Categorieën: LMT-batterij, batterij voor elektrische voertuigen of industriële batterij. @nl
comment: Paszport baterii musi zawierać kategorię baterii. Kategoria baterii musi być podana na etykiecie baterii. Kategorie: bateria LMT, bateria do pojazdów elektrycznych lub bateria przemysłowa. @pl
comment: Um passaporte de bateria deve incluir a categoria da bateria. A categoria da bateria deve ser fornecida na etiqueta da bateria. Categorias: bateria LMT, bateria de veículo elétrico ou bateria industrial. @pt
comment: Un pașaport de baterie trebuie să includă categoria bateriei. Categoria bateriei trebuie să fie furnizată pe eticheta bateriei. Categorii: baterie LMT, baterie pentru vehicule electrice sau baterie industrială. @ro
comment: Cestovný pas batérie musí obsahovať kategóriu batérie. Kategória batérie musí byť uvedená na štítku batérie. Kategórie: batéria LMT, batéria elektrického vozidla alebo priemyselná batéria. @sk
comment: Potni list za baterijo mora vsebovati kategorijo baterije. Kategorija baterije mora biti navedena na nalepki baterije. Kategorije: baterija LMT, baterija za električna vozila ali industrijska baterija. @sl
comment: Ett batteripass måste innehålla batterikategorin. Batterikategorin måste anges på batterietiketten. Kategorier: LMT-batteri, elfordonsbatteri или industribatteri. @sv
domain: Battery Product
range: xsd:string
related match: category
related match: productCategory

Battery mass
type: DatatypeProperty
governed by: DIN DKE SPEC 99100
unit: Kilogram
source: Source: ESPR - Annex XIII (1)
label: Маса на батерията @bg
label: Hmotnost baterie @cs
label: Batteriets masse @da
label: Batteriemasse @de
label: Μάζα μπαταρίας @el
label: Masa de la batería @es
label: Aku mass @et
label: Akun massa @fi
label: Masse de la batterie @fr
label: Mais na ceallraí @ga
label: Masa baterije @hr
label: Akkumulátor tömege @hu
label: Massa della batteria @it
label: Baterijos masė @lt
label: Baterijas masa @lv
label: Massa tal-batterija @mt
label: Batterijmassa @nl
label: Masa baterii @pl
label: Massa da bateria @pt
label: Masa bateriei @ro
label: Hmotnosť batérie @sk
label: Batterimassa @sv
comment: A battery passport must include the battery mass. The battery mass must also be provided on the battery label.
comment: Паспортът на батерията трябва да включва масата на батерията. Масата на батерията трябва да бъде посочена и на етикета на батерията. @bg
comment: Pasy baterie musí obsahovat hmotnost baterie. Hmotnost baterie musí být také uvedena na štítku baterie. @cs
comment: Et batteripas skal indeholde batteriets masse. Batteriets masse skal også være angivet på batterietiketten. @da
comment: Ein Batteriepass muss die Batteriemasse enthalten. Die Batteriemasse muss auch auf dem Batterieetikett angegeben werden. @de
comment: Το διαβατήριο μιας μπαταρίας πρέπει να περιλαμβάνει τη μάζα της μπαταρίας. Η μάζα της μπαταρίας πρέπει επίσης να αναγράφεται στην ετικέta της μπαταρίας. @el
comment: El pasaporte de una batería debe incluir la masa de la batería. La masa de la batería también debe figurar en la etiqueta de la batería. @es
comment: Aku pass peab sisaldama aku massi. Aku mass peab olema märgitud ka aku sildile. @et
comment: Akkupassiin on sisällyttävä akun massa. Akun massa on ilmoitettava myös akun etiketissä. @fi
comment: Un passeport de batterie doit inclure la masse de la batterie. La masse de la batterie doit également être indiquée sur l'étiquette de la batterie. @fr
comment: Ní mór mais na ceallraí a bheith i bpas ceallraí. Ní mór mais na ceallraí a bheith curtha ar fáil ar lipéad na ceallraí freisin. @ga
comment: Putovnica baterije mora sadržavati masu baterije. Masa baterije također mora biti navedena na naljepnici baterije. @hr
comment: Az akkumulátor-útlevélnek tartalmaznia kell az akkumulátor tömegét. Az akkumulátor tömegét az akkumulátor címkéjén is fel kell tüntetni. @hu
comment: Il passaporto di una batteria deve includere la massa della batteria. La massa della batteria deve essere riportata anche sull'etichetta della batteria. @it
comment: Baterijos pase turi būti nurodyta baterijos masė. Baterijos masė taip pat turi būti nurodyta ant baterijos etiketės. @lt
comment: Baterijas pasē jāiekļauj baterijas masa. Baterijas masa jānorāda arī uz baterijas etiķetes. @lv
comment: Passaport tal-batterija għandu jinkludi l-massa tal-batterija. Il-massa tal-batterija għandha tiġi pprovduta wkoll fuq it-tikketta tal-batterija. @mt
comment: Een batterijpaspoort moet de batterijmassa bevatten. De batterijmassa moet ook op het batterijlabel worden vermeld. @nl
comment: Paszport baterii musi zawierać masę baterii. Masa baterii musi być również podana na etykiecie baterii. @pl
comment: Um passaporte de bateria deve incluir a massa da bateria. A massa da bateria também deve ser fornecida na etiqueta da bateria. @pt
comment: Un pașaport de baterie trebuie să includă masa bateriei. Masa bateriei trebuie, de asemenea, să fie furnizată pe eticheta bateriei. @ro
comment: Cestovný pas batérie musí obsahovať hmotnosť batérie. Hmotnosť batérie musí byť uvedená aj na štítku batérie. @sk
comment: Potni list za baterijo mora vsebovati maso baterije. Masa baterije mora biti navedena tudi na nalepki baterije. @sl
comment: Ett batteripass måste innehålla batterimassan. Batterimassan måste också anges på batterietiketten. @sv
domain: Battery Product
range: xsd:double
related match: weight
related match: netWeight

Battery status
type: DatatypeProperty
governed by: DIN DKE SPEC 99100
source: Source: ESPR - Annex XIII (1)
label: Състояние на батерията @bg
label: Stav baterie @cs
label: Batteristatus @da
label: Batteriestatus @de
label: Κατάσταση μπαταρίας @el
label: Estado de la batería @es
label: Aku olek @et
label: Akun tila @fi
label: État de la batterie @fr
label: Stádas na ceallraí @ga
label: Stanje baterije @hr
label: Akkumulátor állapota @hu
label: Stato della batteria @it
label: Baterijos būsena @lt
label: Baterijas stāvoklis @lv
label: Stat tal-batterija @mt
label: Batterijstatus @nl
label: Stan baterii @pl
label: Estado da bateria @pt
label: Starea bateriei @ro
label: Stav batérie @sk
comment: A battery passport must include information on the status of the battery. Statuses: original, repurposed, re-used, remanufactured, or waste.
comment: Паспортът на батерията трябва да включва информация за състоянието на батерията. Състояния: оригинална, с променено предназначение, повторно използвана, преработена или отпадък. @bg
comment: Pasy baterie musí obsahovat informace o stavu baterie. Stavy: původní, repasovaná, znovu použitá, repasovaná nebo odpadní. @cs
comment: Et batteripas skal indeholde oplysninger om batteriets status. Statusser: original, genanvendt, genbrugt, renoveret eller affald. @da
comment: Ein Batteriepass muss Informationen über den Status der Batterie enthalten. Status: Original, wiederverwendet, wiederverwendet, wiederaufbereitet oder Abfall. @de
comment: Το διαβατήριο μιας μπαταρίας πρέπει να περιλαμβάνει πληροφορίες για την κατάσταση της μπαταρίας. Καταστάσεις: αρχική, επαναχρησιμοποιημένη, επαναχρησιμοποιημένη, ανακατασκευασμένη ή απόβλητη. @el
comment: El pasaporte de una batería debe incluir información sobre el estado de la batería. Estados: original, reutilizada, reutilizada, remanufacturada o de desecho. @es
comment: Aku pass peab sisaldama teavet aku oleku kohta. Olekud: originaal, ümbertöödeldud, korduskasutatud, ümbertöödeldud või jäätmed. @et
comment: Akkupassiin on sisällyttävä tietoja akun tilasta. Tilat: alkuperäinen, uudelleenkäytetty, uudelleenkäytetty, kunnostettu tai jäte. @fi
comment: Un passeport de batterie doit inclure des informations sur l'état de la batterie. États : original, réutilisé, réutilisé, remanufacturé ou déchet. @fr
comment: Ní mór faisnéis a bheith i bpas ceallraí maidir le stádas na ceallraí. Stádais: bunaidh, athchuspóirithe, athúsáidte, athmhonaraithe, nó dramhaíl. @ga
comment: Putovnica baterije mora sadržavati informacije o stanju baterije. Statusi: originalna, prenamijenjena, ponovno korištena, obnovljena ili otpadna. @hr
comment: Az akkumulátor-útlevélnek tartalmaznia kell az akkumulátor állapotára vonatkozó információkat. Állapotok: eredeti, újrafelhasznált, újrafelhasznált, újragyártott vagy hulladék. @hu
comment: Il passaporto di una batteria deve includere informazioni sullo stato della batteria. Stati: originale, riutilizzata, riutilizzata, rigenerata o di scarto. @it
comment: Baterijos pase turi būti pateikta informacija apie baterijos būseną. Būsenos: originali, perdirbta, pakartotinai panaudota, perdirbta arba atliekos. @lt
comment: Baterijas pasē jāiekļauj informācija par baterijas stāvokli. Statusi: oriģināla, pārstrādāta, atkārtoti izmantota, pārstrādāta vai atkritumi. @lv
comment: Passaport tal-batterija għandu jinkludi informazzjoni dwar l-istat tal-batterija. Status: oriġinali, użat mill-ġdid, użat mill-ġdid, manifatturat mill-ġdid, jew skart. @mt
comment: Een batterijpaspoort moet informatie bevatten over de status van de batterij. Statussen: origineel, hergebruikt, hergebruikt, gereviseerd of afval. @nl
comment: Paszport baterii musi zawierać informacje o stanie baterii. Statusy: oryginalna, ponownie wykorzystana, ponownie wykorzystana, regenerowana lub zużyta. @pl
comment: Um passaporte de bateria deve incluir informações sobre o estado da bateria. Estados: original, reaproveitada, reutilizada, remanufaturada ou resíduo. @pt
comment: Un pașaport de baterie trebuie să includă informații despre starea bateriei. Stări: originală, reutilizată, reutilizată, remanufacturată sau deșeu. @ro
comment: Cestovný pas batérie musí obsahovať informácie o stave batérie. Stavy: pôvodná, opätovne použitá, opätovne použitá, repasovaná alebo odpad. @sk
comment: Potni list za baterijo mora vsebovati informacije o stanju baterije. Stanja: originalna, predelana, ponovno uporabljena, predelana ali odpadna. @sl
comment: Ett batteripass måste innehålla information om batteriets status. Status: original, återanvänt, återanvänt, återtillverkat eller avfall. @sv
domain: Battery Product
range: xsd:string
related match: PropertyValue
related match: AdditionalProductClassificationDetails

Separate collection symbol
type: ObjectProperty
governed by: DIN DKE SPEC 99100
source: Source: ESPR - Annex XIII (1)
label: Символ за разделно събиране @bg
label: Symbol odděleného sběru @cs
label: Symbol for separat indsamling @da
label: Symbol für getrennte Sammlung @de
label: Σύμβολο χωριστής συλλογής @el
label: Símbolo de recogida selectiva @es
label: Eraldi kogumise sümbol @et
label: Erilliskeräyssymboli @fi
label: Symbole de collecte sélective @fr
label: Siombail an bhailiúcháin ar leithligh @ga
label: Simbol odvojenog prikupljanja @hr
label: Szelektív gyűjtés szimbóluma @hu
label: Simbolo della raccolta differenziata @it
label: Atskiro surinkimo simbolis @lt
label: Dalītas savākšanas simbols @lv
label: Simbolu tal-ġbir separat @mt
label: Symbool voor gescheiden inzameling @nl
label: Symbol selektywnej zbiórki @pl
label: Símbolo de recolha seletiva @pt
label: Simbolul colectării separate @ro
label: Symbol separovaného zberu @sk
label: Simbol ločenega zbiranja @sl
label: Symbol för separat insamling @sv
comment: The battery passport must include the symbol for separate collection. The symbol should be translated into text to ensure machine readability.
comment: Паспортът на батерията трябва да включва символа за разделно събиране. Символът трябва да бъде преведен в текст, за да се осигуri машинна четливост. @bg
comment: Pasy baterie musí obsahovat symbol pro oddělený sběr. Symbol by měl být přeložen do textu, aby byla zajištěna strojová čitelnost. @cs
comment: Batteripasset skal indeholde symbolet for separat indsamling. Symbolet skal oversættes til tekst for at sikre maskinlæsbarhed. @da
comment: Der Batteriepass muss das Symbol für die getrennte Sammlung enthalten. Das Symbol sollte in Text übersetzt werden, um die Maschinenlesbarkeit zu gewährleisten. @de
comment: Το διαβατήριο της μπαταρίας πρέπει να περιλαμβάνει το σύμβολο για τη χωριστή συλλογή. Το σύμβολο πρέπει να μεταφραστεί σε κείμενο για να διασφαλιστεί η αναγνωσιμότητα από μηχανή. @el
comment: El pasaporte de la batería debe incluir el símbolo de recogida selectiva. El símbolo debe traducirse a texto para garantizar la legibilidad por máquina. @es
comment: Aku pass peab sisaldama eraldi kogumise sümbolit. Sümbol tuleks masinloetavuse tagamiseks tõlkida tekstiks. @et
comment: Akkupassiin on sisällyttävä erilliskeräyksen symboli. Symboli tulisi kääntää tekstiksi koneellisen luettavuuden varmistamiseksi. @fi
comment: Le passeport de la batterie doit inclure le symbole de la collecte sélective. Le symbole doit être traduit en texte pour garantir la lisibilité par machine. @fr
comment: Ní mór an tsiombail do bhailiú ar leithligh a bheith ar phas na ceallraí. Ba cheart an tsiombail a aistriú go téacs chun inléiteacht meaisín a chinntiú. @ga
comment: Putovnica baterije mora sadržavati simbol za odvojeno prikupljanje. Simbol bi trebao biti preveden u tekst kako bi se osigurala strojna čitljivost. @hr
comment: Az akkumulátor-útlevélnek tartalmaznia kell a szelektív gyűjtés szimbólumát. A szimbólumot szöveggé kell fordítani a gépi olvashatóság biztosítása érdekében. @hu
comment: Il passaporto della batteria deve includere il simbolo della raccolta differenziata. Il simbolo deve essere tradotto in testo per garantirne la leggibilità automatica. @it
comment: Baterijos pase turi būti atskiro surinkimo simbolis. Simbolis turėtų būti išverstas į tekstą, kad būtų užtikrintas mašininis nuskaitymas. @lt
comment: Baterijas pasē jāiekļauj dalītas savākšanas simbols. Simbols jāpārtulko tekstā, lai nodrošinātu mašīnlasāmību. @lv
comment: Il-passaport tal-batterija għandu jinkludi s-simbolu għall-ġbir separat. Is-simbolu għandu jiġi tradott f'test biex tiġi żgurata l-leġibbiltà tal-magni. @mt
comment: Het batterijpaspoort moet het symbool voor gescheiden inzameling bevatten. Het symbool moet worden vertaald in tekst om de machineleesbaarheid te garanderen. @nl
comment: Paszport baterii musi zawierać symbol selektywnej zbiórki. Symbol powinien zostać przetłumaczony na tekst, aby zapewnić czytelność maszynową. @pl
comment: O passaporte da bateria deve incluir o símbolo de recolha seletiva. O símbolo deve ser traduzido em texto para garantir a legibilidade por máquina. @pt
comment: Pașaportul bateriei trebuie să includă simbolul pentru colectarea separată. Simbolul ar trebui tradus în text pentru a asigura lizibilitatea automată. @ro
comment: Cestovný pas batérie musí obsahovať symbol separovaného zberu. Symbol by sa mal preložiť do textu, aby sa zabezpečila strojová čitateľnosť. @sk
comment: Potni list baterije mora vsebovati simbol za ločeno zbiranje. Simbol je treba prevesti v besedilo, da se zagotovi strojna berljivost. @sl
comment: Batteripasset måste innehålla symbolen för separat insamling. Symbolen bör översättas till text för att säkerställa maskinläsbarhet. @sv
domain: Battery Product
range: RelatedResource
related match: image

Symbols for cadmium and lead
type: ObjectProperty
governed by: DIN DKE SPEC 99100
source: Source: ESPR - Annex XIII (1)
label: Символи за кадмий и олово @bg
label: Symboly pro kadmium a olovo @cs
label: Symboler for cadmium og bly @da
label: Symbole für Cadmium und Blei @de
label: Σύμβολα για το κάδμιο και τον μόλυβδο @el
label: Símbolos para el cadmio y el plomo @es
label: Kaadmiumi ja plii sümbolid @et
label: Kadmiumin ja lyijyn symbolit @fi
label: Symboles pour le cadmium et le plomb @fr
label: Siombailí le haghaidh caidmiam agus luaidhe @ga
label: Simboli za kadmij i olovo @hr
label: A kadmium és az ólom szimbólumai @hu
label: Simboli per cadmio e piombo @it
label: Kadmo ir švino simboliai @lt
label: Kadmija un svina simboli @lv
label: Simboli għall-kadmju u ċ-ċomb @mt
label: Symbolen voor cadmium en lood @nl
label: Symbole kadmu i ołowiu @pl
label: Símbolos para cádmio e chumbo @pt
label: Simboluri pentru cadmiu și plumb @ro
label: Symboly pre kadmium a olovo @sk
label: Simboli za kadmij in svinec @sl
label: Symboler för kadmium och bly @sv
comment: Batteries containing more than 0.002% cadmium or 0.004% lead must be marked with the chemical symbol (Cd or Pb).
comment: Батериите, съдържащи повече от 0,002% кадмий или 0,004% олово, трябва да бъдат маркирани с химическия символ (Cd или Pb). @bg
comment: Baterie obsahující více než 0,002 % kadmia nebo 0,004 % olova musí být označeny chemickou značkou (Cd nebo Pb). @cs
comment: Batterier, der indeholder mere end 0,002 % cadmium eller 0,004 % bly, skal være mærket med det kemiske symbol (Cd eller Pb). @da
comment: Batterien, die mehr als 0,002 % Cadmium oder 0,004 % Blei enthalten, müssen mit dem chemischen Symbol (Cd oder Pb) gekennzeichnet sein. @de
comment: Οι μπαταρίες που περιέχουν περισσότερο από 0,002% κάδμιο ή 0,004% μόλυβδο πρέπει να φέρουν το χημικό σύμβολο (Cd ή Pb). @el
comment: Las baterías que contengan más de un 0,002 % de cadmio o un 0,004 % de plomo deberán ir marcadas con el símbolo químico (Cd o Pb). @es
comment: Patareid, mis sisaldavad üle 0,002 % kaadmiumi või 0,004 % pliid, peavad olema märgistatud keemilise sümboliga (Cd või Pb). @et
comment: Paristot, jotka sisältävät yli 0,002 % kadmiumia tai 0,004 % lyijyä, on merkittävä kemiallisella symbolilla (Cd tai Pb). @fi
comment: Les batteries contenant plus de 0,002 % de cadmium ou 0,004 % de plomb doivent être marquées du symbole chimique (Cd ou Pb). @fr
comment: Ní mór cadhnraí ina bhfuil níos mó ná 0.002% caidmiam nó 0.004% luaidhe a mharcáil leis an tsiombail cheimiceach (Cd nó Pb). @ga
comment: Baterije koje sadrže više od 0,002 % kadmija ili 0,004 % olova moraju biti označene kemijskim simbolom (Cd ili Pb). @hr
comment: A 0,002%-nál több kadmiumot vagy 0,004%-nál több ólmot tartalmazó elemeket a vegyjellel (Cd vagy Pb) kell megjelölni. @hu
comment: Le batterie contenenti più dello 0,002% di cadmio o dello 0,004% di piombo devono essere contrassegnate con il simbolo chimico (Cd o Pb). @it
comment: Baterijos, kuriose yra daugiau kaip 0,002 % kadmio arba 0,004 % švino, turi būti pažymėtos cheminiu simboliu (Cd arba Pb). @lt
comment: Baterijas, kas satur vairāk nekā 0,002 % kadmija vai 0,004 % svina, jāmarķē ar ķīmisko simbolu (Cd vai Pb). @lv
comment: Batteriji li fihom aktar minn 0.002% kadmju jew 0.004% ċomb għandhom ikunu mmarkati bis-simbolu kimiku (Cd jew Pb). @mt
comment: Batterijen die meer dan 0,002% cadmium of 0,004% lood bevatten, moeten worden gemarkeerd met het chemische symbool (Cd of Pb). @nl
comment: Baterie zawierające więcej niż 0,002% kadmu lub 0,004% ołowiu muszą być oznaczone symbolem chemicznym (Cd lub Pb). @pl
comment: As baterias que contenham mais de 0,002% de cádmio ou 0,004% de chumbo devem ser marcadas com o símbolo químico (Cd ou Pb). @pt
comment: Bateriile care conțin mai mult de 0,002% cadmiu sau 0,004% plumb trebuie să fie marcate cu simbolul chimic (Cd sau Pb). @ro
comment: Batérie obsahujúce viac ako 0,002 % kadmia alebo 0,004 % olova musia byť označené chemickou značkou (Cd alebo Pb). @sk
comment: Baterije, ki vsebujejo več kot 0,002 % kadmija ali 0,004 % svinca, morajo biti označene s kemijskim simbolom (Cd ali Pb). @sl
comment: Batterier som innehåller mer än 0,002 % kadmium eller 0,004 % bly måste vara märkta med den kemiska symbolen (Cd eller Pb). @sv
domain: Battery Product
range: RelatedResource
related match: Text

Carbon footprint label
type: ObjectProperty
governed by: DIN DKE SPEC 99100
source: Source: ESPR - Annex XIII (1)
label: Етикет за въглероден отпечатък @bg
label: Štítek s uhlíkovou stopou @cs
label: Mærke for CO2-fodaftryk @da
label: Label für den CO2-Fußabdruck @de
label: Ετικέτα αποτυπώματος άνθρακα @el
label: Etiqueta de huella de carbono @es
label: Süsinikujalajälje märgis @et
label: Hiilijalanjälkimerkintä @fi
label: Étiquette de l'empreinte carbone @fr
label: Lipéad lorg carbóin @ga
label: Oznaka ugljičnog otiska @hr
label: Szénlábnyom-címke @hu
label: Etichetta dell'impronta di carbonio @it
label: Anglies pėdsako etiketė @lt
label: Oglekļa pēdas marķējums @lv
label: Tikketta tal-marka tal-karbonju @mt
label: Label voor CO2-voetafdruk @nl
label: Etykieta śladu węglowego @pl
label: Rótulo da pegada de carbono @pt
label: Eticheta amprentei de carbon @ro
label: Štítok s uhlíkovou stopou @sk
label: Oznaka ogljičnega odtisa @sl
label: Märkning för koldioxidavtryck @sv
comment: EV and rechargeable industrial batteries > 2 kWh and LMT batteries must bear a label indicating the carbon footprint and performance class.
comment: EV и презареждаемите промишлени батерии > 2 kWh и LMT батериите трябва да носят етикет, указващ въглеродния отпечатък и класа на производителност. @bg
comment: Baterie pro elektromobily a dobíjecí průmyslové baterie > 2 kWh a baterie LMT musí být opatřeny štítkem udávajícím uhlíkovou stopu a třídu výkonu. @cs
comment: Elbiler og genopladelige industribatterier > 2 kWh og LMT-batterier skal være forsynet med en etiket, der angiver CO2-fodaftryk og ydeevneklasse. @da
comment: Elektrofahrzeugbatterien und wiederaufladbare Industriebatterien > 2 kWh sowie LMT-Batterien müssen ein Etikett mit Angabe des CO2-Fußabdrucks und der Leistungsklasse tragen. @de
comment: Οι μπαταρίες ηλεκτρικών οχημάτων και οι επαναφορτιζόμενες βιομηχανικές μπαταρίες > 2 kWh και οι μπαταρίες LMT πρέπει να φέρουν ετικέτα που να αναφέρει το αποτύπωμα άνθρακα και την κατηγορία απόδοσης. @el
comment: Las baterías de vehículos eléctricos y las baterías industriales recargables > 2 kWh y las baterías LMT deben llevar una etiqueta que indique la huella de carbono y la clase de rendimiento. @es
comment: Elektrisõidukite ja laetavate tööstusakude > 2 kWh ja LMT akud peavad kandma märgist, mis näitab süsinikujalajälge ja jõudlusklassi. @et
comment: Sähköajoneuvojen ja ladattavien teollisuusakkujen > 2 kWh ja LMT-akkujen on oltava varustettu merkinnällä, joka ilmaisee hiilijalanjäljen ja suorituskykyluokan. @fi
comment: Les batteries de véhicules électriques et les batteries industrielles rechargeables > 2 kWh ainsi que les batteries LMT doivent porter une étiquette indiquant l'empreinte carbone et la classe de performance. @fr
comment: Ní mór lipéad a bheith ar chadhnraí tionsclaíocha EV agus in-athluchtaithe > 2 kWh agus ar chadhnraí LMT a léiríonn an lorg carbóin agus an aicme feidhmíochta. @ga
comment: Baterije za električna vozila i punjive industrijske baterije > 2 kWh i LMT baterije moraju nositi oznaku koja označava ugljični otisak i klasu performansi. @hr
comment: Az elektromos járművek és az újratölthető ipari akkumulátorok > 2 kWh és az LMT akkumulátorok címkéjén fel kell tüntetni a szénlábnyomot és a teljesítményosztályt. @hu
comment: Le batterie per veicoli elettrici e le batterie industriali ricaricabili > 2 kWh e le batterie LMT devono recare un'etichetta che indichi l'impronta di carbonio e la classe di prestazione. @it
comment: EV ir įkraunamos pramoninės baterijos > 2 kWh ir LMT baterijos turi būti paženklintos etikete, nurodančia anglies pėdsaką ir eksploatacinių savybių klasę. @lt
comment: EV un uzlādējamām rūpnieciskajām baterijām > 2 kWh un LMT baterijām jābūt marķētām ar etiķeti, kurā norādīta oglekļa pēda un veiktspējas klase. @lv
comment: Il-batteriji industrijali rikarikabbli u tal-vetturi elettriċi > 2 kWh u l-batteriji LMT għandhom ikollhom tikketta li tindika l-marka tal-karbonju u l-klassi tal-prestazzjoni. @mt
comment: EV en oplaadbare industriële batterijen > 2 kWh en LMT-batterijen moeten een etiket dragen met de CO2-voetafdruk en de prestatieklasse. @nl
comment: Baterie do pojazdów elektrycznych i akumulatory przemysłowe wielokrotnego ładowania > 2 kWh oraz baterie LMT muszą być opatrzone etykietą wskazującą ślad węglowy i klasę wydajności. @pl
comment: As baterias de veículos elétricos e as baterias industriais recarregáveis > 2 kWh e as baterias LMT devem ostentar um rótulo que indique a pegada de carbono e a classe de desempenho. @pt
comment: Bateriile pentru vehicule electrice și bateriile industriale reîncărcabile > 2 kWh și bateriile LMT trebuie să poarte o etichetă care să indice amprenta de carbon și clasa de performanță. @ro
comment: Batérie pre elektrické vozidlá a nabíjateľné priemyselné batérie > 2 kWh a batérie LMT musia byť označené štítkom s uvedením uhlíkovej stopy a výkonnostnej triedy. @sk
comment: Baterije za električna vozila in polnilne industrijske baterije > 2 kWh ter baterije LMT morajo imeti oznako, ki označuje ogljični odtis in razred zmogljivosti. @sl
comment: Elfordonsbatterier och laddningsbara industribatterier > 2 kWh samt LMT-batterier ska ha en märkning som anger koldioxidavtryck och prestandaklass. @sv
domain: Battery Product
range: RelatedResource
related match: PropertyValue
related match: AdditionalProductClassificationDetails

Extinguishing agent
type: DatatypeProperty
governed by: DIN DKE SPEC 99100
source: Source: ESPR - Annex XIII (1)
label: Пожарогасителен агент @bg
label: Hasicí prostředek @cs
label: Slukningsmiddel @da
label: Löschmittel @de
label: Πυροσβεστικό μέσο @el
label: Agente extintor @es
label: Kustutusaine @et
label: Sammutusaine @fi
label: Agent extincteur @fr
label: Gníomhaire múchta @ga
label: Sredstvo za gašenje @hr
label: Oltóanyag @hu
label: Agente estinguente @it
label: Gesinimo priemonė @lt
label: Ugunsdzēsības līdzeklis @lv
label: Aġent tat-tifi @mt
label: Blusmiddel @nl
label: Środek gaśniczy @pl
label: Agent de stingere @ro
label: Hasiaca látka @sk
label: Gasilno sredstvo @sl
label: Släckmedel @sv
comment: A battery passport must include the usable extinguishing agent. The information should be related to their possible area of application as regulated in DIN EN 2.
comment: Паспортът на батерията трябва да включва използвания пожарогасителен агент. Информацията трябва да бъде свързана с възможната им област на приложение, както е регламентирано в DIN EN 2. @bg
comment: Pasy baterie musí obsahovat použitelný hasicí prostředek. Informace by se měly vztahovat k jejich možné oblasti použití, jak je upraveno v DIN EN 2. @cs
comment: Et batteripas skal indeholde det anvendelige slukningsmiddel. Oplysningerne skal relatere sig til deres mulige anvendelsesområde som reguleret i DIN EN 2. @da
comment: Ein Batteriepass muss das verwendbare Löschmittel enthalten. Die Informationen sollten sich auf ihren möglichen Anwendungsbereich beziehen, wie er in DIN EN 2 geregelt ist. @de
comment: Το διαβατήριο μιας μπαταρίας πρέπει να περιλαμβάνει το χρησιμοποιήσιμο πυροσβεστικό μέσο. Οι πληροφορίες θα πρέπει να σχετίζονται με τον πιθανό τομέα εφαρμογής τους, όπως ρυθμίζεται στο DIN EN 2. @el
comment: El pasaporte de una batería debe incluir el agente extintor utilizable. La información debe estar relacionada con su posible área de aplicación, tal como se regula en la norma DIN EN 2. @es
comment: Aku pass peab sisaldama kasutatavat kustutusainet. Teave peaks olema seotud nende võimaliku kasutusvaldkonnaga, nagu on reguleeritud standardis DIN EN 2. @et
comment: Akkupassiin on sisällyttävä käyttökelpoinen sammutusaine. Tietojen tulee liittyä niiden mahdolliseen soveltamisalaan, sellaisena kuin se on säännelty standardissa DIN EN 2. @fi
comment: Un passeport de batterie doit inclure l'agent extincteur utilisable. Les informations doivent être liées à leur domaine d'application possible, tel que réglementé par la norme DIN EN 2. @fr
comment: Ní mór an gníomhaire múchta inúsáidte a bheith i bpas ceallraí. Ba cheart go mbeadh an fhaisnéis bainteach lena réimse feidhme féideartha mar atá rialaithe in DIN EN 2. @ga
comment: Putovnica baterije mora sadržavati upotrebljivo sredstvo za gašenje. Podaci bi se trebali odnositi na njihovo moguće područje primjene kako je regulirano u DIN EN 2. @hr
comment: Az akkumulátor-útlevélnek tartalmaznia kell a használható oltóanyagot. Az információnak a DIN EN 2 szabványban szabályozott lehetséges alkalmazási területükhöz kell kapcsolódnia. @hu
comment: Un passaporto della batteria deve includere l'agente estinguente utilizzabile. Le informazioni devono essere correlate alla loro possibile area di applicazione, come regolamentato dalla norma DIN EN 2. @it
comment: Baterijos pase turi būti nurodyta tinkama gesinimo priemonė. Informacija turėtų būti susijusi su galima jų taikymo sritimi, kaip reglamentuota DIN EN 2. @lt
comment: Baterijas pasē jāiekļauj izmantojamais ugunsdzēsības līdzeklis. Informācijai jābūt saistītai ar to iespējamo pielietojuma jomu, kā regulēts DIN EN 2. @lv
comment: Passaport tal-batterija għandu jinkludi l-aġent tat-tifi li jista' jintuża. L-informazzjoni għandha tkun relatata maż-żona ta' applikazzjoni possibbli tagħhom kif irregolat f'DIN EN 2. @mt
comment: Een batterijpaspoort moet het bruikbare blusmiddel vermelden. De informatie moet betrekking hebben op hun mogelijke toepassingsgebied zoals geregeld in DIN EN 2. @nl
comment: Paszport baterii musi zawierać użyteczny środek gaśniczy. Informacje powinny być powiązane z ich możliwym obszarem zastosowania zgodnie z normą DIN EN 2. @pl
comment: Um passaporte de bateria deve incluir o agente extintor utilizável. A informação deve estar relacionada com a sua possível área de aplicação, conforme regulamentado na DIN EN 2. @pt
comment: Un pașaport de baterie trebuie să includă agentul de stingere utilizabil. Informațiile ar trebui să fie legate de domeniul lor de aplicare posibil, așa cum este reglementat în DIN EN 2. @ro
comment: Cestovný pas batérie musí obsahovať použiteľnú hasiacu látku. Informácie by sa mali týkať ich možnej oblasti použitia, ako je to upravené v norme DIN EN 2. @sk
comment: Potni list za baterijo mora vsebovati uporabno gasilno sredstvo. Informacije morajo biti povezane z njihovim možnim področjem uporabe, kot je določeno v standardu DIN EN 2. @sl
comment: Ett batteripass måste innehålla det användbara släckmedlet. Informationen bör relatera till deras möjliga tillämpningsområde enligt regleringen i DIN EN 2. @sv
domain: Battery Product
range: xsd:string
related match: material

Meaning of labels and symbols
type: DatatypeProperty
governed by: DIN DKE SPEC 99100
source: Source: ESPR - Annex XIII (1)
label: Значение на етикетите и символите @bg
label: Význam štítků a symbolů @cs
label: Betydning af etiketter og symboler @da
label: Bedeutung von Etiketten und Symbolen @de
label: Σημασία ετικετών και συμβόλων @el
label: Significado de etiquetas y símbolos @es
label: Märgiste ja sümbolite tähendus @et
label: Merkintöjen ja symbolien merkitys @fi
label: Signification des étiquettes et des symboles @fr
label: Brí na lipéad agus na siombailí @ga
label: Značenje oznaka i simbola @hr
label: A címkék és szimbólumok jelentése @hu
label: Significato di etichette e simboli @it
label: Ženklų ir simbolių reikšmė @lt
label: Etiķešu un simbolu nozīme @lv
label: Tifsira ta' tikketti u simboli @mt
label: Betekenis van labels en symbolen @nl
label: Znaczenie etykiet i symboli @pl
label: Significado de rótulos e símbolos @pt
label: Semnificația etichetelor și a simbolurilor @ro
label: Význam štítkov a symbolov @sk
label: Pomen nalepk in simbolov @sl
label: Betydelse av etiketter och symboler @sv
comment: Information regarding the prevention and management of waste batteries including the meaning of the labels and symbols.
comment: Информация относно предотвратяването и управлението на отпадъчни батерии, включително значението на етикетите и символите. @bg
comment: Informace o prevenci a nakládání s odpadními bateriemi včetně významu štítků a symbolů. @cs
comment: Oplysninger om forebyggelse og håndtering af udtjente batterier, herunder betydningen af mærkater og symboler. @da
comment: Informationen zur Vermeidung und Bewirtschaftung von Altbatterien einschließlich der Bedeutung der Etiketten und Symbole. @de
comment: Πληροφορίες σχετικά με την πρόληψη και τη διαχείριση των αποβλήτων μπαταριών, συμπεριλαμβανομένης της σημασίας των ετικετών και των συμβόλων. @el
comment: Información relativa a la prevención y gestión de las pilas usadas, incluido el significado de las etiquetas y los símbolos. @es
comment: Teave patareijäätmete ennetamise ja käitlemise kohta, sealhulgas märgiste ja sümbolite tähendus. @et
comment: Tietoja käytettyjen paristojen ehkäisystä ja käsittelystä, mukaan lukien merkintöjen ja symbolien merkitys. @fi
comment: Informations concernant la prévention et la gestion des piles et accumulateurs usagés, y compris la signification des étiquettes et des symboles. @fr
comment: Faisnéis maidir le dramhchadhnraí a chosc agus a bhainistiú, lena n-áirítear brí na lipéad agus na siombailí. @ga
comment: Informacije o sprečavanju i gospodarenju otpadnim baterijama, uključujući značenje oznaka i simbola. @hr
comment: Tájékoztatás a hulladékelemek megelőzéséről és kezeléséről, beleértve a címkék és szimbólumok jelentését is. @hu
comment: Informazioni sulla prevenzione e la gestione delle batterie esauste, compreso il significato delle etichette e dei simboli. @it
comment: Informacija apie baterijų atliekų prevenciją ir tvarkymą, įskaitant etikečių ir simbolių reikšmę. @lt
comment: Informācija par bateriju atkritumu novēršanu un apsaimniekošanu, tostarp etiķešu un simbolu nozīmi. @lv
comment: Informazzjoni dwar il-prevenzjoni u l-ġestjoni tal-iskart tal-batteriji inkluż it-tifsira tat-tikketti u s-simboli. @mt
comment: Informatie over de preventie en het beheer van afgedankte batterijen, met inbegrip van de betekenis van de etiketten en symbolen. @nl
comment: Informacje dotyczące zapobiegania powstawaniu zużytych baterii i gospodarowania nimi, w tym znaczenie etykiet i symboli. @pl
comment: Informações relativas à prevenção e gestão de resíduos de pilhas, incluindo o significado dos rótulos e símbolos. @pt
comment: Informații privind prevenirea și gestionarea deșeurilor de baterii, inclusiv semnificația etichetelor și a simbolurilor. @ro
comment: Informácie o predchádzaní vzniku odpadových batérií a hospodárení s nimi vrátane významu označení a symbolov. @sk
comment: Informacije v zvezi s preprečevanjem in ravnanjem z odpadnimi baterijami, vključno s pomenom oznak in simbolov. @sl
comment: Information om förebyggande och hantering av förbrukade batterier, inklusive betydelsen av etiketter och symboler. @sv
domain: Battery Product
range: xsd:string
related match: description
related match: productDescription

Results of test reports proving compliance
type: ObjectProperty
governed by: DIN DKE SPEC 99100
source: Source: ESPR - Annex XIII (1)
label: Резултати от протоколи от изпитвания, доказващи съответствие @bg
label: Výsledky zkušebních protokolů prokazujících shodu @cs
label: Resultater af testrapporter, der beviser overensstemmelse @da
label: Ergebnisse von Prüfberichten zum Nachweis der Konformität @de
label: Αποτελέσματα εκθέσεων δοκιμών που αποδεικνύουν τη συμμόρφωση @el
label: Resultados de los informes de ensayo que demuestran la conformidad @es
label: Vastavust tõendavate katseprotokollide tulemused @et
label: Vaatimustenmukaisuuden osoittavien testausraporttien tulokset @fi
label: Résultats des rapports d'essais prouvant la conformité @fr
label: Torthaí na dtuarascálacha tástála a chruthaíonn comhlíonadh @ga
label: Rezultati izvješća o ispitivanju kojima se dokazuje sukladnost @hr
label: A megfelelőséget igazoló vizsgálati jelentések eredményei @hu
label: Risultati dei rapporti di prova che dimostrano la conformità @it
label: Atitiktį įrodančių bandymų ataskaitų rezultatai @lt
label: Atbilstību apliecinošu testēšanas pārskatu rezultāti @lv
label: Riżultati ta' rapporti tat-test li juru l-konformità @mt
label: Resultaten van testrapporten die de conformiteit aantonen @nl
label: Wyniki sprawozdań z badań potwierdzających zgodność @pl
label: Resultados dos relatórios de ensaio que comprovam a conformidade @pt
label: Rezultatele rapoartelor de încercare care dovedesc conformitatea @ro
label: Výsledky skúšobných protokolov preukazujúcich zhodu @sk
label: Rezultati poročil o preskusih, ki dokazujejo skladnost @sl
label: Resultat av provningsrapporter som bevisar överensstämmelse @sv
comment: A battery passport must include the test report results that can prove the compliance with the requirements stated in the battery regulation.
comment: Паспортът на батерията трябва да включва резултатите от протокола от изпитването, които могат да докажат съответствието с изискванията, посочени в регламента за батериите. @bg
comment: Pasy baterie musí obsahovat výsledky zkušebního protokolu, které mohou prokázat shodu s požadavky uvedenými v nařízení o bateriích. @cs
comment: Et batteripas skal indeholde testrapportresultaterne, der kan bevise overensstemmelse med kravene i batteriforordningen. @da
comment: Ein Batteriepass muss die Ergebnisse des Prüfberichts enthalten, die die Einhaltung der in der Batterieverordnung festgelegten Anforderungen nachweisen können. @de
comment: Ένα διαβατήριο μπαταρίας πρέπει να περιλαμβάνει τα αποτελέesματα της έκθεσης δοκιμών που μπορούν να αποδείξουν τη συμμόρφωση με τις απαιτήσεις που αναφέρονται στον κανονισμό για τις μπαταρίες. @el
comment: Un pasaporte de batería debe incluir los resultados del informe de ensayo que puedan demostrar el cumplimiento de los requisitos establecidos en el reglamento sobre baterías. @es
comment: Aku pass peab sisaldama katsearuande tulemusi, mis tõendavad vastavust akunõuetes sätestatud nõuetele. @et
comment: Akkupassiin on sisällyttävä testausraportin tulokset, jotka voivat osoittaa akkuasetuksessa annettujen vaatimusten noudattamisen. @fi
comment: Un passeport de batterie doit inclure les résultats du rapport d'essai qui peuvent prouver la conformité aux exigences énoncées dans le règlement sur les batteries. @fr
comment: Ní mór torthaí na tuarascála tástála a bheith ar phas ceallraí a fhéadfaidh an chomhlíonadh leis na ceanglais a luaitear sa rialachán ceallraí a chruthú. @ga
comment: Putovnica baterije mora sadržavati rezultate izvješća o ispitivanju koji mogu dokazati sukladnost sa zahtjevima navedenima u uredbi o baterijama. @hr
comment: Az akkumulátor-útlevélnek tartalmaznia kell a vizsgálati jegyzőkönyv eredményeit, amelyek igazolni tudják az akkumulátor-rendeletben meghatározott követelményeknek való megfelelést. @hu
comment: Un passaporto della batteria deve includere i risultati del rapporto di prova che possono dimostrare la conformità ai requisiti indicati nel regolamento sulle batterie. @it
comment: Baterijos pase turi būti pateikti bandymo protokolo rezultatai, kuriais galima įrodyti, kad laikomasi baterijų reglamente nustatytų reikalavimų. @lt
comment: Baterijas pasē jāiekļauj testēšanas pārskata rezultāti, kas var pierādīt atbilstību bateriju regulācijā noteiktajām prasībām. @lv
comment: Passaport tal-batterija għandu jinkludi r-riżultati tar-rapport tat-test li jistgħu juru l-konformità mar-rekwiżiti ddikjarati fir-regolament dwar il-batteriji. @mt
comment: Een batterijpaspoort moet de resultaten van het testrapport bevatten die de conformiteit met de vereisten in de batterijverordening kunnen aantonen. @nl
comment: Paszport baterii musi zawierać wyniki sprawozdania z badań, które mogą potwierdzić zgodność z wymogami określonymi w rozporządzeniu w sprawie baterii. @pl
comment: Um passaporte de bateria deve incluir os resultados do relatório de ensaio que podem comprovar a conformidade com os requisitos estabelecidos no regulamento relativo às baterias. @pt
comment: Un pașaport de baterie trebuie să includă rezultatele raportului de încercare care pot dovedi conformitatea cu cerințele menționate în regulamentul privind bateriile. @ro
comment: Cestovný pas batérie musí obsahovať výsledky skúšobného protokolu, ktoré môžu preukázať zhodu s požiadavkami uvedenými v nariadení o batériách. @sk
comment: Potni list za baterijo mora vsebovati rezultate poročila o preskusu, s katerimi se lahko dokaže skladnost z zahtevami iz uredbe o baterijah. @sl
comment: Ett batteripass måste innehålla testrapportresultaten som kan bevisa överensstämmelse med kraven i batteriförordningen. @sv
domain: Battery Product
range: RelatedResource
related match: Report

Carbon footprint performance class
type: DatatypeProperty
governed by: DIN DKE SPEC 99100
source: Source: ESPR - Annex XIII (1)
label: Клас на ефективност по отношение на въглеродния отпечатък @bg
label: Třída výkonu uhlíkové stopy @cs
label: Ydeevneklasse for CO2-fodaftryk @da
label: Leistungsklasse für den CO2-Fußabdruck @de
label: Κατηγορία απόδοσης αποτυπώματος άνθρακα @el
label: Clase de rendimiento de la huella de carbono @es
label: Süsinikujalajälje tulemuslikkuse klass @et
label: Hiilijalanjäljen suorituskykyluokka @fi
label: Classe de performance de l'empreinte carbone @fr
label: Aicme feidhmíochta lorg carbóin @ga
label: Klasa učinkovitosti ugljičnog otiska @hr
label: Szénlábnyom-teljesítményosztály @hu
label: Classe di prestazione dell'impronta di carbonio @it
label: Anglies pėdsako efektyvumo klasė @lt
label: Oglekļa pēdas veiktspējas klase @lv
label: Klassi tal-prestazzjoni tal-marka tal-karbonju @mt
label: Prestatieklasse koolstofvoetafdruk @nl
label: Klasa efektywności śladu węglowego @pl
label: Classe de desempenho da pegada de carbono @pt
label: Clasa de performanță a amprentei de carbon @ro
label: Trieda environmentálnej výkonnosti uhlíkovej stopy @sk
label: Razred učinkovitosti ogljičnega odtisa @sl
label: Prestandaklass för koldioxidavtryck @sv
comment: The battery passport must include the carbon footprint performance class in accordance with the delegated and implementing acts.
comment: Паспортът на батерията трябва да включва класа на ефективност по отношение на въглеродния отпечатък в съответствие с делегираните актове и актовете за изпълнение. @bg
comment: Pasy baterie musí obsahovat třídu výkonnosti uhlíkové stopy v souladu s akty v přenesené pravomoci a prováděcími akty. @cs
comment: Batteripasset skal indeholde ydeevneklassen for CO2-fodaftryk i overensstemmelse med de delegerede retsakter og gennemførelsesretsakter. @da
comment: Der Batteriepass muss die Leistungsklasse für den CO2-Fußabdruck in Übereinstimmung mit den delegierten Rechtsakten und Durchführungsrechtsakten enthalten. @de
comment: Το διαβατήριο της μπαταρίας πρέπει να περιλαμβάνει την κατηγορία απόδοσης αποτυπώματος άνθρακα σύμφωνα με τις κατ' εξουσιοδότηση και εκτελεστικές πράξεις. @el
comment: El pasaporte de la batería debe incluir la clase de rendimiento de la huella de carbono de conformidad con los actos delegados y de ejecución. @es
comment: Aku pass peab sisaldama süsinikujalajälje tulemuslikkuse klassi vastavalt delegeeritud ja rakendusaktidele. @et
comment: Akkupassiin on sisällyttävä hiilijalanjäljen suorituskykyluokka delegoitujen säädösten ja täytäntöönpanosäädösten mukaisesti. @fi
comment: Le passeport de la batterie doit inclure la classe de performance de l'empreinte carbone conformément aux actes délégués et d'exécution. @fr
comment: Ní mór an aicme feidhmíochta lorg carbóin a bheith ar phas na ceallraí i gcomhréir leis na gníomhartha tarmligthe agus cur chun feidhme. @ga
comment: Putovnica baterije mora sadržavati klasu učinkovitosti ugljičnog otiska u skladu s delegiranim i provedbenim aktima. @hr
comment: Az akkumulátor-útlevélnek tartalmaznia kell a szénlábnyom-teljesítményosztályt a felhatalmazáson alapuló és a végrehajtási jogi aktusokkal összhangban. @hu
comment: Il passaporto della batteria deve includere la classe di prestazione dell'impronta di carbonio conformemente agli atti delegati e di esecuzione. @it
comment: Baterijos pase turi būti nurodyta anglies pėdsako efektyvumo klasė pagal deleguotuosius ir įgyvendinimo aktus. @lt
comment: Baterijas pasē jāiekļauj oglekļa pēdas veiktspējas klase saskaņā ar deleģētajiem un īstenošanas aktiem. @lv
comment: Il-passaport tal-batterija għandu jinkludi l-klassi tal-prestazzjoni tal-marka tal-karbonju skont l-atti delegati u ta' implimentazzjoni. @mt
comment: Het batterijpaspoort moet de prestatieklasse van de koolstofvoetafdruk bevatten in overeenstemming met de gedelegeerde en uitvoeringshandelingen. @nl
comment: Paszport baterii musi zawierać klasę efektywności śladu węglowego zgodnie z aktami delegowanymi i wykonawczymi. @pl
comment: O passaporte da bateria deve incluir a classe de desempenho da pegada de carbono, em conformidade com os atos delegados e de execução. @pt
comment: Pașaportul bateriei trebuie să includă clasa de performanță a amprentei de carbon în conformitate cu actele delegate și de punere în aplicare. @ro
comment: Cestovný pas batérie musí obsahovať triedu environmentálnej výkonnosti uhlíkovej stopy v súlade s delegovanými a vykonávacími aktmi. @sk
comment: Potni list za baterijo mora vsebovati razred učinkovitosti ogljičnega odtisa v skladu z delegiranimi in izvedbenimi akti. @sl
comment: Batteripasset ska innehålla prestandaklassen för koldioxidavtryck i enlighet med de delegerade akterna och genomförandeakterna. @sv
domain: Battery Product
range: xsd:string
related match: PropertyValue
related match: AdditionalProductClassificationDetails

Web link to public carbon footprint study
type: ObjectProperty
governed by: DIN DKE SPEC 99100
source: Source: ESPR - Annex XIII (1)
label: Уеб връзка към публично проучване на въглеродния отпечатък @bg
label: Odkaz na veřejnou studii o uhlíkové stopě @cs
label: Weblink til offentlig undersøgelse af CO2-fodaftryk @da
label: Weblink zur öffentlichen Studie über den CO2-Fußabdruck @de
label: Σύνδεσμος ιστού προς δημόσια μελέτη αποτυπώματος άνθρακα @el
label: Enlace web al estudio público sobre la huella de carbono @es
label: Veebilink avalikule süsinikujalajälje uuringule @et
label: Verkkolinkki julkiseen hiilijalanjälkitutkimukseen @fi
label: Lien web vers l'étude publique sur l'empreinte carbone @fr
label: Nasc gréasáin chuig staidéar poiblí ar lorg carbóin @ga
label: Web-poveznica na javnu studiju o ugljičnom otisku @hr
label: Internetes link a nyilvános szénlábnyom-tanulmányhoz @hu
label: Link web allo studio pubblico sull'impronta di carbonio @it
label: Svetainės nuoroda į viešą anglies pėdsako tyrimą @lt
label: Tīmekļa saite uz publisku oglekļa pēdas pētījumu @lv
label: Web link għall-istudju pubbliku dwar il-marka tal-karbonju @mt
label: Weblink naar openbare koolstofvoetafdrukstudie @nl
label: Link do publicznego badania śladu węglowego @pl
label: Link para o estudo público sobre a pegada de carbono @pt
label: Link web către studiul public privind amprenta de carbon @ro
label: Webový odkaz na verejnú štúdiu o uhlíkovej stope @sk
label: Spletna povezava do javne študije o ogljičnem odtisu @sl
label: Webblänk till offentlig studie om koldioxidavtryck @sv
comment: The battery passport must include a web link to the carbon footprint study accompanying the battery carbon footprint declaration.
comment: Паспортът на батерията трябва да включва уеб връзка към проучването за въглеродния отпечатък, придружаващо декларацията за въглеродния отпечатък на батерията. @bg
comment: Pasy baterie musí obsahovat webový odkaz na studii o uhlíkové stopě, která je přílohou prohlášení o uhlíkové stopě baterie. @cs
comment: Batteripasset skal indeholde et weblink til den CO2-fodaftryksundersøgelse, der ledsager erklæringen om batteriets CO2-fodaftryk. @da
comment: Der Batteriepass muss einen Weblink zu der Studie über den CO2-Fußabdruck enthalten, die der Erklärung zum CO2-Fußabdruck der Batterie beigefügt ist. @de
comment: Το διαβατήριο της μπαταρίας πρέπει να περιλαμβάνει έναν σύνδεσμο ιστού προς τη μελέτη αποτυπώματος άνθρακα που συνοδεύει τη δήλωση αποτυπώματος άνθρακα της μπαταρίας. @el
comment: El pasaporte de la batería debe incluir un enlace web al estudio sobre la huella de carbono que acompaña a la declaración sobre la huella de carbono de la batería. @es
comment: Aku pass peab sisaldama veebilinki süsinikujalajälje uuringule, mis on lisatud aku süsinikujalajälje deklaratsioonile. @et
comment: Akkupassiin on sisällyttävä verkkolinkki hiilijalanjälkitutkimukseen, joka liittyy akun hiilijalanjälki-ilmoitukseen. @fi
comment: Le passeport de la batterie doit inclure un lien web vers l'étude sur l'empreinte carbone accompagnant la déclaration sur l'empreinte carbone de la batterie. @fr
comment: Ní mór nasc gréasáin a bheith i bpas na ceallraí chuig an staidéar ar lorg carbóin a ghabhann le dearbhú lorg carbóin na ceallraí. @ga
comment: Putovnica baterije mora sadržavati internetsku poveznicu na studiju o ugljičnom otisku koja prati izjavu o ugljičnom otisku baterije. @hr
comment: Az akkumulátor-útlevélnek tartalmaznia kell egy webes hivatkozást az akkumulátor szénlábnyom-nyilatkozatához mellékelt szénlábnyom-tanulmányra. @hu
comment: Il passaporto della batteria deve includere un link web allo studio sull'impronta di carbonio che accompagna la dichiarazione sull'impronta di carbonio della batteria. @it
comment: Baterijos pase turi būti pateikta svetainės nuoroda į anglies pėdsako tyrimą, pridedamą prie baterijos anglies pėdsako deklaracijos. @lt
comment: Baterijas pasei jāpievieno tīmekļa saite uz oglekļa pēdas pētījumu, kas pievienots baterijas oglekļa pēdas deklarācijai. @lv
comment: Il-passaport tal-batterija għandu jinkludi link tal-web għall-istudju dwar il-marka tal-karbonju li jakkumpanja d-dikjarazzjoni dwar il-marka tal-karbonju tal-batterija. @mt
comment: Het batterijpaspoort moet een weblink bevatten naar de koolstofvoetafdrukstudie die bij de koolstofvoetafdrukverklaring van de batterij is gevoegd. @nl
comment: Paszport baterii musi zawierać link do badania śladu węglowego dołączonego do deklaracji śladu węglowego baterii. @pl
comment: O passaporte da bateria deve incluir um link para o estudo da pegada de carbono que acompanha a declaração da pegada de carbono da bateria. @pt
comment: Pașaportul bateriei trebuie să includă un link web către studiul privind amprenta de carbon care însoțește declarația privind amprenta de carbon a bateriei. @ro
comment: Cestovný pas batérie musí obsahovať webový odkaz na štúdiu o uhlíkovej stope, ktorá je priložená k vyhláseniu o uhlíkovej stope batérie. @sk
comment: Potni list za baterijo mora vsebovati spletno povezavo do študije o ogljičnem odtisu, ki je priložena izjavi o ogljičnem odtisu baterije. @sl
comment: Batteripasset ska innehålla en webblänk till den koldioxidavtrycksstudie som medföljer deklarationen om batteriets koldioxidavtryck. @sv
domain: Battery Product
range: RelatedResource
related match: CreativeWork
related match: Document

General battery and manufacturer information
type: ObjectProperty
governed by: DIN DKE SPEC 99100
source: Source: ESPR - Annex XIII (1)
label: Обща информация за батерията и производителя @bg
label: Obecné informace o baterii a výrobci @cs
label: Generelle oplysninger om batteri og producent @da
label: Allgemeine Batterie- und Herstellerinformationen @de
label: Γενικές πληροφορίες για την μπαταρία και τον κατασκευαστή @el
label: Información general sobre la batería y el fabricante @es
label: Üldine teave aku ja tootja kohta @et
label: Yleiset akku- ja valmistajatiedot @fi
label: Informations générales sur la batterie et le fabricant @fr
label: Faisnéis ghinearálta faoin gceallraí agus faoin monaróir @ga
label: Opće informacije o bateriji i proizvođaču @hr
label: Általános akkumulátor- és gyártói információk @hu
label: Informazioni generali sulla batteria e sul produttore @it
label: Bendra informacija apie akumuliatorių ir gamintoją @lt
label: Vispārīga informācija par akumulatoru un ražotāju @lv
label: Informazzjoni ġenerali dwar il-batterija u l-manifattur @mt
label: Algemene informatie over de batterij en de fabrikant @nl
label: Ogólne informacje o baterii i producencie @pl
label: Informações gerais sobre a bateria e o fabricante @pt
label: Informații generale despre baterie și producător @ro
label: Všeobecné informácie o batérii a výrobcovi @sk
label: Splošne informacije o bateriji in proizvajalcu @sl
label: Allmän information om batteri och tillverkare @sv
comment: The battery passport must contain general battery and manufacturer information in relation to the battery carbon footprint.
comment: Паспортът на батерията трябва да съдържа обща информация за батерията и производителя във връзка с въглеродния отпечатък на батерията. @bg
comment: Pasy baterie musí obsahovat obecné informace o baterii a výrobci ve vztahu k uhlíkové stopě baterie. @cs
comment: Batteripasset skal indeholde generelle oplysninger om batteri og producent i forhold til batteriets CO2-fodaftryk. @da
comment: Der Batteriepass muss allgemeine Batterie- und Herstellerinformationen in Bezug auf den CO2-Fußabdruck der Batterie enthalten. @de
comment: Το διαβατήριο της μπαταρίας πρέπει να περιέχει γενικές πληροφορίες για την μπαταρία και τον κατασκευαστή σε σχέση με το αποτύπωμα άνθρακα της μπαταρίας. @el
comment: El pasaporte de la batería debe contener información general sobre la batería y el fabricante en relación con la huella de carbono de la batería. @es
comment: Aku pass peab sisaldama üldist teavet aku ja tootja kohta seoses aku süsinikujalajäljega. @et
comment: Akkupassin on sisällettävä yleisiä akku- ja valmistajatietoja akun hiilijalanjäljestä. @fi
comment: Le passeport de la batterie doit contenir des informations générales sur la batterie et le fabricant en ce qui concerne l'empreinte carbone de la batterie. @fr
comment: Ní mór faisnéis ghinearálta faoin gceallraí agus faoin monaróir a bheith ar phas na ceallraí i ndáil le lorg carbóin na ceallraí. @ga
comment: Putovnica baterije mora sadržavati opće informacije o bateriji i proizvođaču u vezi s ugljičnim otiskom baterije. @hr
comment: Az akkumulátor-útlevélnek általános akkumulátor- és gyártói információkat kell tartalmaznia az akkumulátor szénlábnyomával kapcsolatban. @hu
comment: Il passaporto della batteria deve contenere informazioni generali sulla batteria e sul produttore in relazione all'impronta di carbonio della batteria. @it
comment: Baterijos pase turi būti pateikta bendra informacija apie bateriją ir gamintoją, susijusi su baterijos anglies pėdsaku. @lt
comment: Baterijas pasē jābūt vispārīgai informācijai par bateriju un ražotāju saistībā ar baterijas oglekļa pēdu. @lv
comment: Il-passaport tal-batterija għandu jkun fih informazzjoni ġenerali dwar il-batterija u l-manifattur fir-rigward tal-marka tal-karbonju tal-batterija. @mt
comment: Het batterijpaspoort moet algemene informatie over de batterij en de fabrikant bevatten met betrekking tot de koolstofvoetafdruk van de batterij. @nl
comment: Paszport baterii musi zawierać ogólne informacje o baterii i producencie w odniesieniu do śladu węglowego baterii. @pl
comment: O passaporte da bateria deve conter informações gerais sobre a bateria e o fabricante em relação à pegada de carbono da bateria. @pt
comment: Pașaportul bateriei trebuie să conțină informații generale despre baterie și producător în legătură cu amprenta de carbon a bateriei. @ro
comment: Všeobecné informácie o batérii a výrobcovi musia byť uvedené v pase batérie v súvislosti s uhlíkovou stopou batérie. @sk
comment: Splošne informacije o bateriji in proizvajalcu morajo biti vključene v potni list baterije v zvezi z ogljičnim odtisom baterije. @sl
comment: Batteripasset måste innehålla allmän information om batteri och tillverkare i förhållande till batteriets koldioxidavtryck. @sv
domain: Battery Product
range: RelatedResource
related match: PropertyValue
related match: AdditionalProductClassificationDetails

Absolute battery carbon footprint
type: DatatypeProperty
unit: KilogramCO2Equivalent
source: https://www.dinmedia.de/en/technical-rule/din-dke-spec-99100/385692321
label: Абсолютен въглероден отпечатък на батерията @bg
label: Absolutní uhlíková stopa baterie @cs
label: Absolut CO2-fodaftryk for batteri @da
label: Absoluter CO2-Fußabdruck der Batterie @de
label: Απόλυτο αποτύπωμα άνθρακα της μπαταρίας @el
label: Huella de carbono absoluta de la batería @es
label: Aku absoluutne süsinikujalajälg @et
label: Akun absoluuttinen hiilijalanjälki @fi
label: Empreinte carbone absolue de la batterie @fr
label: Lorg carbóin iomlán na ceallraí @ga
label: Apsolutni ugljični otisak baterije @hr
label: Az akkumulátor abszolút szén-dioxid-lábnyoma @hu
label: Impronta di carbonio assoluta della batteria @it
label: Absoliutus akumuliatoriaus anglies pėdsakas @lt
label: Absolūtais akumulatora oglekļa pēdas nospiedums @lv
label: Impronta assoluta tal-karbonju tal-batterija @mt
label: Absolute koolstofvoetafdruk van de batterij @nl
label: Bezwzględny ślad węglowy baterii @pl
label: Pegada de carbono absoluta da bateria @pt
label: Amprenta de carbon absolută a bateriei @ro
label: Absolútna uhlíková stopa batérie @sk
label: Absolutni ogljični odtis baterije @sl
label: Absolut koldioxidavtryck för batteri @sv
comment: The battery passport should include the battery carbon footprint in absolute terms (kg CO2e).
comment: Паспортът на батерията трябва да включва въглеродния отпечатък на батерията в абсолютни стойности (kg CO2e). @bg
comment: Pasy baterie by měly obsahovat uhlíkovou stopu baterie v absolutních hodnotách (kg CO2e). @cs
comment: Batteripasset skal indeholde batteriets CO2-fodaftryk i absolutte tal (kg CO2e). @da
comment: Der Batteriepass sollte den CO2-Fußabdruck der Batterie in absoluten Zahlen (kg CO2e) enthalten. @de
comment: Το διαβατήριο της μπαταρίας θα πρέπει να περιλαμβάνει το αποτύπωμα άνθρακα της μπαταρίας σε απόλυτους όρους (kg CO2e). @el
comment: El pasaporte de la batería debe incluir la huella de carbono de la batería en términos absolutos (kg CO2e). @es
comment: Aku pass peaks sisaldama aku süsinikujalajälge absoluutarvudes (kg CO2e). @et
comment: Akkupassin tulisi sisältää akun hiilijalanjälki absoluuttisina lukuina (kg CO2e). @fi
comment: Le passeport de la batterie doit inclure l'empreinte carbone de la batterie en termes absolus (kg CO2e). @fr
comment: Ba cheart go n-áireofaí i bpas na ceallraí lorg carbóin na ceallraí i dtéarmaí absalóideacha (kg CO2e). @ga
comment: Putovnica baterije trebala bi sadržavati ugljični otisak baterije u apsolutnim vrijednostima (kg CO2e). @hr
comment: Az akkumulátor-útlevélnek tartalmaznia kell az akkumulátor szén-dioxid-lábnyomát abszolút értékben (kg CO2e). @hu
comment: Il passaporto della batteria dovrebbe includere l'impronta di carbonio della batteria in termini assoluti (kg CO2e). @it
comment: Baterijos pase turėtų būti nurodytas absoliutus baterijos anglies pėdsakas (kg CO2e). @lt
comment: Baterijas pasē jāiekļauj baterijas oglekļa pēdas nospiedums absolūtos skaitļos (kg CO2e). @lv
comment: Il-passaport tal-batterija għandu jinkludi l-marka tal-karbonju tal-batterija f'termini assoluti (kg CO2e). @mt
comment: Het batterijpaspoort moet de koolstofvoetafdruk van de batterij in absolute termen (kg CO2e) bevatten. @nl
comment: Paszport baterii powinien zawierać ślad węglowy baterii w wartościach bezwzględnych (kg CO2e). @pl
comment: O passaporte da bateria deve incluir a pegada de carbono da bateria em termos absolutos (kg CO2e). @pt
comment: Pașaportul bateriei ar trebui să includă amprenta de carbon a bateriei în termeni absoluți (kg CO2e). @ro
comment: Pas batérie by mal obsahovať uhlíkovú stopu batérie v absolútnom vyjadrení (kg CO2e). @sk
comment: Potni list za baterijo mora vsebovati absolutni ogljični odtis baterije (v kg CO2e). @sl
comment: Batteripasset bör innehålla batteriets koldioxidavtryck i absoluta tal (kg CO2e). @sv
domain: Battery Product
range: xsd:double
related match: PropertyValue
related match: AdditionalProductClassificationDetails

Information of due diligence report
type: ObjectProperty
governed by: DIN DKE SPEC 99100
source: Source: ESPR - Annex XIII (1)
label: Информация от доклада за надлежна проверка @bg
label: Informace ze zprávy o náležité péči @cs
label: Oplysninger i due diligence-rapporten @da
label: Informationen aus dem Due-Diligence-Bericht @de
label: Πληροφορίες από την έκθεση δέουσας επιμέλειας @el
label: Información del informe de diligencia debida @es
label: Hoolsuskohustuse aruande teave @et
label: Asianmukaisen huolellisuuden raportin tiedot @fi
label: Informations du rapport de diligence raisonnable @fr
label: Faisnéis ó thuarascáil díchill chuí @ga
label: Informacije iz izvješća o dubinskoj analizi @hr
label: Az átvilágítási jelentésben szereplő információk @hu
label: Informazioni della relazione sulla dovuta diligenza @it
label: Informacija iš deramo patikrinimo ataskaitos @lt
label: Informācija no uzticamības pārbaudes ziņojuma @lv
label: Informazzjoni tar-rapport tad-diliġenza dovuta @mt
label: Informatie uit het due-diligencerapport @nl
label: Informacje ze sprawozdania z należytą starannością @pl
label: Informações do relatório de devida diligência @pt
label: Informații din raportul de diligență @ro
label: Informácie zo správy o náležitej starostlivosti @sk
label: Informacije iz poročila o skrbnem pregledu @sl
label: Information från rapporten om należyta aktsamhet @sv
comment: The battery passport must include information on responsible sourcing as indicated in the report on its due diligence policy.
comment: Паспортът на батерията трябва да включва информация за отговорно снабдяване, както е посочено в доклада за нейната политика за надлежна проверка. @bg
comment: Pasy baterie musí obsahovat informace o odpovědném získávání zdrojů, jak je uvedeno ve zprávě o politice náležité péče. @cs
comment: Batteripasset skal indeholde oplysninger om ansvarlig sourcing som angivet i rapporten om dets due diligence-politik. @da
comment: Der Batteriepass muss Informationen über die verantwortungsvolle Beschaffung enthalten, wie im Bericht über seine Due-Diligence-Politik angegeben. @de
comment: Το διαβατήριο της μπαταρίας πρέπει να περιλαμβάνει πληροφορίες σχετικά με την υπεύθυνη προμήθεια, όπως αναφέρεται στην έκθεση σχετικά με την πολιτική δέουσας επιμέλειας. @el
comment: El pasaporte de la batería debe incluir información sobre el abastecimiento responsable, tal como se indica en el informe sobre su política de diligencia debida. @es
comment: Aku pass peab sisaldama teavet vastutustundliku hankimise kohta, nagu on märgitud selle hoolsuskohustuse poliitika aruandes. @et
comment: Akkupassin on sisällettävä tiedot vastuullisesta hankinnasta, kuten sen due diligence -politiikkaa koskevassa raportissa on ilmoitettu. @fi
comment: Le passeport de la batterie doit inclure des informations sur l'approvisionnement responsable, comme indiqué dans le rapport sur sa politique de diligence raisonnable. @fr
comment: Ní mór faisnéis faoi fhoinsiú freagrach a bheith ar phas na ceallraí mar a léirítear sa tuarascáil ar a bheartas díchill chuí. @ga
comment: Putovnica baterije mora sadržavati informacije o odgovornom nabavi kako je navedeno u izvješću o politici dubinske analize. @hr
comment: Az akkumulátor-útlevélnek tartalmaznia kell a felelős beszerzésre vonatkozó információkat, amint az az átvilágítási politikájáról szóló jelentésben szerepel. @hu
comment: Il passaporto della batteria deve includere informazioni sull'approvvigionamento responsabile, come indicato nella relazione sulla sua politica di dovuta diligenza. @it
comment: Baterijos pase turi būti pateikta informacija apie atsakingą tiekimą, kaip nurodyta jos deramo patikrinimo politikos ataskaitoje. @lt
comment: Baterijas pasei ir jāiekļauj informācija par atbildīgu ieguvi, kā norādīts ziņojumā par tās uzticamības pārbaudes politiku. @lv
comment: Il-passaport tal-batterija għandu jinkludi informazzjoni dwar is-sorsi responsabbli kif indikat fir-rapport dwar il-politika ta' diliġenza dovuta tiegħu. @mt
comment: Het batterijpaspoort moet informatie bevatten over verantwoorde inkoop, zoals aangegeven in het rapport over zijn due-diligencebeleid. @nl
comment: Paszport baterii musi zawierać informacje na temat odpowiedzialnego pozyskiwania surowców, jak wskazano w sprawozdaniu na temat jego polityki należytej staranności. @pl
comment: O passaporte da bateria deve incluir informações sobre o fornecimento responsável, conforme indicado no relatório sobre a sua política de devida diligência. @pt
comment: Pașaportul bateriei trebuie să includă informații privind aprovizionarea responsabilă, astfel cum se indică în raportul privind politica sa de diligență. @ro
comment: Pas batérie musí obsahovať informácie o zodpovednom získavaní zdrojov, ako sa uvádza v správe o jeho politike náležitej starostlivosti. @sk
comment: Potni list za baterijo mora vsebovati informacije o odgovornem pridobivanju virov, kot je navedeno v poročilu o politiki potrebne skrbnosti. @sl
comment: Batteripasset ska innehålla information om ansvarsfulla inköp enligt rapporten om dess policy för należyta aktsamhet. @sv
domain: Battery Product
range: RelatedResource

Third party assurances of recognised schemes
type: ObjectProperty
governed by: DIN DKE SPEC 99100
source: Source: ESPR - Annex XIII (1)
label: Гаранции от трети страни по признати схеми @bg
label: Záruky třetích stran uznávaných systémů @cs
label: Tredjepartssikringer af anerkendte ordninger @da
label: Zusicherungen Dritter anerkannter Systeme @de
label: Διασφαλίσεις τρίτων μερών αναγνωρισμένων συστημάτων @el
label: Garantías de terceros de regímenes reconocidos @es
label: Tunnustatud skeemide kolmandate osapoolte tagatised @et
label: Tunnustettujen järjestelmien kolmannen osapuolen vakuutukset @fi
label: Garanties de tiers de systèmes reconnus @fr
label: Dearbhuithe tríú páirtí ar scéimeanna aitheanta @ga
label: Jamstva trećih strana priznatih programa @hr
label: Elismert rendszerek harmadik fél általi garanciái @hu
label: Garanzie di terzi di regimi riconosciuti @it
label: Pripažintų sistemų trečiųjų šalių garantijos @lt
label: Atzītu shēmu trešo pušu garantijas @lv
label: Assigurazzjonijiet ta' partijiet terzi ta' skemi rikonoxxuti @mt
label: Zekerheden van derden van erkende regelingen @nl
label: Zapewnienia stron trzecich w ramach uznanych systemów @pl
label: Garantias de terceiros de regimes reconhecidos @pt
label: Asigurări din partea terților ale schemelor recunoscute @ro
label: Záruky tretích strán uznaných schém @sk
label: Zagotovila tretjih oseb priznanih shem @sl
label: Tredjepartsförsäkringar för erkända system @sv
comment: The battery passport should contain information on third-party supply chain assurances such as certifications.
comment: Паспортът на батерията трябва да съдържа информация за гаранциите на веригата за доставки от трети страни, като например сертификати. @bg
comment: Pasy baterie by měly obsahovat informace o zárukách dodavatelského řetězce třetích stran, jako jsou certifikace. @cs
comment: Batteripasset skal indeholde oplysninger om tredjepartsforsyningskædesikringer såsom certificeringer. @da
comment: Der Batteriepass sollte Informationen über die Lieferkettensicherheiten Dritter wie z. B. Zertifizierungen enthalten. @de
comment: Το διαβατήριο της μπαταρίας θα πρέπει να περιέχει πληροφορίες σχετικά με τις διαβεβαιώσεις της εφοδιαστικής αλυσίδας τρίτων, όπως πιστοποιήσεις. @el
comment: El pasaporte de la batería debe contener información sobre las garantías de la cadena de suministro de terceros, como las certificaciones. @es
comment: Aku pass peaks sisaldama teavet kolmandate osapoolte tarneahela tagatiste, näiteks sertifikaatide kohta. @et
comment: Akkupassin tulisi sisältää tietoja kolmansien osapuolten toimitusketjun vakuuksista, kuten sertifioinneista. @fi
comment: Le passeport de la batterie doit contenir des informations sur les garanties de la chaîne d'approvisionnement de tiers, telles que les certifications. @fr
comment: Ba cheart go mbeadh faisnéis i bpas na ceallraí maidir le dearbhuithe slabhra an tsoláthair ó thríú páirtithe amhail deimhnithe. @ga
comment: Putovnica baterije trebala bi sadržavati informacije o jamstvima lanca opskrbe trećih strana, kao što su certifikati. @hr
comment: Az akkumulátor-útlevélnek tartalmaznia kell a harmadik fél által a beszállítói láncra vonatkozóan adott biztosítékokra, például a tanúsítványokra vonatkozó információkat. @hu
comment: Il passaporto della batteria dovrebbe contenere informazioni sulle garanzie della catena di fornitura di terzi, come le certificazioni. @it
comment: Baterijos pase turėtų būti pateikta informacija apie trečiųjų šalių tiekimo grandinės garantijas, pvz., sertifikatus. @lt
comment: Baterijas pasei jāsatur informācija par trešo pušu piegādes ķēdes garantijām, piemēram, sertifikātiem. @lv
comment: Il-passaport tal-batterija għandu jkun fih informazzjoni dwar l-assigurazzjonijiet tal-katina tal-provvista ta' partijiet terzi bħal ċertifikazzjonijiet. @mt
comment: Het batterijpaspoort moet informatie bevatten over de zekerheden van de toeleveringsketen van derden, zoals certificeringen. @nl
comment: Paszport baterii powinien zawierać informacje na temat zapewnień dotyczących łańcucha dostaw stron trzecich, takich jak certyfikaty. @pl
comment: O passaporte da bateria deve conter informações sobre as garantias da cadeia de abastecimento de terceiros, tais como certificações. @pt
comment: Pașaportul bateriei ar trebui să conțină informații privind asigurările lanțului de aprovizionare de la terți, cum ar fi certificările. @ro
comment: Pas batérie by mal obsahovať informácie o zárukách dodávateľského reťazca tretích strán, ako sú certifikácie. @sk
comment: Potni list za baterijo mora vsebovati informacije o zagotovilih dobavne verige tretjih oseb, kot so certifikati. @sl
comment: Batteripasset bör innehålla information om tredjepartsförsäkringar för leveranskedjan, t.ex. certifieringar. @sv
domain: Battery Product
range: RelatedResource
related match: certification
related match: CertificationDetails

Supply chain indices
type: ObjectProperty
source: https://www.dinmedia.de/en/technical-rule/din-dke-spec-99100/385692321
label: Индекси на веригата за доставки @bg
label: Indexy dodavatelského řetězce @cs
label: Indeks for forsyningskæden @da
label: Lieferkettenindizes @de
label: Δείκτες της αλυσίδας εφοδιασμού @el
label: Índices de la cadena de suministro @es
label: Tarneahela indeksid @et
label: Toimitusketjun indeksit @fi
label: Indices de la chaîne d'approvisionnement @fr
label: Innéacsanna an tslabhra soláthair @ga
label: Indeksi lanca opskrbe @hr
label: Ellátási lánc indexek @hu
label: Indici della catena di fornitura @it
label: Tiekimo grandinės indeksai @lt
label: Piegādes ķēdes indeksi @lv
label: Indiċi tal-katina tal-provvista @mt
label: Toeleveringsketenindexen @nl
label: Indeksy łańcucha dostaw @pl
label: Índices da cadeia de abastecimento @pt
label: Indicii lanțului de aprovizionare @ro
label: Indexy dodávateľského reťazca @sk
label: Indeksi dobavne verige @sl
label: Index för försörjningskedjan @sv
comment: The battery passport should contain supply chain indices to allow easy assessment for consumers on level of responsible sourcing.
comment: Паспортът на батерията трябва да съдържа индекси на веригата за доставки, за да се даде възможност на потребителите за лесна оценка на нивото на отговорно снабдяване. @bg
comment: Pasy baterie by měly obsahovat indexy dodavatelského řetězce, které spotřebitelům umožní snadné posouzení úrovně odpovědného získávání zdrojů. @cs
comment: Batteripasset skal indeholde forsyningskædeindekser for at give forbrugerne en nem vurdering af niveauet af ansvarlig sourcing. @da
comment: Der Batteriepass sollte Lieferkettenindizes enthalten, um den Verbrauchern eine einfache Bewertung des Niveaus der verantwortungsvollen Beschaffung zu ermöglichen. @de
comment: Το διαβατήριο της μπαταρίας θα πρέπει να περιέχει δείκτες της αλυσίδας εφοδιασμού που θα επιτρέπουν την εύκολη αξιολόγηση από τους καταναλωτές του επιπέδου υπεύθυνης προμήθειας. @el
comment: El pasaporte de la batería debe contener índices de la cadena de suministro que permitan a los consumidores evaluar fácilmente el nivel de abastecimiento responsable. @es
comment: Aku pass peaks sisaldama tarneahela indekseid, mis võimaldavad tarbijatel hõlpsasti hinnata vastutustundliku hankimise taset. @et
comment: Akkupassin tulisi sisältää toimitusketjun indeksit, jotta kuluttajat voivat helposti arvioida vastuullisen hankinnan tasoa. @fi
comment: Le passeport de la batterie doit contenir des indices de la chaîne d'approvisionnement afin de permettre aux consommateurs d'évaluer facilement le niveau d'approvisionnement responsable. @fr
comment: Ba cheart go mbeadh innéacsanna an tslabhra soláthair ar phas na ceallraí chun go bhféadfadh tomhaltóirí measúnú éasca a dhéanamh ar leibhéal an fhoinsithe fhreagraigh. @ga
comment: Putovnica baterije trebala bi sadržavati indekse lanca opskrbe kako bi se potrošačima omogućila laka procjena razine odgovornog nabave. @hr
comment: Az akkumulátor-útlevélnek tartalmaznia kell az ellátási lánc indexeit, hogy a fogyasztók könnyen értékelhessék a felelős beszerzés szintjét. @hu
comment: Il passaporto della batteria dovrebbe contenere indici della catena di fornitura per consentire ai consumatori di valutare facilmente il livello di approvvigionamento responsabile. @it
comment: Baterijos pase turėtų būti pateikti tiekimo grandinės indeksai, kad vartotojai galėtų lengvai įvertinti atsakingo tiekimo lygį. @lt
comment: Baterijas pasei jāsatur piegādes ķēdes indeksi, lai patērētāji varētu viegli novērtēt atbildīgas ieguves līmeni. @lv
comment: Il-passaport tal-batterija għandu jkun fih indiċi tal-katina tal-provvista biex jippermetti valutazzjoni faċli għall-konsumaturi dwar il-livell ta' provenjenza responsabbli. @mt
comment: Het batterijpaspoort moet indexen van de toeleveringsketen bevatten, zodat consumenten gemakkelijk het niveau van verantwoorde inkoop kunnen beoordelen. @nl
comment: Paszport baterii powinien zawierać wskaźniki łańcucha dostaw, aby umożliwić konsumentom łatwą ocenę poziomu odpowiedzialnego pozyskiwania surowców. @pl
comment: O passaporte da bateria deve conter índices da cadeia de abastecimento para permitir uma avaliação fácil para os consumidores sobre o nível de fornecimento responsável. @pt
comment: Pașaportul bateriei ar trebui să conțină indici ai lanțului de aprovizionare pentru a permite consumatorilor o evaluare ușoară a nivelului de aprovizionare responsabilă. @ro
comment: Pas batérie by mal obsahovať indexy dodávateľského reťazca, ktoré spotrebiteľom umožnia ľahké posúdenie úrovne zodpovedného získavania zdrojov. @sk
comment: Potni list za baterijo mora vsebovati indekse dobavne verige, ki potrošnikom omogočajo enostavno oceno ravni odgovornega pridobivanja. @sl
comment: Batteripasset bör innehålla index för försörjningskedjan så att konsumenterna enkelt kan bedöma nivån på ansvarsfulla inköp. @sv
domain: Battery Product
range: RelatedResource

Battery chemistry
type: DatatypeProperty
governed by: DIN DKE SPEC 99100
source: Source: ESPR - Annex XIII (1)
label: Химичен състав на батерията @bg
label: Chemické složení baterie @cs
label: Batterikemi @da
label: Batteriechemie @de
label: Χημεία μπαταρίας @el
label: Química de la batería @es
label: Aku keemia @et
label: Akun kemia @fi
label: Chimie de la batterie @fr
label: Ceimic na ceallraí @ga
label: Kemija baterije @hr
label: Akkumulátor kémia @hu
label: Chimica della batteria @it
label: Baterijos chemija @lt
label: Baterijas ķīmija @lv
label: Kimika tal-batterija @mt
label: Batterijchemie @nl
label: Skład chemiczny baterii @pl
label: Química da bateria @pt
label: Chimia bateriei @ro
label: Chémia batérie @sk
comment: The battery passport must contain information on the battery chemistry (cathode, anode, electrolyte).
comment: Паспортът на батерията трябва да съдържа информация за химичния състав на батерията (катод, анод, електролит). @bg
comment: Pasy baterie musí obsahovat informace o chemickém složení baterie (katoda, anoda, elektrolyt). @cs
comment: Batteripasset skal indeholde oplysninger om batteriets kemi (katode, anode, elektrolyt). @da
comment: Der Batteriepass muss Informationen über die Batteriechemie (Kathode, Anode, Elektrolyt) enthalten. @de
comment: Το διαβατήριο της μπαταρίας πρέπει να περιέχει πληροφορίες σχετικά με τη χημεία της μπαταρίας (κάθοδος, άνοδος, ηλεκτρολύτης). @el
comment: El pasaporte de la batería debe contener información sobre la química de la batería (cátodo, ánodo, electrolito). @es
comment: Aku pass peab sisaldama teavet aku keemia kohta (katood, anood, elektrolüüt). @et
comment: Akkupassin on sisällettävä tietoja akun kemiasta (katodi, anodi, elektrolyytti). @fi
comment: Le passeport de la batterie doit contenir des informations sur la chimie de la batterie (cathode, anode, électrolyte). @fr
comment: Ní mór faisnéis a bheith i bpas na ceallraí maidir le ceimic na ceallraí (catóide, anóid, leictrilít). @ga
comment: Putovnica baterije mora sadržavati informacije o kemiji baterije (katoda, anoda, elektrolit). @hr
comment: Az akkumulátor-útlevélnek tartalmaznia kell az akkumulátor kémiájára vonatkozó információkat (katód, anód, elektrolit). @hu
comment: Il passaporto della batteria deve contenere informazioni sulla chimica della batteria (catodo, anodo, elettrolita). @it
comment: Baterijos pase turi būti pateikta informacija apie baterijos chemiją (katodą, anodą, elektrolitą). @lt
comment: Baterijas pasē jābūt informācijai par baterijas ķīmiju (katodu, anodu, elektrolītu). @lv
comment: Il-passaport tal-batterija għandu jkun fih informazzjoni dwar il-kimika tal-batterija (katodu, anodu, elettrolit). @mt
comment: Het batterijpaspoort moet informatie bevatten over de batterijchemie (kathode, anode, elektrolyt). @nl
comment: Paszport baterii musi zawierać informacje na temat składu chemicznego baterii (katoda, anoda, elektrolit). @pl
comment: O passaporte da bateria deve conter informações sobre a química da bateria (cátodo, ânodo, eletrólito). @pt
comment: Pașaportul bateriei trebuie să conțină informații despre chimia bateriei (catod, anod, electrolit). @ro
comment: Pas batérie musí obsahovať informácie o chémii batérie (katóda, anóda, elektrolyt). @sk
comment: Potni list za baterijo mora vsebovati informacije o kemiji baterije (katoda, anoda, elektrolit). @sl
comment: Batteripasset måste innehålla information om batterikemin (katod, anod, elektrolyt). @sv
domain: Battery Product
range: xsd:string
related match: material

Critical raw materials
type: DatatypeProperty
governed by: DIN DKE SPEC 99100
source: Source: ESPR - Annex XIII (1)
label: Критични суровини @bg
label: Kritické suroviny @cs
label: Kritiske råstoffer @da
label: Kritische Rohstoffe @de
label: Κρίσιμες πρώτες ύλες @el
label: Materias primas críticas @es
label: Kriitilised toorained @et
label: Kriittiset raaka-aineet @fi
label: Matières premières critiques @fr
label: Amhábhair chriticiúla @ga
label: Kritične sirovine @hr
label: Kritikus fontosságú nyersanyagok @hu
label: Materie prime critiche @it
label: Kritinės žaliavos @lt
label: Kritiskās izejvielas @lv
label: Materja prima kritika @mt
label: Kritieke grondstoffen @nl
label: Surowce krytyczne @pl
label: Matérias-primas críticas @pt
label: Materii prime critice @ro
label: Kritične surovine @sl
label: Kritiska råvaror @sv
comment: The battery passport must contain information on the critical raw materials present in the battery in a concentration of more than 0.1%.
comment: Паспортът на батерията трябва да съдържа информация за критичните суровини, налични в батерията в концентрация над 0,1 %. @bg
comment: Pasy baterie musí obsahovat informace o kritických surovinách přítomných v baterii v koncentraci vyšší než 0,1 %. @cs
comment: Batteripasset skal indeholde oplysninger om de kritiske råstoffer, der findes i batteriet i en koncentration på mere end 0,1 %. @da
comment: Der Batteriepass muss Informationen über die in der Batterie enthaltenen kritischen Rohstoffe in einer Konzentration von mehr als 0,1 % enthalten. @de
comment: Το διαβατήριο της μπαταρίας πρέπει να περιέχει πληροφορίες σχετικά με τις κρίσιμες πρώτες ύλες που υπάρχουν στην μπαταρία σε συγκέντρωση άνω του 0,1%. @el
comment: El pasaporte de la batería debe contener información sobre las materias primas críticas presentes en la batería en una concentración superior al 0,1 %. @es
comment: Aku pass peab sisaldama teavet akus sisalduvate kriitiliste toorainete kohta, mille kontsentratsioon on üle 0,1 %. @et
comment: Akkupassin on sisällettävä tiedot akussa olevista kriittisistä raaka-aineista, joiden pitoisuus on yli 0,1 prosenttia. @fi
comment: Le passeport de la batterie doit contenir des informations sur les matières premières critiques présentes dans la batterie à une concentration supérieure à 0,1 %. @fr
comment: Ní mór faisnéis a bheith i bpas na ceallraí maidir leis na hamhábhair chriticiúla atá sa cheallraí i dtiúchan níos mó ná 0.1%. @ga
comment: Putovnica baterije mora sadržavati informacije o kritičnim sirovinama prisutnima u bateriji u koncentraciji većoj od 0,1 %. @hr
comment: Az akkumulátor-útlevélnek tartalmaznia kell az akkumulátorban 0,1%-nál nagyobb koncentrációban jelen lévő kritikus fontosságú nyersanyagokra vonatkozó információkat. @hu
comment: Il passaporto della batteria deve contenere informazioni sulle materie prime critiche presenti nella batteria in una concentrazione superiore allo 0,1 %. @it
comment: Baterijos pase turi būti pateikta informacija apie kritines žaliavas, esančias baterijoje, kurių koncentracija didesnė kaip 0,1 %. @lt
comment: Baterijas pasē jābūt informācijai par kritiskajām izejvielām, kas atrodas baterijā koncentrācijā, kas pārsniedz 0,1 %. @lv
comment: Il-passaport tal-batterija għandu jkun fih informazzjoni dwar il-materja prima kritika preżenti fil-batterija f'konċentrazzjoni ta' aktar minn 0.1%. @mt
comment: Het batterijpaspoort moet informatie bevatten over de kritieke grondstoffen die in de batterij aanwezig zijn in een concentratie van meer dan 0,1 %. @nl
comment: Paszport baterii musi zawierać informacje o surowcach krytycznych obecnych w baterii w stężeniu przekraczającym 0,1 %. @pl
comment: O passaporte da bateria deve conter informações sobre as matérias-primas críticas presentes na bateria numa concentração superior a 0,1 %. @pt
comment: Pașaportul bateriei trebuie să conțină informații privind materiile prime critice prezente în baterie într-o concentrație mai mare de 0,1 %. @ro
comment: V pase batérie musia byť uvedené informácie o kritických surovinách prítomných v batérii v koncentrácii vyššej ako 0,1 %. @sk
comment: Potni list za baterijo mora vsebovati informacije o kritičnih surovinah, ki so v bateriji prisotne v koncentraciji, večji od 0,1 %. @sl
comment: Batteripasset måste innehålla information om de kritiska råvaror som finns i batteriet i en koncentration på mer än 0,1 %. @sv
domain: Battery Product
range: xsd:string
related match: material

Materials used in cathode, anode and electrolyte
type: ObjectProperty
governed by: DIN DKE SPEC 99100
source: Source: ESPR - Annex XIII (1)
label: Материали, използвани в катода, анода и електролита @bg
label: Materiály použité v katodě, anodě a elektrolytu @cs
label: Materialer anvendt i katode, anode og elektrolyt @da
label: In Kathode, Anode und Elektrolyt verwendete Materialien @de
label: Υλικά που χρησιμοποιούνται στην κάθοδο, την άνοδο και τον ηλεκτρολύτη @el
label: Materiales utilizados en el cátodo, el ánodo y el electrolito @es
label: Katoodis, anoodis ja elektrolüüdis kasutatud materjalid @et
label: Katodissa, anodissa ja elektrolyytissä käytetyt materiaalit @fi
label: Matériaux utilisés dans la cathode, l'anode et l'électrolyte @fr
label: Ábhair a úsáidtear i gcatóid, anóid agus leictrilít @ga
label: Materijali koji se koriste u katodi, anodi i elektrolitu @hr
label: A katódban, anódban és elektrolitban felhasznált anyagok @hu
label: Materiali utilizzati nel catodo, nell'anodo e nell'elettrolita @it
label: Katode, anode ir elektrolite naudojamos medžiagos @lt
label: Katodā, anodā un elektrolītā izmantotie materiāli @lv
label: Materjali użati fil-katodu, l-anodu u l-elettrolit @mt
label: Materialen gebruikt in kathode, anode en elektrolyt @nl
label: Materiały stosowane w katodzie, anodzie i elektrolicie @pl
label: Materiais utilizados no cátodo, ânodo e eletrólito @pt
label: Materiale utilizate în catod, anod și electrolit @ro
label: Materiály použité v katóde, anóde a elektrolyte @sk
label: Materiali, uporabljeni v katodi, anodi in elektrolitu @sl
label: Material som används i katod, anod och elektrolyt @sv
comment: The battery passport must contain information on the detailed composition of the battery, including materials used in the cathode, anode and electrolyte. Reuses dppk:Component.
comment: Паспортът на батерията трябва да съдържа информация за подробния състав на батерията, включително материалите, използвани в катода, анода и електролита. Повторно използване на dppk:Component. @bg
comment: Pasy baterie musí obsahovat informace o podrobném složení baterie, včetně materiálů použitých v katodě, anodě a elektrolytu. Znovu používá dppk:Component. @cs
comment: Batteripasset skal indeholde oplysninger om batteriets detaljerede sammensætning, herunder materialer, der anvendes i katoden, anoden og elektrolytten. Genbruger dppk:Component. @da
comment: Der Batteriepass muss Informationen über die detaillierte Zusammensetzung der Batterie enthalten, einschließlich der in der Kathode, Anode und dem Elektrolyten verwendeten Materialien. Wiederverwendet dppk:Component. @de
comment: Το διαβατήριο της μπαταρίας πρέπει να περιέχει πληροφορίες σχετικά με τη λεπτομερή σύνθεση της μπαταρίας, συμπεριλαμβανομένων των υλικών που χρησιμοποιούνται στην κάθοδο, την άνοδο και τον ηλεκτρολύτη. Επαναχρησιμοποιεί το dppk:Component. @el
comment: El pasaporte de la batería debe contener información sobre la composición detallada de la batería, incluidos los materiales utilizados en el cátodo, el ánodo y el electrolito. Reutiliza dppk:Component. @es
comment: Aku pass peab sisaldama teavet aku üksikasjaliku koostise kohta, sealhulgas katoodis, anoodis ja elektrolüüdis kasutatud materjalide kohta. Taaskasutab dppk:Component. @et
comment: Akkupassin on sisällettävä tiedot akun yksityiskohtaisesta koostumuksesta, mukaan lukien katodissa, anodissa ja elektrolyytissä käytetyt materiaalit. Uudelleenkäyttää dppk:Component. @fi
comment: Le passeport de la batterie doit contenir des informations sur la composition détaillée de la batterie, y compris les matériaux utilisés dans la cathode, l'anode et l'électrolyte. Réutilise dppk:Component. @fr
comment: Ní mór faisnéis a bheith i bpas na ceallraí maidir le comhdhéanamh mionsonraithe na ceallraí, lena n-áirítear ábhair a úsáidtear sa chatóid, san anóid agus sa leictrilít. Athúsáideann sé dppk:Component. @ga
comment: Putovnica baterije mora sadržavati informacije o detaljnom sastavu baterije, uključujući materijale koji se koriste u katodi, anodi i elektrolitu. Ponovno koristi dppk:Component. @hr
comment: Az akkumulátor-útlevélnek tartalmaznia kell az akkumulátor részletes összetételére vonatkozó információkat, beleértve a katódban, anódban és elektrolitban felhasznált anyagokat. Újra felhasználja a dppk:Component-t. @hu
comment: Il passaporto della batteria deve contenere informazioni sulla composizione dettagliata della batteria, compresi i materiali utilizzati nel catodo, nell'anodo e nell'elettrolita. Riutilizza dppk:Component. @it
comment: Baterijos pase turi būti pateikta informacija apie išsamią baterijos sudėtį, įskaitant katode, anode ir elektrolite naudojamas medžiagas. Pakartotinai naudoja dppk:Component. @lt
comment: Baterijas pasē jābūt informācijai par detalizētu baterijas sastāvu, tostarp par katodā, anodā un elektrolītā izmantotajiem materiāliem. Atkārtoti izmanto dppk:Component. @lv
comment: Il-passaport tal-batterija għandu jkun fih informazzjoni dwar il-kompożizzjoni dettaljata tal-batterija, inklużi l-materjali użati fil-katodu, l-anodu u l-elettrolit. Juża mill-ġdid id-dppk:Component. @mt
comment: Het batterijpaspoort moet informatie bevatten over de gedetailleerde samenstelling van de batterij, inclusief de materialen die worden gebruikt in de kathode, anode en elektrolyt. Hergebruikt dppk:Component. @nl
comment: Paszport baterii musi zawierać informacje na temat szczegółowego składu baterii, w tym materiałów zastosowanych w katodzie, anodzie i elektrolicie. Ponownie wykorzystuje dppk:Component. @pl
comment: O passaporte da bateria deve conter informações sobre a composição detalhada da bateria, incluindo os materiais utilizados no cátodo, no ânodo и no eletrólito. Reutiliza o dppk:Component. @pt
comment: Pașaportul bateriei trebuie să conțină informații privind compoziția detaliată a bateriei, inclusiv materialele utilizate în catod, anod și electrolit. Refolosește dppk:Component. @ro
comment: Pas batérie musí obsahovať informácie o podrobnom zložení batérie vrátane materiálov použitých v katóde, anóde a elektrolyte. Opätovne používa dppk:Component. @sk
comment: Potni list za baterijo mora vsebovati informacije o podrobni sestavi baterije, vključno z materiali, uporabljenimi v katodi, anodi in elektrolitu. Ponovno uporablja dppk:Component. @sl
comment: Batteripasset måste innehålla information om batteriets detaljerade sammansättning, inklusive material som används i katoden, anoden och elektrolyten. Återanvänder dppk:Component. @sv
domain: Battery Product
range: Component

Hazardous substances
type: ObjectProperty
governed by: DIN DKE SPEC 99100
source: Source: ESPR - Annex XIII (1)
label: Опасни вещества @bg
label: Nebezpečné látky @cs
label: Farlige stoffer @da
label: Gefährliche Stoffe @de
label: Επικίνδυνες ουσίες @el
label: Sustancias peligrosas @es
label: Ohtlikud ained @et
label: Vaaralliset aineet @fi
label: Substances dangereuses @fr
label: Substaintí guaiseacha @ga
label: Opasne tvari @hr
label: Veszélyes anyagok @hu
label: Sostanze pericolose @it
label: Pavojingos medžiagos @lt
label: Bīstamas vielas @lv
label: Sustanzi perikolużi @mt
label: Gevaarlijke stoffen @nl
label: Substancje niebezpieczne @pl
label: Substâncias perigosas @pt
label: Substanțe periculoase @ro
label: Nevarne snovi @sl
label: Farliga ämnen @sv
comment: The battery passport must contain information on hazardous substances other than mercury, cadmium, or lead. Reuses dppk:Component.
comment: Паспортът на батерията трябва да съдържа информация за опасни вещества, различни от живак, кадмий или олово. Повторно използване на dppk:Component. @bg
comment: Pasy baterie musí obsahovat informace o nebezpečných látkách jiných než rtuť, kadmium nebo olovo. Znovu používá dppk:Component. @cs
comment: Batteripasset skal indeholde oplysninger om andre farlige stoffer end kviksølv, cadmium eller bly. Genbruger dppk:Component. @da
comment: Der Batteriepass muss Informationen über andere gefährliche Stoffe als Quecksilber, Cadmium oder Blei enthalten. Wiederverwendet dppk:Component. @de
comment: Το διαβατήριο της μπαταρίας πρέπει να περιέχει πληροφορίες για επικίνδυνες ουσίες εκτός από τον υδράργυρο, το κάδμιο ή τον μόλυβδο. Επαναχρησιμοποιεί το dppk:Component. @el
comment: El pasaporte de la batería debe contener información sobre sustancias peligrosas distintas del mercurio, el cadmio o el plomo. Reutiliza dppk:Component. @es
comment: Aku pass peab sisaldama teavet ohtlike ainete kohta, välja arvatud elavhõbe, kaadmium või plii. Taaskasutab dppk:Component. @et
comment: Akkupassin on sisällettävä tietoja muista vaarallisista aineista kuin elohopeasta, kadmiumista tai lyijystä. Uudelleenkäyttää dppk:Component. @fi
comment: Le passeport de la batterie doit contenir des informations sur les substances dangereuses autres que le mercure, le cadmium ou le plomb. Réutilise dppk:Component. @fr
comment: Ní mór faisnéis a bheith i bpas na ceallraí maidir le substaintí guaiseacha seachas mearcair, caidmiam, nó luaidhe. Athúsáideann sé dppk:Component. @ga
comment: Putovnica baterije mora sadržavati informacije o opasnim tvarima koje nisu živa, kadmij ili olovo. Ponovno koristi dppk:Component. @hr
comment: Az akkumulátor-útlevélnek a higanytól, kadmiumtól vagy ólomtól eltérő veszélyes anyagokra vonatkozó információkat kell tartalmaznia. Újra felhasználja a dppk:Component-t. @hu
comment: Il passaporto della batteria deve contenere informazioni su sostanze pericolose diverse da mercurio, cadmio o piombo. Riutilizza dppk:Component. @it
comment: Baterijos pase turi būti pateikta informacija apie pavojingas medžiagas, išskyrus gyvsidabrį, kadmį ar šviną. Pakartotinai naudoja dppk:Component. @lt
comment: Baterijas pasē jābūt informācijai par bīstamām vielām, kas nav dzīvsudrabs, kadmijs vai svins. Atkārtoti izmanto dppk:Component. @lv
comment: Il-passaport tal-batterija għandu jkun fih informazzjoni dwar sustanzi perikolużi minbarra l-merkurju, il-kadmju, jew iċ-ċomb. Juża mill-ġdid id-dppk:Component. @mt
comment: Het batterijpaspoort moet informatie bevatten over andere gevaarlijke stoffen dan kwik, cadmium of lood. Hergebruikt dppk:Component. @nl
comment: Paszport baterii musi zawierać informacje o substancjach niebezpiecznych innych niż rtęć, kadm i ołów. Ponownie wykorzystuje dppk:Component. @pl
comment: O passaporte da bateria deve conter informações sobre substâncias perigosas que não o mercúrio, o cádmio ou o chumbo. Reutiliza o dppk:Component. @pt
comment: Pașaportul bateriei trebuie să conțină informații privind substanțele periculoase, altele decât mercurul, cadmiul sau plumbul. Refolosește dppk:Component. @ro
comment: Pas batérie musí obsahovať informácie o nebezpečných látkach iných ako ortuť, kadmium alebo olovo. Opätovne používa dppk:Component. @sk
comment: Potni list za baterijo mora vsebovati informacije o nevarnih snoveh, ki niso živo srebro, kadmij ali svinec. Ponovno uporablja dppk:Component. @sl
comment: Batteripasset måste innehålla information om andra farliga ämnen än kvicksilver, kadmium eller bly. Återanvänder dppk:Component. @sv
domain: Battery Product
range: Component
related match: material

Impact of substances on environment, human health, safety, persons
type: DatatypeProperty
governed by: DIN DKE SPEC 99100
source: Source: ESPR - Annex XIII (1)
label: Въздействие на веществата върху околната среда, човешкото здраве, безопасността, хората @bg
label: Dopad látek na životní prostředí, lidské zdraví, bezpečnost, osoby @cs
label: Stoffers indvirkning på miljø, menneskers sundhed, sikkerhed, personer @da
label: Auswirkungen von Stoffen auf Umwelt, menschliche Gesundheit, Sicherheit, Personen @de
label: Επιπτώσεις των ουσιών στο περιβάλλον, την ανθρώπινη υγεία, την ασφάλεια, τα πρόσωπα @el
label: Impacto de las sustancias en el medio ambiente, la salud humana, la seguridad, las personas @es
label: Ainete mõju keskkonnale, inimeste tervisele, ohutusele, isikutele @et
label: Aineiden vaikutus ympäristöön, ihmisten terveyteen, turvallisuuteen, henkilöihin @fi
label: Impact des substances sur l'environnement, la santé humaine, la sécurité, les personnes @fr
label: Tionchar substaintí ar an gcomhshaol, ar shláinte an duine, ar shábháilteacht, ar dhaoine @ga
label: Utjecaj tvari na okoliš, zdravlje ljudi, sigurnost, osobe @hr
label: Az anyagok környezetre, emberi egészségre, biztonságra, személyekre gyakorolt hatása @hu
label: Impatto delle sostanze sull'ambiente, sulla salute umana, sulla sicurezza, sulle persone @it
label: Medžiagų poveikis aplinkai, žmonių sveikatai, saugai, asmenims @lt
label: Vielu ietekme uz vidi, cilvēku veselību, drošību, personām @lv
label: Impatt tas-sustanzi fuq l-ambjent, is-saħħa tal-bniedem, is-sikurezza, il-persuni @mt
label: Impact van stoffen op het milieu, de menselijke gezondheid, de veiligheid, personen @nl
label: Wpływ substancji na środowisko, zdrowie ludzkie, bezpieczeństwo, osoby @pl
label: Impacto das substâncias no ambiente, na saúde humana, na segurança, nas pessoas @pt
label: Impactul substanțelor asupra mediului, sănătății umane, siguranței, persoanelor @ro
label: Vplyv látok na životné prostredie, ľudské zdravie, bezpečnosť, osoby @sk
label: Vpliv snovi na okolje, zdravje ljudi, varnost, osebe @sl
label: Ämnens påverkan på miljö, människors hälsa, säkerhet, personer @sv
comment: The battery passport must contain information on the impact of substances, in particular hazardous substances, on the environment and human health.
comment: Паспортът на батерията трябва да съдържа информация за въздействието на веществата, по-специално на опасните вещества, върху околната среда и човешкото здраве. @bg
comment: Pasy baterie musí obsahovat informace o dopadu látek, zejména nebezpečných látek, na životní prostředí a lidské zdraví. @cs
comment: Batteripasset skal indeholde oplysninger om stoffers, især farlige stoffers, indvirkning på miljøet og menneskers sundhed. @da
comment: Der Batteriepass muss Informationen über die Auswirkungen von Stoffen, insbesondere gefährlichen Stoffen, auf die Umwelt und die menschliche Gesundheit enthalten. @de
comment: Το διαβατήριο της μπαταρίας πρέπει να περιέχει πληροφορίες σχετικά με τις επιπτώσεις των ουσιών, ιδίως των επικίνδυνων ουσιών, στο περιβάλλον και την ανθρώπινη υγεία. @el
comment: El pasaporte de la batería debe contener información sobre el impacto de las sustancias, en particular las sustancias peligrosas, en el medio ambiente y la salud humana. @es
comment: Aku pass peab sisaldama teavet ainete, eriti ohtlike ainete mõju kohta keskkonnale ja inimeste tervisele. @et
comment: Akkupassin on sisällettävä tietoja aineiden, erityisesti vaarallisten aineiden, vaikutuksista ympäristöön ja ihmisten terveyteen. @fi
comment: Le passeport de la batterie doit contenir des informations sur l'impact des substances, en particulier des substances dangereuses, sur l'environnement et la santé humaine. @fr
comment: Ní mór faisnéis a bheith i bpas na ceallraí maidir le tionchar substaintí, go háirithe substaintí guaiseacha, ar an gcomhshaol agus ar shláinte an duine. @ga
comment: Putovnica baterije mora sadržavati informacije o utjecaju tvari, posebno opasnih tvari, na okoliš i zdravlje ljudi. @hr
comment: Az akkumulátor-útlevélnek tartalmaznia kell az anyagok, különösen a veszélyes anyagok környezetre és emberi egészségre gyakorolt hatásaira vonatkozó információkat. @hu
comment: Il passaporto della batteria deve contenere informazioni sull'impatto delle sostanze, in particolare delle sostanze pericolose, sull'ambiente e sulla salute umana. @it
comment: Baterijos pase turi būti pateikta informacija apie medžiagų, ypač pavojingų, poveikį aplinkai ir žmonių sveikatai. @lt
comment: Baterijas pasē jābūt informācijai par vielu, jo īpaši bīstamu vielu, ietekmi uz vidi un cilvēku veselību. @lv
comment: Il-passaport tal-batterija għandu jkun fih informazzjoni dwar l-impatt tas-sustanzi, b'mod partikolari s-sustanzi perikolużi, fuq l-ambjent u s-saħħa tal-bniedem. @mt
comment: Het batterijpaspoort moet informatie bevatten over de gevolgen van stoffen, met name gevaarlijke stoffen, voor het milieu en de menselijke gezondheid. @nl
comment: Paszport baterii musi zawierać informacje o wpływie substancji, w szczególności substancji niebezpiecznych, na środowisko i zdrowie ludzkie. @pl
comment: O passaporte da bateria deve conter informações sobre o impacto das substâncias, em especial das substâncias perigosas, no ambiente e na saúde humana. @pt
comment: Pașaportul bateriei trebuie să conțină informații privind impactul substanțelor, în special al substanțelor periculoase, asupra mediului și a sănătății umane. @ro
comment: Pas batérie musí obsahovať informácie o vplyve látok, najmä nebezpečných látok, na životné prostredie a ľudské zdravie. @sk
comment: Potni list za baterijo mora vsebovati informacije o vplivu snovi, zlasti nevarnih snovi, na okolje in zdravje ljudi. @sl
comment: Batteripasset ska innehålla information om ämnens, särskilt farliga ämnens, påverkan på miljön och människors hälsa. @sv
domain: Battery Product
range: xsd:string
related match: PropertyValue
related match: ProductCharacteristic

Dismantling information
type: ObjectProperty
governed by: DIN DKE SPEC 99100
source: Source: ESPR - Annex XIII (1)
label: Информация за демонтаж @bg
label: Informace o demontáži @cs
label: Oplysninger om adskillelse @da
label: Informationen zur Demontage @de
label: Πληροφορίες αποσυναρμολόγησης @el
label: Información de desmontaje @es
label: Demonteerimise teave @et
label: Purkamistiedot @fi
label: Informations sur le démantèlement @fr
label: Faisnéis díchóimeála @ga
label: Informacije o rastavljanju @hr
label: Szétszerelési információk @hu
label: Informazioni sullo smantellamento @it
label: Išmontavimo informacija @lt
label: Demontāžas informācija @lv
label: Informazzjoni dwar iż-żarmar @mt
label: Informatie over demontage @nl
label: Informacje o demontażu @pl
label: Informações sobre desmantelamento @pt
label: Informații despre demontare @ro
label: Informácie o demontáži @sk
label: Informacije o razstavljanju @sl
label: Information om demontering @sv
comment: A battery passport must include dismantling information, including exploded diagrams, disassembly sequences, and tools required.
comment: Паспортът на батерията трябва да включва информация за демонтаж, включително разглобени диаграми, последователности на разглобяване и необходими инструменти. @bg
comment: Pasy baterie musí obsahovat informace o demontáži, včetně rozložených schémat, postupů demontáže a požadovaných nástrojů. @cs
comment: Et batteripas skal indeholde oplysninger om adskillelse, herunder eksploderede diagrammer, adskillelsessekvenser og påkrævede værktøjer. @da
comment: Ein Batteriepass muss Informationen zur Demontage enthalten, einschließlich Explosionszeichnungen, Demontagesequenzen und erforderlichen Werkzeugen. @de
comment: Ένα διαβατήριο μπαταρίας πρέπει να περιλαμβάνει πληροφορίες αποσυναρμολόγησης, συμπεριλαμβανομένων εκρηκτικών διαγραμμάτων, αλληλουχιών αποσυναρμολόγησης και απαιτούμενων εργαλείων. @el
comment: Un pasaporte de batería debe incluir información de desmontaje, incluidos diagramas de despiece, secuencias de desmontaje y herramientas necesarias. @es
comment: Aku pass peab sisaldama lahtivõtmise teavet, sealhulgas plahvatusjooniseid, lahtivõtmise järjestusi ja vajalikke tööriistu. @et
comment: Akkupassiin on sisällyttävä purkamistiedot, mukaan lukien räjäytyskuvat, purkamisjärjestykset ja tarvittavat työkalut. @fi
comment: Un passeport de batterie doit inclure des informations sur le démantèlement, y compris des schémas éclatés, des séquences de démontage et les outils requis. @fr
comment: Ní mór faisnéis díchóimeála a bheith i bpas ceallraí, lena n-áirítear léaráidí pléasctha, seichimh díchóimeála, agus uirlisí riachtanacha. @ga
comment: Putovnica baterije mora sadržavati informacije o rastavljanju, uključujući eksplodirane dijagrame, redoslijede rastavljanja i potrebne alate. @hr
comment: Az akkumulátor-útlevélnek tartalmaznia kell a szétszerelési információkat, beleértve a robbantott ábrákat, a szétszerelési sorrendeket és a szükséges szerszámokat. @hu
comment: Un passaporto della batteria deve includere informazioni sullo smantellamento, compresi diagrammi esplosi, sequenze di smontaggio e strumenti necessari. @it
comment: Baterijos pase turi būti pateikta išmontavimo informacija, įskaitant išardytas schemas, išmontavimo sekas ir reikiamus įrankius. @lt
comment: Baterijas pasē jāiekļauj demontāžas informācija, tostarp sprādzienbīstamas diagrammas, demontāžas secības un nepieciešamie instrumenti. @lv
comment: Passaport tal-batterija għandu jinkludi informazzjoni dwar iż-żarmar, inklużi dijagrammi sploduti, sekwenzi ta 'żarmar, u għodod meħtieġa. @mt
comment: Een batterijpaspoort moet demontage-informatie bevatten, inclusief explosietekeningen, demontagesequenties en vereiste gereedschappen. @nl
comment: Paszport baterii musi zawierać informacje dotyczące demontażu, w tym schematy rozstrzelone, sekwencje demontażu i wymagane narzędzia. @pl
comment: Um passaporte de bateria deve incluir informações de desmantelamento, incluindo diagramas explodidos, sequências de desmontagem e ferramentas necessárias. @pt
comment: Un pașaport de baterie trebuie să includă informații despre demontare, inclusiv diagrame explodate, secvențe de dezasamblare și unelte necesare. @ro
comment: Cestovný pas batérie musí obsahovať informácie o demontáži vrátane rozložených schém, postupov demontáže a požadovaných nástrojov. @sk
comment: Potni list za baterijo mora vsebovati informacije o razstavljanju, vključno z eksplozijskimi diagrami, zaporedji razstavljanja in potrebnimi orodji. @sl
comment: Ett batteripass måste innehålla demonteringsinformation, inklusive sprängskisser, demonteringssekvenser och nödvändiga verktyg. @sv
domain: Battery Product
range: RelatedResource

Part numbers for components
type: ObjectProperty
governed by: DIN DKE SPEC 99100
source: Source: ESPR - Annex XIII (1)
label: Номера на части за компоненти @bg
label: Čísla dílů pro komponenty @cs
label: Reservedelsnumre for komponenter @da
label: Teilenummern für Komponenten @de
label: Αριθμοί εξαρτημάτων για εξαρτήματα @el
label: Números de pieza de los componentes @es
label: Komponentide osade numbrid @et
label: Komponenttien osanumerot @fi
label: Numéros de pièces pour les composants @fr
label: Uimhreacha páirteanna do chomhpháirteanna @ga
label: Brojevi dijelova za komponente @hr
label: Alkatrészszámok az alkatrészekhez @hu
label: Numeri di parte per i componenti @it
label: Komponentų dalių numeriai @lt
label: Komponentu detaļu numuri @lv
label: Numri tal-partijiet għall-komponenti @mt
label: Onderdeelnummers voor componenten @nl
label: Numery części dla komponentów @pl
label: Números de peça para componentes @pt
label: Numere de piese pentru componente @ro
label: Čísla dielov pre komponenty @sk
label: Številke delov za komponente @sl
label: Artikelnummer för komponenter @sv
comment: A battery passport must include part numbers for components, provided together with contact details of sources for spare parts.
comment: Паспортът на батерията трябва да включва номера на частите на компонентите, предоставени заедно с данни за контакт с източници за резервни части. @bg
comment: Pasy baterie musí obsahovat čísla dílů pro součásti, která jsou poskytována spolu s kontaktními údaji na zdroje náhradních dílů. @cs
comment: Et batteripas skal indeholde reservedelsnumre for komponenter, der leveres sammen med kontaktoplysninger på kilder til reservedele. @da
comment: Ein Batteriepass muss Teilenummern für Komponenten enthalten, die zusammen mit den Kontaktdaten von Ersatzteilquellen bereitgestellt werden. @de
comment: Ένα διαβατήριο μπαταρίας πρέπει να περιλαμβάνει αριθμούς εξαρτημάτων για εξαρτήματα, οι οποίοι παρέχονται μαζί με τα στοιχεία επικοινωνίας των πηγών ανταλλακτικών. @el
comment: El pasaporte de una batería debe incluir los números de pieza de los componentes, junto con los datos de contacto de las fuentes de piezas de repuesto. @es
comment: Aku pass peab sisaldama komponentide osade numbreid koos varuosade allikate kontaktandmetega. @et
comment: Akkupassiin on sisällyttävä komponenttien osanumerot sekä varaosien lähteiden yhteystiedot. @fi
comment: Un passeport de batterie doit inclure les numéros de pièces des composants, fournis avec les coordonnées des sources de pièces de rechange. @fr
comment: Ní mór uimhreacha páirteanna do chomhpháirteanna a bheith i bpas ceallraí, arna soláthar mar aon le sonraí teagmhála foinsí do pháirteanna spártha. @ga
comment: Putovnica baterije mora sadržavati brojeve dijelova za komponente, koji se dostavljaju zajedno s kontaktnim podacima izvora rezervnih dijelova. @hr
comment: Az akkumulátor-útlevélnek tartalmaznia kell az alkatrészek cikkszámait, a pótalkatrészforrások elérhetőségi adataival együtt. @hu
comment: Il passaporto di una batteria deve includere i numeri di parte dei componenti, forniti insieme ai dati di contatto delle fonti di ricambi. @it
comment: Baterijos pase turi būti nurodyti sudedamųjų dalių dalių numeriai, pateikiami kartu su atsarginių dalių šaltinių kontaktiniais duomenimis. @lt
comment: Baterijas pasē jāiekļauj detaļu numuri sastāvdaļām, kas tiek piegādāti kopā ar rezerves daļu avotu kontaktinformāciju. @lv
comment: Passaport tal-batterija għandu jinkludi n-numri tal-partijiet għall-komponenti, ipprovduti flimkien mad-dettalji ta 'kuntatt tas-sorsi għall-ispare parts. @mt
comment: Een batterijpaspoort moet onderdeelnummers voor componenten bevatten, samen met de contactgegevens van bronnen voor reserveonderdelen. @nl
comment: Paszport baterii musi zawierać numery części komponentów, podane wraz z danymi kontaktowymi źródeł części zamiennych. @pl
comment: Um passaporte de bateria deve incluir os números de peça dos componentes, fornecidos juntamente com os detalhes de contato das fontes de peças sobressalentes. @pt
comment: Un pașaport de baterie trebuie să includă numerele de piesă pentru componente, furnizate împreună cu datele de contact ale surselor de piese de schimb. @ro
comment: Cestovný pas batérie musí obsahovať čísla dielov pre súčiastky, ktoré sa poskytujú spolu s kontaktnými údajmi zdrojov náhradných dielov. @sk
comment: Potni list za baterijo mora vsebovati številke delov za sestavne dele, ki so na voljo skupaj s kontaktnimi podatki virov za nadomestne dele. @sl
comment: Ett batteripass måste innehålla artikelnummer för komponenter, tillsammans med kontaktuppgifter till källor för reservdelar. @sv
domain: Battery Product
range: RelatedResource

Information on sources of spare parts
type: ObjectProperty
governed by: DIN DKE SPEC 99100
source: Source: ESPR - Annex XIII (1)
label: Информация за източници на резервни части @bg
label: Informace o zdrojích náhradních dílů @cs
label: Oplysninger om kilder til reservedele @da
label: Informationen über Bezugsquellen für Ersatzteile @de
label: Πληροφορίες σχετικά με τις πηγές ανταλλακτικών @el
label: Información sobre las fuentes de piezas de recambio @es
label: Teave varuosade allikate kohta @et
label: Tietoja varaosien lähteistä @fi
label: Informations sur les sources de pièces de rechange @fr
label: Faisnéis faoi fhoinsí páirteanna spártha @ga
label: Informacije o izvorima rezervnih dijelova @hr
label: Információk a pótalkatrészek forrásairól @hu
label: Informazioni sulle fonti dei pezzi di ricambio @it
label: Informacija apie atsarginių dalių šaltinius @lt
label: Informācija par rezerves daļu avotiem @lv
label: Informazzjoni dwar sorsi ta' spare parts @mt
label: Informatie over bronnen van reserveonderdelen @nl
label: Informacje o źródłach części zamiennych @pl
label: Informações sobre as fontes de peças sobressalentes @pt
label: Informații privind sursele de piese de schimb @ro
label: Informácie o zdrojoch náhradných dielov @sk
label: Informacije o virih nadomestnih delov @sl
label: Information om källor till reservdelar @sv
comment: A battery passport must include contact details of sources for spare parts.
comment: Паспортът на батерията трябва да включва данни за контакт с източници за резервни части. @bg
comment: Pasy baterie musí obsahovat kontaktní údaje na zdroje náhradních dílů. @cs
comment: Et batteripas skal indeholde kontaktoplysninger på kilder til reservedele. @da
comment: Ein Batteriepass muss die Kontaktdaten von Ersatzteilquellen enthalten. @de
comment: Ένα διαβατήριο μπαταρίας πρέπει να περιλαμβάνει τα στοιχεία επικοινωνίας των πηγών ανταλλακτικών. @el
comment: El pasaporte de una batería debe incluir los datos de contacto de las fuentes de piezas de repuesto. @es
comment: Aku pass peab sisaldama varuosade allikate kontaktandmeid. @et
comment: Akkupassiin on sisällyttävä varaosien lähteiden yhteystiedot. @fi
comment: Un passeport de batterie doit inclure les coordonnées des sources de pièces de rechange. @fr
comment: Ní mór sonraí teagmhála foinsí do pháirteanna spártha a bheith i bpas ceallraí. @ga
comment: Putovnica baterije mora sadržavati kontaktne podatke izvora rezervnih dijelova. @hr
comment: Az akkumulátor-útlevélnek tartalmaznia kell a pótalkatrészforrások elérhetőségét. @hu
comment: Il passaporto di una batteria deve includere i dati di contatto delle fonti di ricambi. @it
comment: Baterijos pase turi būti nurodyti atsarginių dalių šaltinių kontaktiniai duomenys. @lt
comment: Baterijas pasē jāiekļauj rezerves daļu avotu kontaktinformācija. @lv
comment: Passaport tal-batterija għandu jinkludi d-dettalji ta' kuntatt tas-sorsi għall-ispare parts. @mt
comment: Een batterijpaspoort moet de contactgegevens van bronnen voor reserveonderdelen bevatten. @nl
comment: Paszport baterii musi zawierać dane kontaktowe źródeł części zamiennych. @pl
comment: Um passaporte de bateria deve incluir os detalhes de contato das fontes de peças sobressalentes. @pt
comment: Un pașaport de baterie trebuie să includă datele de contact ale surselor de piese de schimb. @ro
comment: Cestovný pas batérie musí obsahovať kontaktné údaje zdrojov náhradných dielov. @sk
comment: Potni list za baterijo mora vsebovati kontaktne podatke virov za nadomestne dele. @sl
comment: Ett batteripass måste innehålla kontaktuppgifter till källor för reservdelar. @sv
domain: Battery Product
range: RelatedResource
related match: Text
related match: description

Safety measures
type: ObjectProperty
governed by: DIN DKE SPEC 99100
source: Source: ESPR - Annex XIII (1)
label: Мерки за безопасност @bg
label: Bezpečnostní opatření @cs
label: Sikkerhedsforanstaltninger @da
label: Sicherheitsmaßnahmen @de
label: Μέτρα ασφαλείας @el
label: Medidas de seguridad @es
label: Ohutusmeetmed @et
label: Turvatoimenpiteet @fi
label: Mesures de sécurité @fr
label: Bearta sábháilteachta @ga
label: Sigurnosne mjere @hr
label: Biztonsági intézkedések @hu
label: Misure di sicurezza @it
label: Saugos priemonės @lt
label: Drošības pasākumi @lv
label: Miżuri ta' sigurtà @mt
label: Veiligheidsmaatregelen @nl
label: Środki bezpieczeństwa @pl
label: Medidas de segurança @pt
label: Măsuri de siguranță @ro
label: Bezpečnostné opatrenia @sk
label: Varnostni ukrepi @sl
label: Säkerhetsåtgärder @sv
comment: A battery passport must include safety measures, provided via the instruction manual.
comment: Паспортът на батерията трябва да включва мерки за безопасност, предоставени чрез ръководството за употреба. @bg
comment: Pasy baterie musí obsahovat bezpečnostní opatření, která jsou uvedena v návodu k použití. @cs
comment: Et batteripas skal indeholde sikkerhedsforanstaltninger, der er angivet i brugsanvisningen. @da
comment: Ein Batteriepass muss Sicherheitsmaßnahmen enthalten, die in der Bedienungsanleitung angegeben sind. @de
comment: Ένα διαβατήριο μπαταρίας πρέπει να περιλαμβάνει μέτρα ασφαλείας, τα οποία παρέχονται μέσω του εγχειριδίου οδηγιών. @el
comment: El pasaporte de una batería debe incluir las medidas de seguridad, que se proporcionan en el manual de instrucciones. @es
comment: Aku pass peab sisaldama ohutusmeetmeid, mis on esitatud kasutusjuhendis. @et
comment: Akkupassiin on sisällyttävä turvatoimenpiteet, jotka on esitetty käyttöohjeessa. @fi
comment: Un passeport de batterie doit inclure des mesures de sécurité, fournies dans le manuel d'instructions. @fr
comment: Ní mór bearta sábháilteachta a bheith i bpas ceallraí, arna soláthar tríd an lámhleabhar treoracha. @ga
comment: Putovnica baterije mora sadržavati sigurnosne mjere, navedene u priručniku s uputama. @hr
comment: Az akkumulátor-útlevélnek tartalmaznia kell a használati útmutatóban megadott biztonsági intézkedéseket. @hu
comment: Il passaporto di una batteria deve includere le misure di sicurezza, fornite nel manuale di istruzioni. @it
comment: Baterijos pase turi būti nurodytos saugos priemonės, pateiktos naudojimo instrukcijoje. @lt
comment: Baterijas pasē jāiekļauj drošības pasākumi, kas sniegti lietošanas pamācībā. @lv
comment: Passaport tal-batterija għandu jinkludi miżuri ta' sigurtà, ipprovduti permezz tal-manwal tal-istruzzjonijiet. @mt
comment: Een batterijpaspoort moet veiligheidsmaatregelen bevatten, die worden verstrekt via de handleiding. @nl
comment: Paszport baterii musi zawierać środki bezpieczeństwa, podane w instrukcji obsługi. @pl
comment: Um passaporte de bateria deve incluir medidas de segurança, fornecidas através do manual de instruções. @pt
comment: Un pașaport de baterie trebuie să includă măsuri de siguranță, furnizate prin intermediul manualului de instrucțiuni. @ro
comment: Cestovný pas batérie musí obsahovať bezpečnostné opatrenia uvedené v návode na použitie. @sk
comment: Potni list za baterijo mora vsebovati varnostne ukrepe, ki so navedeni v navodilih za uporabo. @sl
comment: Ett batteripass måste innehålla säkerhetsåtgärder, som tillhandahålls i bruksanvisningen. @sv
domain: Battery Product
range: RelatedResource
related match: Text
related match: description

Information on waste prevention and management
type: ObjectProperty
governed by: DIN DKE SPEC 99100
source: Source: ESPR - Annex XIII (1)
label: Информация за предотвратяване и управление на отпадъците @bg
label: Informace o předcházení vzniku odpadů a o hospodaření s nimi @cs
label: Oplysninger om affaldsforebyggelse og -håndtering @da
label: Informationen zur Abfallvermeidung und -bewirtschaftung @de
label: Πληροφορίες σχετικά με την πρόληψη και τη διαχείριση των αποβλήτων @el
label: Información sobre prevención y gestión de residuos @es
label: Teave jäätmetekke vältimise ja jäätmekäitluse kohta @et
label: Tietoa jätteen synnyn ehkäisystä ja jätehuollosta @fi
label: Informations sur la prévention et la gestion des déchets @fr
label: Faisnéis maidir le dramhaíl a chosc agus a bhainistiú @ga
label: Informacije o sprečavanju i gospodarenju otpadom @hr
label: Tájékoztatás a hulladékmegelőzésről és -gazdálkodásról @hu
label: Informazioni sulla prevenzione e la gestione dei rifiuti @it
label: Informacija apie atliekų prevenciją ir tvarkymą @lt
label: Informācija par atkritumu rašanās novēršanu un apsaimniekošanu @lv
label: Informazzjoni dwar il-prevenzjoni u l-ġestjoni tal-iskart @mt
label: Informatie over afvalpreventie en -beheer @nl
label: Informacje na temat zapobiegania powstawaniu odpadów i gospodarowania nimi @pl
label: Informações sobre a prevenção e gestão de resíduos @pt
label: Informații privind prevenirea și gestionarea deșeurilor @ro
label: Informácie o predchádzaní vzniku odpadu a o hospodárení s ním @sk
label: Informacije o preprečevanju in ravnanju z odpadki @sl
label: Information om förebyggande och hantering av avfall @sv
comment: Information on the role of end-users in waste prevention, separate collection, and information on battery collection and treatment.
comment: Информация за ролята на крайните потребители в предотвратяването на отпадъците, разделното събиране и информация за събирането и третирането на батерии. @bg
comment: Informace o úloze konečných uživatelů při předcházení vzniku odpadu, odděleném sběru a informace o sběru a zpracování baterií. @cs
comment: Oplysninger om slutbrugernes rolle i affaldsforebyggelse, separat indsamling og oplysninger om indsamling og behandling af batterier. @da
comment: Informationen über die Rolle der Endnutzer bei der Abfallvermeidung, der getrennten Sammlung und Informationen über die Sammlung und Behandlung von Batterien. @de
comment: Πληροφορίες σχετικά με τον ρόλο των τελικών χρηστών στην πρόληψη των αποβλήτων, τη χωριστή συλλογή και πληροφορίες σχετικά με τη συλλογή και την επεξεργασία των μπαταριών. @el
comment: Información sobre el papel de los usuarios finales en la prevención de residuos, la recogida selectiva e información sobre la recogida y el tratamiento de las pilas. @es
comment: Teave lõppkasutajate rolli kohta jäätmetekke vältimisel, eraldi kogumisel ning teave patareide kogumise ja töötlemise kohta. @et
comment: Tietoa loppukäyttäjien roolista jätteen synnyn ehkäisemisessä, erilliskeräyksessä sekä tietoa paristojen keräyksestä ja käsittelystä. @fi
comment: Informations sur le rôle des utilisateurs finaux dans la prévention des déchets, la collecte sélective et informations sur la collecte et le traitement des piles et accumulateurs. @fr
comment: Faisnéis faoi ról na n-úsáideoirí deiridh i gcosc dramhaíola, i mbailiú ar leithligh, agus faisnéis faoi bhailiú agus cóireáil cadhnraí. @ga
comment: Informacije o ulozi krajnjih korisnika u sprečavanju otpada, odvojenom prikupljanju i informacije o prikupljanju i obradi baterija. @hr
comment: Tájékoztatás a végfelhasználók szerepéről a hulladékmegelőzésben, a szelektív gyűjtésben, valamint tájékoztatás az elemek gyűjtéséről és kezeléséről. @hu
comment: Informazioni sul ruolo degli utenti finali nella prevenzione dei rifiuti, sulla raccolta differenziata e informazioni sulla raccolta e il trattamento delle batterie. @it
comment: Informacija apie galutinių vartotojų vaidmenį atliekų prevencijos, atskiro surinkimo srityse ir informacija apie baterijų surinkimą ir apdorojimą. @lt
comment: Informācija par galalietotāju lomu atkritumu rašanās novēršanā, dalītajā savākšanā un informācija par bateriju savākšanu un apstrādi. @lv
comment: Informazzjoni dwar ir-rwol tal-utenti aħħarin fil-prevenzjoni tal-iskart, il-ġbir separat, u informazzjoni dwar il-ġbir u t-trattament tal-batteriji. @mt
comment: Informatie over de rol van eindgebruikers bij afvalpreventie, gescheiden inzameling en informatie over de inzameling en behandeling van batterijen. @nl
comment: Informacje na temat roli użytkowników końcowych w zapobieganiu powstawaniu odpadów, selektywnej zbiórce oraz informacje na temat zbiórki i przetwarzania baterii. @pl
comment: Informações sobre o papel dos utilizadores finais na prevenção de resíduos, na recolha seletiva e informações sobre a recolha e tratamento de pilhas. @pt
comment: Informații privind rolul utilizatorilor finali în prevenirea deșeurilor, colectarea separată și informații privind colectarea și tratarea bateriilor. @ro
comment: Informácie o úlohe koncových používateľov pri predchádzaní vzniku odpadu, separovanom zbere a informácie o zbere a spracovaní batérií. @sk
comment: Informacije o vlogi končnih uporabnikov pri preprečevanju nastajanja odpadkov, ločenem zbiranju in informacije o zbiranju in predelavi baterij. @sl
comment: Information om slutanvändarnas roll i avfallsförebyggande, separat insamling och information om insamling och behandling av batterier. @sv
domain: Battery Product
range: RelatedResource
related match: description

Pre-consumer recycled material shares
type: ObjectProperty
governed by: DIN DKE SPEC 99100
source: Source: ESPR - Annex XIII (1)
label: Дялове на рециклирани материали преди потребление @bg
label: Podíly recyklovaného materiálu před spotřebitelem @cs
label: Andele af genanvendt materiale før forbrug @da
label: Anteile von recyceltem Material vor dem Verbraucher @de
label: Μερίδια ανακυκλωμένου υλικού πριν από την κατανάλωση @el
label: Porcentajes de material reciclado preconsumo @es
label: Tarbijaeelse ringlussevõetud materjali osakaalud @et
label: Kuluttajaa edeltävän kierrätysmateriaalin osuudet @fi
label: Parts de matériaux recyclés pré-consommation @fr
label: Scaireanna d'ábhar athchúrsáilte réamh-thomhaltais @ga
label: Udjeli recikliranog materijala prije uporabe @hr
label: Fogyasztás előtti újrahasznosított anyagok aránya @hu
label: Quote di materiale riciclato pre-consumo @it
label: Iki vartojimo perdirbtos medžiagos dalys @lt
label: Pirmspatēriņa pārstrādāta materiāla daļas @lv
label: Ishma ta' materjal riċiklat qabel il-konsumatur @mt
label: Aandelen pre-consumer gerecycled materiaal @nl
label: Udziały materiałów pochodzących z recyklingu przedkonsumenckiego @pl
label: Partes de material reciclado pré-consumo @pt
label: Ponderea materialelor reciclate înainte de consum @ro
label: Podiel recyklovaného materiálu pred spotrebou @sk
label: Deleži recikliranega materiala pred uporabo @sl
label: Andelar av återvunnet material före konsumentledet @sv
comment: The percentage shares of Nickel, Cobalt, Lithium, and Lead recovered from battery manufacturing waste (pre-consumer).
comment: Процентните дялове на никел, кобалт, литий и олово, възстановени от отпадъци от производството на батерии (преди потребление). @bg
comment: Procentuální podíly niklu, kobaltu, lithia a olova získaných z odpadu z výroby baterií (před spotřebitelem). @cs
comment: Den procentvise andel af nikkel, kobolt, lithium og bly, der er genvundet fra affald fra batteriproduktion (før forbrug). @da
comment: Die prozentualen Anteile von Nickel, Kobalt, Lithium und Blei, die aus Abfällen der Batterieherstellung zurückgewonnen wurden (Pre-Consumer). @de
comment: Τα ποσοστιαία μερίδια νικελίου, κοβαλτίου, λιθίου και μολύβδου που ανακτήθηκαν από απόβλητα κατασκευής μπαταριών (πριν από την κατανάλωση). @el
comment: Los porcentajes de níquel, cobalto, litio y plomo recuperados de los residuos de fabricación de baterías (preconsumo). @es
comment: Nikli, koobalti, liitiumi ja plii protsentuaalne osakaal, mis on regenereeritud akude tootmisjäätmetest (tarbijaeelne). @et
comment: Akkujen valmistusjätteestä (kuluttajaa edeltävästä) talteen otetun nikkelin, koboltin, litiumin ja lyijyn prosenttiosuudet. @fi
comment: Les pourcentages de nickel, de cobalt, de lithium et de plomb récupérés à partir des déchets de fabrication de batteries (pré-consommation). @fr
comment: Na scaireanna céatadáin de Nicil, Cóbailt, Litiam, agus Luaidhe a aisghabháil ó dhramhaíl déantúsaíochta ceallraí (réamh-thomhaltas). @ga
comment: Postotni udjeli nikla, kobalta, litija i olova dobivenih iz otpada od proizvodnje baterija (prije uporabe). @hr
comment: Az akkumulátorgyártási hulladékból (fogyasztás előtti) visszanyert nikkel, kobalt, lítium és ólom százalékos aránya. @hu
comment: Le quote percentuali di nichel, cobalto, litio e piombo recuperate dai rifiuti di produzione delle batterie (pre-consumo). @it
comment: Nikelio, kobalto, ličio ir švino, gautų iš baterijų gamybos atliekų (iki vartojimo), procentinė dalis. @lt
comment: No akumulatoru ražošanas atkritumiem (pirmspatēriņa) reģenerētā niķeļa, kobalta, litija un svina procentuālās daļas. @lv
comment: Is-sehem perċentwali tan-Nikil, il-Kobalt, il-Litju u ċ-Ċomb irkuprati mill-iskart tal-manifattura tal-batteriji (qabel il-konsumatur). @mt
comment: De percentages nikkel, kobalt, lithium en lood die worden teruggewonnen uit afval van de batterijproductie (pre-consumer). @nl
comment: Procentowy udział niklu, kobaltu, litu i ołowiu odzyskanych z odpadów produkcyjnych baterii (przedkonsumenckich). @pl
comment: As percentagens de níquel, cobalto, lítio e chumbo recuperadas dos resíduos de fabrico de baterias (pré-consumo). @pt
comment: Ponderea procentuală de nichel, cobalt, litiu și plumb recuperate din deșeurile de la fabricarea bateriilor (înainte de consum). @ro
comment: Percentuálny podiel niklu, kobaltu, lítia a olova zhodnoteného z odpadu z výroby batérií (pred spotrebou). @sk
comment: Odstotni deleži niklja, kobalta, litija in svinca, pridobljenih iz odpadkov pri proizvodnji baterij (pred uporabo). @sl
comment: De procentuella andelarna av nickel, kobolt, litium och bly som återvunnits från avfall från batteritillverkning (före konsumentledet). @sv
domain: Battery Product
range: Component
related match: material
related match: ProductCharacteristic

Post-consumer recycled material shares
type: ObjectProperty
governed by: DIN DKE SPEC 99100
source: Source: ESPR - Annex XIII (1)
label: Дялове на рециклирани материали след потребление @bg
label: Podíly recyklovaného materiálu po spotřebiteli @cs
label: Andele af genanvendt materiale efter forbrug @da
label: Anteile von recyceltem Material nach dem Verbraucher @de
label: Μερίδια ανακυκλωμένου υλικού μετά την κατανάλωση @el
label: Porcentajes de material reciclado posconsumo @es
label: Tarbijajärgse ringlussevõetud materjali osakaalud @et
label: Kuluttajan jälkeisen kierrätysmateriaalin osuudet @fi
label: Parts de matériaux recyclés post-consommation @fr
label: Scaireanna d'ábhar athchúrsáilte iar-thomhaltais @ga
label: Udjeli recikliranog materijala nakon uporabe @hr
label: Fogyasztás utáni újrahasznosított anyagok aránya @hu
label: Quote di materiale riciclato post-consumo @it
label: Po vartojimo perdirbtos medžiagos dalys @lt
label: Pēcpatēriņa pārstrādāta materiāla daļas @lv
label: Ishma ta' materjal riċiklat wara l-konsumatur @mt
label: Aandelen post-consumer gerecycled materiaal @nl
label: Udziały materiałów pochodzących z recyklingu pokonsumenckiego @pl
label: Partes de material reciclado pós-consumo @pt
label: Ponderea materialelor reciclate după consum @ro
label: Podiel recyklovaného materiálu po spotrebe @sk
label: Deleži recikliranega materiala po uporabi @sl
label: Andelar av återvunnet material efter konsumentledet @sv
comment: The percentage shares of Nickel, Cobalt, Lithium, and Lead recovered from waste (post-consumer).
comment: Процентните дялове на никел, кобалт, литий и олово, възстановени от отпадъци (след потребление). @bg
comment: Procentuální podíly niklu, kobaltu, lithia a olova získaných z odpadu (po spotřebiteli). @cs
comment: Den procentvise andel af nikkel, kobolt, lithium og bly, der er genvundet fra affald (efter forbrug). @da
comment: Die prozentualen Anteile von Nickel, Kobalt, Lithium und Blei, die aus Abfällen zurückgewonnen wurden (Post-Consumer). @de
comment: Τα ποσοστιαία μερίδια νικελίου, κοβαλτίου, λιθίου και μολύβδου που ανακτήθηκαν από απόβληта (μετά την κατανάλωση). @el
comment: Los porcentajes de níquel, cobalto, litio y plomo recuperados de los residuos (posconsumo). @es
comment: Nikli, koobalti, liitiumi ja plii protsentuaalne osakaal, mis on regenereeritud jäätmetest (tarbijajärgne). @et
comment: Jätteestä (kuluttajan jälkeisestä) talteen otetun nikkelin, koboltin, litiumin ja lyijyn prosenttiosuudet. @fi
comment: Les pourcentages de nickel, de cobalt, de lithium et de plomb récupérés à partir des déchets (post-consommation). @fr
comment: Na scaireanna céatadáin de Nicil, Cóbailt, Litiam, agus Luaidhe a aisghabháil ó dhramhaíl (iar-thomhaltas). @ga
comment: Postotni udjeli nikla, kobalta, litija i olova dobivenih iz otpada (nakon uporabe). @hr
comment: A hulladékból (fogyasztás utáni) visszanyert nikkel, kobalt, lítium és ólom százalékos aránya. @hu
comment: Le quote percentuali di nichel, cobalto, litio e piombo recuperate dai rifiuti (post-consumo). @it
comment: Nikelio, kobalto, ličio ir švino, gautų iš atliekų (po vartojimo), procentinė dalis. @lt
comment: No atkritumiem (pēcpatēriņa) reģenerētā niķeļa, kobalta, litija un svina procentuālās daļas. @lv
comment: Is-sehem perċentwali tan-Nikil, il-Kobalt, il-Litju, u ċ-Ċomb irkuprati mill-iskart (wara l-konsumatur). @mt
comment: De percentages nikkel, kobalt, lithium en lood die worden teruggewonnen uit afval (post-consumer). @nl
comment: Procentowy udział niklu, kobaltu, litu i ołowiu odzyskanych z odpadów (pokonsumenckich). @pl
comment: As percentagens de níquel, cobalto, lítio e chumbo recuperadas de resíduos (pós-consumo). @pt
comment: Ponderea procentuală de nichel, cobalt, litiu și plumb recuperate din deșeuri (post-consum). @ro
comment: Percentuálny podiel niklu, kobaltu, lítia a olova zhodnoteného z odpadu (po spotrebe). @sk
comment: Odstotni deleži niklja, kobalta, litija in svinca, pridobljenih iz odpadkov (po uporabi). @sl
comment: De procentuella andelarna av nickel, kobolt, litium och bly som återvunnits från avfall (efter konsumentledet). @sv
domain: Battery Product
range: Component
related match: material
related match: ProductCharacteristic

Renewable content share
type: DatatypeProperty
governed by: DIN DKE SPEC 99100
unit: Percent
source: Source: ESPR - Annex XIII (1)
label: Дял на възобновяемо съдържание @bg
label: Podíl obnovitelného obsahu @cs
label: Andel af vedvarende indhold @da
label: Anteil an erneuerbarem Inhalt @de
label: Μερίδιο ανανεώσιμου περιεχομένου @el
label: Proporción de contenido renovable @es
label: Taastuvenergia osakaal @et
label: Uusiutuvan sisällön osuus @fi
label: Part de contenu renouvelable @fr
label: Scair d'ábhar in-athnuaite @ga
label: Udio obnovljivog sadržaja @hr
label: Megújuló tartalom aránya @hu
label: Quota di contenuto rinnovabile @it
label: Atsinaujinančio turinio dalis @lt
label: Atjaunojamā satura daļa @lv
label: Sehem tal-kontenut rinnovabbli @mt
label: Aandeel hernieuwbare inhoud @nl
label: Udział treści odnawialnych @pl
label: Quota de conteúdo renovável @pt
label: Ponderea conținutului regenerabil @ro
label: Podiel obnoviteľného obsahu @sk
label: Delež obnovljive vsebine @sl
label: Andel förnybart innehåll @sv
comment: A battery passport must include information about the share of renewable content.
comment: Паспортът на батерията трябва да включва информация за дела на възобновяемото съдържание. @bg
comment: Pasy baterie musí obsahovat informace o podílu obnovitelného obsahu. @cs
comment: Et batteripas skal indeholde oplysninger om andelen af vedvarende indhold. @da
comment: Ein Batteriepass muss Informationen über den Anteil an erneuerbarem Inhalt enthalten. @de
comment: Ένα διαβατήριο μπαταρίας πρέπει να περιλαμβάνει πληροφορίες σχετικά με το μερίδιο του ανανεώσιμου περιεχομένου. @el
comment: El pasaporte de una batería debe incluir información sobre la proporción de contenido renovable. @es
comment: Aku pass peab sisaldama teavet taastuvenergia osakaalu kohta. @et
comment: Akkupassiin on sisällytettävä tiedot uusiutuvan sisällön osuudesta. @fi
comment: Un passeport de batterie doit inclure des informations sur la part de contenu renouvelable. @fr
comment: Ní mór faisnéis a bheith i bpas ceallraí faoi scair an ábhair in-athnuaite. @ga
comment: Putovnica baterije mora sadržavati informacije o udjelu obnovljivog sadržaja. @hr
comment: Az akkumulátor-útlevélnek tartalmaznia kell a megújuló tartalom arányára vonatkozó információkat. @hu
comment: Il passaporto di una batteria deve includere informazioni sulla quota di contenuto rinnovabile. @it
comment: Baterijos pase turi būti pateikta informacija apie atsinaujinančio turinio dalį. @lt
comment: Baterijas pasē jāiekļauj informācija par atjaunojamā satura daļu. @lv
comment: Passaport tal-batterija għandu jinkludi informazzjoni dwar is-sehem tal-kontenut rinnovabbli. @mt
comment: Een batterijpaspoort moet informatie bevatten over het aandeel hernieuwbare inhoud. @nl
comment: Paszport baterii musi zawierać informacje o udziale treści odnawialnych. @pl
comment: Um passaporte de bateria deve incluir informações sobre a quota de conteúdo renovável. @pt
comment: Un pașaport de baterie trebuie să includă informații despre ponderea conținutului regenerabil. @ro
comment: Cestovný pas batérie musí obsahovať informácie o podiele obnoviteľného obsahu. @sk
comment: Potni list za baterijo mora vsebovati informacije o deležu obnovljive vsebine. @sl
comment: Ett batteripass måste innehålla information om andelen förnybart innehåll. @sv
domain: Battery Product
range: xsd:double
related match: PropertyValue
related match: AdditionalProductClassificationDetails

Performance and durability parameters
type: ObjectProperty
governed by: DIN DKE SPEC 99100
source: Source: ESPR - Annex XIII (1)
label: Параметри за производителност и издръжливост @bg
label: Parametry výkonu a trvanlivosti @cs
label: Parametre for ydeevne og holdbarhed @da
label: Leistungs- und Haltbarkeitsparameter @de
label: Παράμετροι απόδοσης και ανθεκτικότητας @el
label: Parámetros de rendimiento y durabilidad @es
label: Toimivuse ja vastupidavuse parameetrid @et
label: Suorituskyky- ja kestävyysparametrit @fi
label: Paramètres de performance et de durabilité @fr
label: Paraiméadair feidhmíochta agus marthanachta @ga
label: Parametri performansi i trajnosti @hr
label: Teljesítmény- és tartóssági paraméterek @hu
label: Parametri di prestazione e durata @it
label: Veikimo ir ilgaamžiškumo parametrai @lt
label: Veiktspējas un izturības parametri @lv
label: Parametri tal-prestazzjoni u d-durabilità @mt
label: Prestatie- en duurzaamheidsparameters @nl
label: Parametry wydajności i trwałości @pl
label: Parâmetros de desempenho e durabilidade @pt
label: Parametrii de performanță și durabilitate @ro
label: Parametre výkonu a trvanlivosti @sk
label: Parametri zmogljivosti in trajnosti @sl
label: Prestanda- och hållbarhetsparametrar @sv
comment: A battery passport must include information on the performance and durability of the battery.
comment: Паспортът на батерията трябва да включва информация за производителността и издръжливостта на батерията. @bg
comment: Pasy baterie musí obsahovat informace o výkonu a životnosti baterie. @cs
comment: Et batteripas skal indeholde oplysninger om batteriets ydeevne og holdbarhed. @da
comment: Ein Batteriepass muss Informationen zur Leistung und Haltbarkeit der Batterie enthalten. @de
comment: Το διαβατήριο της μπαταρίας πρέπει να περιλαμβάνει πληροφορίες σχετικά με την απόδοση και την ανθεκτικότητα της μπαταρίας. @el
comment: El pasaporte de la batería debe incluir información sobre el rendimiento y la durabilidad de la batería. @es
comment: Aku pass peab sisaldama teavet aku jõudluse ja vastupidavuse kohta. @et
comment: Akkupassin on sisällettävä tiedot akun suorituskyvystä ja kestävyydestä. @fi
comment: Un passeport de batterie doit inclure des informations sur les performances et la durabilité de la batterie. @fr
comment: Ní mór pas ceallraí a bheith san áireamh faisnéis maidir le feidhmíocht agus marthanacht na ceallraí. @ga
comment: Putovnica za baterije mora sadržavati informacije o performansama i trajnosti baterije. @hr
comment: Az akkumulátor-útlevélnek tartalmaznia kell az akkumulátor teljesítményére és tartósságára vonatkozó információkat. @hu
comment: Il passaporto della batteria deve includere informazioni sulle prestazioni e sulla durata della batteria. @it
comment: Baterijos pase turi būti pateikta informacija apie baterijos veikimą ir ilgaamžiškumą. @lt
comment: Baterijas pasei jāietver informācija par baterijas veiktspēju un izturību. @lv
comment: Passaport tal-batterija għandu jinkludi informazzjoni dwar il-prestazzjoni u d-durabilità tal-batterija. @mt
comment: Een batterijpaspoort moet informatie bevatten over de prestaties en duurzaamheid van de batterij. @nl
comment: Paszport baterii musi zawierać informacje na temat wydajności i trwałości baterii. @pl
comment: O passaporte da bateria deve incluir informações sobre o desempenho e a durabilidade da bateria. @pt
comment: Un pașaport pentru baterii trebuie să includă informații privind performanța și durabilitatea bateriei. @ro
comment: Cestovný pas batérie musí obsahovať informácie o výkone a životnosti batérie. @sk
comment: Potni list za baterije mora vsebovati informacije o zmogljivosti in trajnosti baterije. @sl
comment: Ett batteripass måste innehålla information om batteriets prestanda och hållbarhet. @sv
domain: Battery Product
range: Performance and Durability
related match: additionalProperty
related match: ProductCharacteristic

Capacity, energy, and voltage
type: ObjectProperty
governed by: DIN DKE SPEC 99100
source: Source: ESPR - Annex XIII (1)
label: Капацитет, енергия и напрежение @bg
label: Kapacita, energie a napětí @cs
label: Kapacitet, energi og spænding @da
label: Kapazität, Energie und Spannung @de
label: Χωρητικότητα, ενέργεια και τάση @el
label: Capacidad, energía y tensión @es
label: Mahtuvus, energia ja pinge @et
label: Kapasiteetti, energia ja jännite @fi
label: Capacité, énergie et tension @fr
label: Acmhainn, fuinneamh, agus voltas @ga
label: Kapacitet, energija i napon @hr
label: Kapacitás, energia és feszültség @hu
label: Capacità, energia e tensione @it
label: Talpa, energija ir įtampa @lt
label: Jaudas, enerģijas un sprieguma @lv
label: Kapaċità, enerġija, u vultaġġ @mt
label: Capaciteit, energie en spanning @nl
label: Pojemność, energia i napięcie @pl
label: Capacidade, energia e tensão @pt
label: Capacitate, energie și tensiune @ro
label: Kapacita, energia a napätie @sk
label: Zmogljivost, energija in napetost @sl
label: Kapacitet, energi och spänning @sv
comment: Sub-section for capacity, energy, state of charge, and voltage limits.
comment: Подраздел за капацитет, енергия, състояние на зареждане и граници на напрежение. @bg
comment: Pododdíl pro kapacitu, energii, stav nabití a mezní hodnoty napětí. @cs
comment: Underinddeling for kapacitet, energi, ladningstilstand og spændingsgrænser. @da
comment: Unterabschnitt für Kapazität, Energie, Ladezustand und Spannungsgrenzen. @de
comment: Υποενότητα για χωρητικότητα, ενέργεια, κατάσταση φόρτισης και όρια τάσης. @el
comment: Subsección de capacidad, energía, estado de carga y límites de tensión. @es
comment: Alajaotis võimsuse, energia, laetuse ja pinge piiride kohta. @et
comment: Kapasiteettia, energiaa, varaustilaa ja jänniterajoja koskeva alajakso. @fi
comment: Sous-section relative à la capacité, à l'énergie, à l'état de charge et aux limites de tension. @fr
comment: Foroinn le haghaidh toillte, fuinnimh, staid luchtaithe, agus teorainneacha voltais. @ga
comment: Pododjeljak za kapacitet, energiju, stanje napunjenosti i ograničenja napona. @hr
comment: A kapacitásra, az energiára, a töltöttségi állapotra és a feszültséghatárokra vonatkozó alfejezet. @hu
comment: Sottosezione per capacità, energia, stato di carica e limiti di tensione. @it
comment: Poskyris apie talpą, energiją, įkrovos būseną ir įtampos ribas. @lt
comment: Apakšsadaļa par jaudu, enerģiju, uzlādes stāvokli un sprieguma ierobežojumiem. @lv
comment: Sub-taqsima għall-kapaċità, l-enerġija, l-istat ta' kariga, u l-limiti tal-vultaġġ. @mt
comment: Subsectie voor capaciteit, energie, laadtoestand en spanningsgrenzen. @nl
comment: Podsekcja dotycząca pojemności, energii, stanu naładowania i limitów napięcia. @pl
comment: Subseção sobre capacidade, energia, estado de carga e limites de tensão. @pt
comment: Subsecțiune pentru capacitate, energie, stare de încărcare și limite de tensiune. @ro
comment: Podčasť pre kapacitu, energiu, stav nabitia a medzné hodnoty napätia. @sk
comment: Pododdelek za zmogljivost, energijo, stanje napolnjenosti in meje napetosti. @sl
comment: Underavsnitt för kapacitet, energi, laddningstillstånd och spänningsgränser. @sv
domain: Performance and Durability
range: Capacity, Energy and Voltage
related match: PropertyValue
related match: AdditionalProductClassificationDetails

Power capability
type: ObjectProperty
governed by: DIN DKE SPEC 99100
source: Source: ESPR - Annex XIII (1)
label: Капацитет на мощността @bg
label: Výkonová schopnost @cs
label: Effektkapacitet @da
label: Leistungsfähigkeit @de
label: Ικανότητα ισχύος @el
label: Capacidad de potencia @es
label: Võimsusvõimekus @et
label: Tehokyky @fi
label: Capacité de puissance @fr
label: Cumas cumhachta @ga
label: Kapacitet snage @hr
label: Teljesítményképesség @hu
label: Capacità di potenza @it
label: Galingumas @lt
label: Jaudas spēja @lv
label: Kapaċità tal-qawwa @mt
label: Vermogenscapaciteit @nl
label: Zdolność mocy @pl
label: Capacidade de potência @pt
label: Capacitate de putere @ro
label: Výkonová schopnosť @sk
label: Zmogljivost moči @sl
comment: Sub-section for power capability, fade, and limits.
comment: Подраздел за мощност, избледняване и ограничения. @bg
comment: Podčást pro výkonové schopnosti, slábnutí a limity. @cs
comment: Delafsnit for effektkapacitet, fade og grænser. @da
comment: Unterabschnitt für Leistungsfähigkeit, Fade und Limits. @de
comment: Υποενότητα για την ικανότητα ισχύος, το fade και τα όρια. @el
comment: Sub-sección de capacidad de potencia, desvanecimiento y límites. @es
comment: Võimsuse, fade'i ja piiride alajaotis. @et
comment: Tehokyvyn, häipymisen ja rajojen alakohta. @fi
comment: Sous-section pour la capacité de puissance, le fade et les limites. @fr
comment: Foroinn do chumas cumhachta, céimnithe, agus teorainneacha. @ga
comment: Pododjeljak za sposobnost snage, blijeđenje i ograničenja. @hr
comment: A teljesítményképesség, a fakulás és a korlátok alfejezete. @hu
comment: Sottosezione per capacità di potenza, dissolvenza e limiti. @it
comment: Galios galimybių, išblukimo ir ribų skyrius. @lt
comment: Apakšsadaļa par jaudas spēju, izbalēšanu un ierobežojumiem. @lv
comment: Sub-taqsima għall-kapaċità tal-qawwa, fade, u limiti. @mt
comment: Subsectie voor vermogenscapaciteit, fade en limieten. @nl
comment: Podsekcja dotycząca zdolności mocy, zanikania i limitów. @pl
comment: Subseção para capacidade de energia, fade e limites. @pt
comment: Sub-secțiune pentru capacitatea de putere, estompare și limite. @ro
comment: Podčasť pre schopnosť napájania, slabnutie a limity. @sk
comment: Pododdelek za zmogljivost moči, pojemek in omejitve. @sl
comment: Underavsnitt för effektkapacitet, fade och gränser. @sv
domain: Performance and Durability
range: Power Capability
related match: additionalProperty
related match: ProductCharacteristic

Round trip energy efficiency and self-discharge
type: ObjectProperty
governed by: DIN DKE SPEC 99100
source: Source: ESPR - Annex XIII (1)
label: Енергийна ефективност при двупосочен цикъл и саморазреждане @bg
label: Energetická účinnost zpáteční cesty a samovybíjení @cs
label: Tur-retur energieffektivitet og selvafladning @da
label: Round-Trip-Energieeffizienz und Selbstentladung @de
label: Ενεργειακή απόδοση ταξιδιού μετ' επιστροφής και αυτοεκφόρτιση @el
label: Eficiencia energética de ida y vuelta y autodescarga @es
label: Edasi-tagasi energiatõhusus ja isetühjenemine @et
label: Kiertomatkan energiatehokkuus ja itsepurkautuminen @fi
label: Efficacité énergétique aller-retour et auto-décharge @fr
label: Éifeachtúlacht fuinnimh turas cruinn agus féin-urscaoileadh @ga
label: Energetska učinkovitost povratnog putovanja i samopražnjenje @hr
label: Körutas energiahatékonyság és önkisülés @hu
label: Efficienza energetica di andata e ritorno e autoscarica @it
label: Dvipusio ciklo energijos vartojimo efektyvumas ir savaiminis išsikrovimas @lt
label: Turp un atpakaļ energoefektivitāte un pašizlāde @lv
label: Effiċjenza tal-enerġija tar-ritorn u awto-ħatt @mt
label: Ronde-trip energie-efficiëntie en zelfontlading @nl
label: Sprawność energetyczna w obie strony i samorozładowanie @pl
label: Eficiência energética de ida e volta e autodescarga @pt
label: Eficiență energetică dus-întors și autodescărcare @ro
label: Energetická účinnosť spiatočnej cesty a samovybíjanie @sk
label: Učinkovitost povratne poti in samopraznjenje @sl
label: Tur-och-retur-energieffektivitet och självurladdning @sv
comment: Sub-section for round trip efficiency and self-discharge.
comment: Подраздел за ефективност при пълен цикъл и саморазреждане. @bg
comment: Pododdíl pro účinnost zpáteční cesty a samovybíjení. @cs
comment: Undersektion for effektivitet tur-retur og selvafladning. @da
comment: Unterabschnitt für die Round-Trip-Effizienz und die Selbstentladung. @de
comment: Υποενότητα για την απόδοση του ταξιδιού μετ' επιστροφής και την αυτοεκφόρτιση. @el
comment: Subsección de eficiencia de ida y vuelta y autodescarga. @es
comment: Edasi-tagasi kasuteguri ja isetühjenemise alajaotis. @et
comment: Kiertotehokkuuden ja itsepurkautumisen alaosio. @fi
comment: Sous-section pour l'efficacité du voyage aller-retour et l'auto-décharge. @fr
comment: For-alt le haghaidh éifeachtúlachta turas cruinn agus féin-urscaoilte. @ga
comment: Pododjeljak za povratnu učinkovitost i samopražnjenje. @hr
comment: Alszakasz a menettérti hatékonyságra és az önkisülésre. @hu
comment: Sottosezione per l'efficienza di andata e ritorno e l'autoscarica. @it
comment: „Į abi puses“ efektyvumo ir savaiminio išsikrovimo poskyris. @lt
comment: Apakšnodaļa par turp un atpakaļ efektivitāti un pašizlādi. @lv
comment: Sub-taqsima għall-effiċjenza ta 'vjaġġ bir-ritorn u awto-kwittanza. @mt
comment: Subsectie voor round trip efficiency en zelfontlading. @nl
comment: Podsekcja dotycząca wydajności w obie strony i samorozładowania. @pl
comment: Subseção para eficiência de ida e volta e autodescarga. @pt
comment: Subsecțiune pentru eficiența dus-întors și autodescărcare. @ro
comment: Pododdiel pre účinnosť spiatočnej cesty a samovybíjanie. @sk
comment: Pododdelek za povratno učinkovitost in samopraznjenje. @sl
comment: Underavsnitt för rundeffektivitet och självurladdning. @sv
domain: Performance and Durability
range: Round Trip Efficiency and Self-Discharge
related match: value

Internal resistance
type: ObjectProperty
governed by: DIN DKE SPEC 99100
source: Source: ESPR - Annex XIII (1)
label: Вътрешно съпротивление @bg
label: Vnitřní odpor @cs
label: Indre modstand @da
label: Innenwiderstand @de
label: Εσωτερική αντίσταση @el
label: Resistencia interna @es
label: Sisetakistus @et
label: Sisäinen vastus @fi
label: Résistance interne @fr
label: Friotaíocht inmheánach @ga
label: Unutarnji otpor @hr
label: Belső ellenállás @hu
label: Resistenza interna @it
label: Vidinė varža @lt
label: Iekšējā pretestība @lv
label: Reżistenza interna @mt
label: Interne weerstand @nl
label: Rezystancja wewnętrzna @pl
label: Resistência interna @pt
label: Rezistență internă @ro
label: Vnútorný odpor @sk
label: Notranja upornost @sl
label: Inre resistans @sv
comment: Sub-section for internal resistance.
comment: Подраздел за вътрешно съпротивление. @bg
comment: Pododdíl pro vnitřní odpor. @cs
comment: Undersektion for intern modstand. @da
comment: Unterabschnitt für den Innenwiderstand. @de
comment: Υποενότητα για την εσωτερική αντίσταση. @el
comment: Subsección de resistencia interna. @es
comment: Sisetakistuse alajaotis. @et
comment: Sisäisen vastuksen alaosio. @fi
comment: Sous-section de la résistance interne. @fr
comment: Fo-alt le haghaidh friotaíocht inmheánach. @ga
comment: Pododjeljak za unutarnji otpor. @hr
comment: Belső ellenállásra vonatkozó alszakasz. @hu
comment: Sottosezione per la resistenza interna. @it
comment: Vidinės varžos poskyris. @lt
comment: Iekšējās pretestības apakšsadaļa. @lv
comment: Sub-taqsima għar-reżistenza interna. @mt
comment: Subsectie voor interne weerstand. @nl
comment: Podsekcja rezystancji wewnętrznej. @pl
comment: Subseção de resistência interna. @pt
comment: Subsecțiune pentru rezistența internă. @ro
comment: Podčasť pre vnútorný odpor. @sk
comment: Pododdelek za notranjo upornost. @sl
comment: Underavsnitt för inre motstånd. @sv
domain: Performance and Durability
range: Internal Resistance
related match: PropertyValue
related match: ProductCharacteristic

Battery lifetime
type: ObjectProperty
governed by: DIN DKE SPEC 99100
source: Source: ESPR - Annex XIII (1)
label: Живот на батерията @bg
label: Životnost baterie @cs
label: Batteriets levetid @da
label: Batterielebensdauer @de
label: Διάρκεια ζωής μπαταρίας @el
label: Vida útil de la batería @es
label: Aku eluiga @et
label: Akun käyttöikä @fi
label: Durée de vie de la batterie @fr
label: Saolré an cheallraí @ga
label: Vijek trajanja baterije @hr
label: Az akkumulátor élettartama @hu
label: Durata della batteria @it
label: Baterijos veikimo laikas @lt
label: Baterijas kalpošanas laiks @lv
label: Ħajja tal-batterija @mt
label: Levensduur van de batterij @nl
label: Żywotność baterii @pl
label: Vida útil da bateria @pt
label: Durata de viață a bateriei @ro
label: Životnosť batérie @sk
label: Življenjska doba baterije @sl
label: Batteriets livslängd @sv
comment: Sub-section for battery lifetime in years and cycles.
comment: Подраздел за живота на батерията в години и цикли. @bg
comment: Pododdíl pro životnost baterie v letech a cyklech. @cs
comment: Undersektion for batterilevetid i år og cyklusser. @da
comment: Unterabschnitt für die Batterielebensdauer in Jahren und Zyklen. @de
comment: Υποενότητα για τη διάρκεια ζωής της μπαταρίας σε έτη και κύκlus. @el
comment: Subsección sobre la vida útil de la batería en años y ciclos. @es
comment: Aku eluea alajaotis aastates ja tsüklites. @et
comment: Akun käyttöiän alajakso vuosina ja jaksoina. @fi
comment: Sous-section pour la durée de vie de la batterie en années et en cycles. @fr
comment: For-roinn ar feadh shaolré na gceallraí i mblianta agus i dtimthriallta. @ga
comment: Pododjeljak za trajanje baterije u godinama i ciklusima. @hr
comment: Az akkumulátor élettartamára vonatkozó alfejezet években és ciklusokban. @hu
comment: Sottosezione per la durata della batteria in anni e cicli. @it
comment: Baterijos veikimo trukmės metais ir ciklais poskyris. @lt
comment: Apakšsadaļa par akumulatora kalpošanas laiku gados un ciklos. @lv
comment: Sub-taqsima għall-ħajja tal-batterija fis-snin u ċ-ċikli. @mt
comment: Subsectie voor de levensduur van de batterij in jaren en cycli. @nl
comment: Podsekcja dotycząca żywotności baterii w latach i cyklach. @pl
comment: Subseção para a vida útil da bateria em anos e ciclos. @pt
comment: Subsecțiune pentru durata de viață a bateriei în ani și cicluri. @ro
comment: Podčasť pre životnosť batérie v rokoch a cykloch. @sk
comment: Pododdelek za življenjsko dobo baterije v letih in ciklih. @sl
comment: Underavsnitt för batteriets livslängd i år och cykler. @sv
domain: Performance and Durability
range: Battery Lifetime
related match: QuantitativeValue

Temperature conditions
type: ObjectProperty
governed by: DIN DKE SPEC 99100
source: Source: ESPR - Annex XIII (1)
label: Температурни условия @bg
label: Teplotní podmínky @cs
label: Temperaturforhold @da
label: Temperaturbedingungen @de
label: Συνθήκες θερμοκρασίας @el
label: Condiciones de temperatura @es
label: Temperatuuritingimused @et
label: Lämpötilaolosuhteet @fi
label: Conditions de température @fr
label: Dálaí Teochta @ga
label: Temperaturni uvjeti @hr
label: Hőmérsékleti viszonyok @hu
label: Condizioni di temperatura @it
label: Temperatūros sąlygos @lt
label: Temperatūras apstākļi @lv
label: Kundizzjonijiet tat-temperatura @mt
label: Temperatuur condities @nl
label: Warunki temperaturowe @pl
label: Condições de temperatura @pt
label: Condiții de temperatură @ro
label: Teplotné podmienky @sk
label: Temperaturne razmere @sl
label: Temperaturförhållanden @sv
comment: Sub-section for temperature conditions and time in extreme temperatures.
comment: Подраздел за температурни условия и време при екстремни температури. @bg
comment: Pododdíl pro teplotní podmínky a čas v extrémních teplotách. @cs
comment: Underafsnit for temperaturforhold og tid i ekstreme temperaturer. @da
comment: Unterabschnitt für Temperaturbedingungen und Zeit bei extremen Temperaturen. @de
comment: Υποενότητα για τις συνθήκες θερμοκρασίας και το χρόνο σε ακραίες θερμοκρασίες. @el
comment: Subsección de condiciones de temperatura y tiempo en temperaturas extremas. @es
comment: Alajaotis temperatuuritingimuste ja äärmuslikes temperatuurides veedetud aja kohta. @et
comment: Lämpötilaolosuhteita ja äärilämpötiloissa vietettyä aikaa koskeva alakohta. @fi
comment: Sous-section relative aux conditions de température et au temps passé à des températures extrêmes. @fr
comment: Foroinn do dhálaí teochta agus am i dteochtaí foircneacha. @ga
comment: Pododjeljak za temperaturne uvjete i vrijeme u ekstremnim temperaturama. @hr
comment: A hőmérsékleti viszonyokra és a szélsőséges hőmérsékleten töltött időre vonatkozó alszakasz. @hu
comment: Sottosezione per le condizioni di temperatura e il tempo a temperature estreme. @it
comment: Poskyris apie temperatūros sąlygas ir laiką esant ekstremalioms temperatūroms. @lt
comment: Apakšsadaļa par temperatūras apstākļiem un laiku ekstremālās temperatūrās. @lv
comment: Subtaqsima għall-kundizzjonijiet tat-temperatura u l-ħin f'temperaturi estremi. @mt
comment: Subsectie voor temperatuursomstandigheden en tijd in extreme temperaturen. @nl
comment: Podsekcja dotycząca warunków temperaturowych i czasu w ekstremalnych temperaturach. @pl
comment: Subseção para condições de temperatura e tempo em temperaturas extremas. @pt
comment: Subsecțiune pentru condițiile de temperatură și timpul la temperaturi extreme. @ro
comment: Podčasť pre teplotné podmienky a čas v extrémnych teplotách. @sk
comment: Pododdelek za temperaturne pogoje in čas v ekstremnih temperaturah. @sl
comment: Underavsnitt för temperaturförhållanden och tid i extrema temperaturer. @sv
domain: Performance and Durability
range: Temperature Conditions
related match: PropertyValue

Negative events and accidents
type: ObjectProperty
governed by: DIN DKE SPEC 99100
source: Source: ESPR - Annex XIII (1)
label: Отрицателни събития и инциденти @bg
label: Negativní události a nehody @cs
label: Negative hændelser og ulykker @da
label: Negative Ereignisse und Unfälle @de
label: Αρνητικά γεγονότα και ατυχήματα @el
label: Eventos negativos y accidentes @es
label: Negatiivsed sündmused ja õnnetused @et
label: Negatiiviset tapahtumat ja onnettomuudet @fi
label: Événements négatifs et accidents @fr
label: Teagmhais dhiúltacha agus timpistí @ga
label: Negativni događaji i nesreće @hr
label: Negatív események és balesetek @hu
label: Eventi negativi e incidenti @it
label: Neigiami įvykiai ir nelaimingi atsitikimai @lt
label: Negatīvi notikumi un nelaimes gadījumi @lv
label: Avvenimenti negattivi u inċidenti @mt
label: Negatieve gebeurtenissen en ongevallen @nl
label: Negatywne zdarzenia i wypadki @pl
label: Eventos negativos e acidentes @pt
label: Evenimente negative și accidente @ro
label: Negatívne udalosti a nehody @sk
label: Negativni dogodki in nesreče @sl
label: Negativa händelser och olyckor @sv
comment: Sub-section for negative events and accidents.
comment: Подраздел за негативни събития и инциденти. @bg
comment: Pododdíl pro negativní události a nehody. @cs
comment: Underafsnit for negative hændelser og ulykker. @da
comment: Unterabschnitt für negative Ereignisse und Unfälle. @de
comment: Υποενότητα για αρνητικά γεγονότα και ατυχήματα. @el
comment: Subsección de eventos negativos y accidentes. @es
comment: Alajaotis negatiivsete sündmuste ja õnnetuste kohta. @et
comment: Negatiivisia tapahtumia ja onnettomuuksia koskeva alakohta. @fi
comment: Sous-section relative aux événements négatifs et aux accidents. @fr
comment: Foroinn do theagmhais dhiúltacha agus timpistí. @ga
comment: Pododjeljak za negativne događaje i nesreće. @hr
comment: A negatív eseményekre és balesetekre vonatkozó alszakasz. @hu
comment: Sottosezione per eventi negativi e incidenti. @it
comment: Poskyris apie neigiamus įvykius ir nelaimingus atsitikimus. @lt
comment: Apakšsadaļa par negatīviem notikumiem un nelaimes gadījumiem. @lv
comment: Subtaqsima għal avvenimenti negattivi u inċidenti. @mt
comment: Subsectie voor negatieve gebeurtenissen en ongevallen. @nl
comment: Podsekcja dotycząca negatywnych zdarzeń i wypadków. @pl
comment: Subseção para eventos negativos e acidentes. @pt
comment: Subsecțiune pentru evenimente negative și accidente. @ro
comment: Podčasť pre negatívne udalosti a nehody. @sk
comment: Pododdelek za negativne dogodke in nesreče. @sl
comment: Underavsnitt för negativa händelser och olyckor. @sv
domain: Performance and Durability
range: Negative Events and Accidents
related match: Event

Rated capacity
type: DatatypeProperty
governed by: DIN DKE SPEC 99100
unit: AmpereHour
source: Source: ESPR - Annex XIII (1)
label: Номинален капацитет @bg
label: Jmenovitá kapacita @cs
label: Nominel kapacitet @da
label: Nennkapazität @de
label: Ονομαστική χωρητικότητα @el
label: Capacidad nominal @es
label: Nimivõimsus @et
label: Nimelliskapasiteetti @fi
label: Capacité nominale @fr
label: Toilleadh rátáilte @ga
label: Nazivni kapacitet @hr
label: Névleges kapacitás @hu
label: Capacità nominale @it
label: Nominali talpa @lt
label: Nominālā ietilpība @lv
label: Kapaċità nominali @mt
label: Nominale capaciteit @nl
label: Pojemność znamionowa @pl
label: Capacidade nominal @pt
label: Capacitate nominală @ro
label: Menovitá kapacita @sk
label: Nazivna zmogljivost @sl
label: Nominell kapacitet @sv
comment: The total number of ampere-hours (Ah) that can be withdrawn from a fully charged battery under reference conditions.
comment: Общият брой амперчасове (Ah), които могат да бъдат изтеглени от напълно заредена батерия при референтни условия. @bg
comment: Celkový počet ampérhodin (Ah), které lze odebrat z plně nabité baterie za referenčních podmínek. @cs
comment: Det samlede antal amperetimer (Ah), der kan trækkes fra et fuldt opladet batteri under referencebetingelser. @da
comment: Die Gesamtzahl der Amperestunden (Ah), die einer voll aufgeladenen Batterie unter Referenzbedingungen entnommen werden können. @de
comment: Ο συνολικός αριθμός αμπερωρίων (Ah) που μπορούν να αναληφθούν από μια πλήρως φορτισμένη μπαταρία υπό συνθήκες αναφοράς. @el
comment: El número total de amperios-hora (Ah) que se pueden extraer de una batería completamente cargada en condiciones de referencia. @es
comment: Ampertundide (Ah) koguarv, mida saab täielikult laetud akust võrdlustingimustes välja võtta. @et
comment: Täyteen ladatusta akusta vertailuolosuhteissa purettavissa oleva ampeerituntien (Ah) kokonaismäärä. @fi
comment: Le nombre total d'ampères-heures (Ah) qui peuvent être retirés d'une batterie complètement chargée dans des conditions de référence. @fr
comment: Líon iomlán na n-aimpéar-uair an chloig (Ah) is féidir a aistarraingt as ceallraí lánluchtaithe faoi choinníollacha tagartha. @ga
comment: Ukupan broj ampersati (Ah) koji se mogu povući iz potpuno napunjene baterije pod referentnim uvjetima. @hr
comment: A teljesen feltöltött akkumulátorból referencia-körülmények között kivehető amperórák (Ah) teljes száma. @hu
comment: Il numero totale di ampere-ora (Ah) che possono essere prelevati da una batteria completamente carica in condizioni di riferimento. @it
comment: Bendras ampervalandžių (Ah) skaičius, kurį galima iškrauti iš visiškai įkrauto akumuliatoriaus standartinėmis sąlygomis. @lt
comment: Kopējais ampērstundu (Ah) skaits, ko var izņemt no pilnībā uzlādēta akumulatora atsauces apstākļos. @lv
comment: In-numru totali ta' ampere-siegħat (Ah) li jistgħu jiġu rtirati minn batterija kompletament iċċarġjata f'kundizzjonijiet ta' referenza. @mt
comment: Het totale aantal ampère-uren (Ah) dat onder referentieomstandigheden aan een volledig opgeladen batterij kan worden onttrokken. @nl
comment: Całkowita liczba amperogodzin (Ah), które można pobrać z w pełni naładowanego akumulatora w warunkach referencyjnych. @pl
comment: O número total de amperes-hora (Ah) que podem ser retirados de uma bateria totalmente carregada em condições de referência. @pt
comment: Numărul total de amperi-oră (Ah) care pot fi extrași dintr-o baterie complet încărcată în condiții de referință. @ro
comment: Celkový počet ampérhodín (Ah), ktoré je možné odobrať z úplne nabitej batérie za referenčných podmienok. @sk
comment: Skupno število amperskih ur (Ah), ki jih je mogoče umakniti iz popolnoma napolnjene baterije pod referenčnimi pogoji. @sl
comment: Det totala antalet amperetimmar (Ah) som kan tas ut från ett fulladdat batteri under referensförhållanden. @sv
domain: Capacity, Energy and Voltage
range: xsd:double
related match: PropertyValue
related match: AdditionalProductClassificationDetails

Remaining capacity
type: DatatypeProperty
governed by: DIN DKE SPEC 99100
unit: AmpereHour
source: Source: ESPR - Annex XIII (1)
label: Оставащ капацитет @bg
label: Zbývající kapacita @cs
label: Resterende kapacitet @da
label: Verbleibende Kapazität @de
label: Εναπομένουσα χωρητικότητα @el
label: Capacidad restante @es
label: Järelejäänud võimsus @et
label: Jäljellä oleva kapasiteetti @fi
label: Capacité restante @fr
label: Toilleadh fágtha @ga
label: Preostali kapacitet @hr
label: Fennmaradó kapacitás @hu
label: Capacità residua @it
label: Likutinė talpa @lt
label: Atlikusī ietilpība @lv
label: Kapaċità li fadal @mt
label: Resterende capaciteit @nl
label: Pozostała pojemność @pl
label: Capacidade restante @pt
label: Capacitate rămasă @ro
label: Zostávajúca kapacita @sk
label: Preostala zmogljivost @sl
label: Återstående kapacitet @sv
comment: The corresponding in-use data attribute to rated capacity, as information on the state of health of the battery.
comment: Съответният атрибут за данни в употреба към номиналния капацитет, като информация за състоянието на изправност на батерията. @bg
comment: Odpovídající datový atribut jmenovité kapacity v provozu, jako informace o stavu baterie. @cs
comment: Det tilsvarende ibrugtagne dataattribut til nominel kapacitet, som information om batteriets sundhedstilstand. @da
comment: Das entsprechende Nutzungsdatenattribut zur Nennkapazität als Information über den Gesundheitszustand der Batterie. @de
comment: Το αντίστοιχο χαρακτηριστικό δεδομένων σε χρήση με την ονομαστική χωρητικότητα, ως πληροφορία για την κατάσταση της υγείας της μπαταρίας. @el
comment: El atributo de datos en uso correspondiente a la capacidad nominal, como información sobre el estado de salud de la batería. @es
comment: Vastav kasutusandmete atribuut nimivõimsusele, teabena aku tervisliku seisundi kohta. @et
comment: Vastaava käytössä oleva data-attribuutti nimelliskapasiteetille, joka kertoo akun kunnosta. @fi
comment: L'attribut de données en cours d'utilisation correspondant à la capacité nominale, en tant qu'information sur l'état de santé de la batterie. @fr
comment: An tréith sonraí comhfhreagrach in úsáid do thoilleadh rátáilte, mar fhaisnéis ar staid sláinte na ceallraí. @ga
comment: Odgovarajući atribut podataka u upotrebi nazivnom kapacitetu, kao informacija o stanju ispravnosti baterije. @hr
comment: A névleges kapacitásnak megfelelő, használatban lévő adatattribútum, amely az akkumulátor állapotára vonatkozó információ. @hu
comment: L'attributo di dati in uso corrispondente alla capacità nominale, come informazione sullo stato di salute della batteria. @it
comment: Atitinkamas naudojamų duomenų atributas, atitinkantis vardinę talpą, kaip informacija apie akumuliatoriaus būklę. @lt
comment: Atbilstošais lietošanas datu atribūts nominālajai ietilpībai kā informācija par akumulatora stāvokli. @lv
comment: L-attribut tad-dejta korrispondenti fl-użu għall-kapaċità nominali, bħala informazzjoni dwar l-istat tas-saħħa tal-batterija. @mt
comment: Het overeenkomstige in-gebruik data-attribuut voor de nominale capaciteit, als informatie over de staat van de batterij. @nl
comment: Odpowiedni atrybut danych eksploatacyjnych dla pojemności znamionowej, jako informacja o stanie technicznym akumulatora. @pl
comment: O atributo de dados em uso correspondente à capacidade nominal, como informação sobre o estado de saúde da bateria. @pt
comment: Atributul de date în uz corespunzător capacității nominale, ca informații privind starea de sănătate a bateriei. @ro
comment: Zodpovedajúci atribút údajov o menovitej kapacite v prevádzke ako informácia o stave batérie. @sk
comment: Ustrezen atribut podatkov v uporabi nazivni zmogljivosti kot informacija o stanju baterije. @sl
comment: Motsvarande dataattribut i användning till nominell kapacitet, som information om batteriets hälsotillstånd. @sv
domain: Capacity, Energy and Voltage
range: xsd:double
related match: PropertyValue
related match: AdditionalProductClassificationDetails

Capacity fade
type: DatatypeProperty
governed by: DIN DKE SPEC 99100
unit: Percent
source: Source: ESPR - Annex XIII (1)
label: Загуба на капацитет @bg
label: Úbytek kapacity @cs
label: Kapacitetstab @da
label: Kapazitätsabfall @de
label: Εξασθένιση χωρητικότητας @el
label: Pérdida de capacidad @es
label: Võimsuse vähenemine @et
label: Kapasiteetin heikkeneminen @fi
label: Perte de capacité @fr
label: Laghdú toillte @ga
label: Gubitak kapaciteta @hr
label: Kapacitáscsökkenés @hu
label: Perdita di capacità @it
label: Talpos sumažėjimas @lt
label: Kapacitātes zudums @lv
label: Tnaqqis fil-kapaċità @mt
label: Capaciteitsverlies @nl
label: Zanik pojemności @pl
label: Perda de capacidade @pt
label: Pierderea capacității @ro
label: Úbytok kapacity @sk
label: Izguba zmogljivosti @sl
label: Kapacitetsförlust @sv
comment: The decrease over time and upon usage in the amount of charge that a battery can deliver at the rated voltage, with respect to the original rated capacity.
comment: Намаляването с течение на времето и при употреба на количеството заряд, което батерията може да достави при номиналното напрежение, по отношение на първоначалния номинален капацитет. @bg
comment: Pokles množství náboje, které je baterie schopna dodat při jmenovitém napětí, v průběhu času a při používání v porovnání s původní jmenovitou kapacitou. @cs
comment: Faldet over tid og ved brug i den mængde ladning, som et batteri kan levere ved den nominelle spænding, i forhold til den oprindelige nominelle kapacitet. @da
comment: Die Abnahme der Ladungsmenge, die eine Batterie bei Nennspannung im Laufe der Zeit und bei Gebrauch abgeben kann, bezogen auf die ursprüngliche Nennkapazität. @de
comment: Η μείωση με την πάροδο του χρόνου και κατά τη χρήση της ποσότητας φορτίου που μπορεί να παραδώσει μια μπαταρία στην ονομαστική τάση, σε σχέση με την αρχική ονομαστική χωρητικότητα. @el
comment: La disminución con el tiempo y el uso de la cantidad de carga que una batería puede entregar a la tensión nominal, con respecto a la capacidad nominal original. @es
comment: Laengu hulga vähenemine aja jooksul ja kasutamisel, mida aku suudab nimipingel anda, võrreldes esialgse nimivõimsusega. @et
comment: Akun nimellisjännitteellä toimittaman varauksen määrän pieneneminen ajan myötä ja käytön aikana suhteessa alkuperäiseen nimelliskapasiteettiin. @fi
comment: La diminution dans le temps et à l'usage de la quantité de charge qu'une batterie peut fournir à la tension nominale, par rapport à la capacité nominale d'origine. @fr
comment: An laghdú le himeacht ama agus ar úsáid sa mhéid luchta is féidir le ceallraí a sheachadadh ag an voltas rátáilte, maidir leis an toilleadh rátáilte bunaidh. @ga
comment: Smanjenje tijekom vremena i nakon uporabe količine naboja koju baterija može isporučiti pri nazivnom naponu u odnosu na izvorni nazivni kapacitet. @hr
comment: Az akkumulátor által a névleges feszültségen leadható töltésmennyiség idővel és használat során bekövetkező csökkenése az eredeti névleges kapacitáshoz képest. @hu
comment: La diminuzione nel tempo e con l'uso della quantità di carica che una batteria può erogare alla tensione nominale, rispetto alla capacità nominale originale. @it
comment: Akumuliatoriaus tiekiamos įkrovos kiekio esant vardinei įtampai sumažėjimas laikui bėgant ir naudojant, palyginti su pradine vardine talpa. @lt
comment: Laika gaitā un lietošanas laikā samazinās lādiņa daudzums, ko akumulators var piegādāt pie nominālā sprieguma, attiecībā pret sākotnējo nominālo kapacitāti. @lv
comment: It-tnaqqis maż-żmien u mal-użu fl-ammont ta 'ċarġ li batterija tista' tagħti fil-vultaġġ nominali, fir-rigward tal-kapaċità nominali oriġinali. @mt
comment: De afname in de loop van de tijd en bij gebruik van de hoeveelheid lading die een batterij kan leveren bij de nominale spanning, ten opzichte van de oorspronkelijke nominale capaciteit. @nl
comment: Zmniejszenie się z upływem czasu i w trakcie użytkowania ilości ładunku, jaką akumulator może dostarczyć przy napięciu znamionowym, w stosunku do pierwotnej pojemności znamionowej. @pl
comment: A diminuição ao longo do tempo e com o uso da quantidade de carga que uma bateria pode fornecer na tensão nominal, em relação à capacidade nominal original. @pt
comment: Scăderea în timp și la utilizare a cantității de sarcină pe care o baterie o poate furniza la tensiunea nominală, în raport cu capacitatea nominală inițială. @ro
comment: Zníženie množstva náboja v priebehu času a pri používaní, ktoré môže batéria dodávať pri menovitom napätí, v porovnaní s pôvodnou menovitou kapacitou. @sk
comment: Zmanjšanje količine naboja, ki jo lahko baterija odda pri nazivni napetosti, sčasoma in ob uporabi glede na prvotno nazivno zmogljivost. @sl
comment: Minskningen över tid och vid användning av den mängd laddning som ett batteri kan leverera vid märkspänningen, med avseende på den ursprungliga nominella kapaciteten. @sv
domain: Capacity, Energy and Voltage
range: xsd:double
related match: PropertyValue
related match: AdditionalProductClassificationDetails

Certified usable battery energy
type: DatatypeProperty
unit: KilowattHour
source: https://www.dinmedia.de/en/technical-rule/din-dke-spec-99100/385692321
label: Сертифицирана използваема енергия на батерията @bg
label: Certifikovaná využitelná energie baterie @cs
label: Certificeret brugbar batterienergi @da
label: Zertifizierte nutzbare Batterieenergie @de
label: Πιστοποιημένη χρησιμοποιήσιμη ενέργεια μπαταρίας @el
label: Energía de batería utilizable certificada @es
label: Sertifitseeritud kasutatav akuenergia @et
label: Sertifioitu käyttökelpoinen akkuenergia @fi
label: Énergie de batterie certifiée utilisable @fr
label: Fuinneamh ceallraí inúsáidte deimhnithe @ga
label: Certificirana iskoristiva energija baterije @hr
label: Tanúsítottan felhasználható akkumulátor-energia @hu
label: Energia della batteria certificata utilizzabile @it
label: Sertifikuota tinkama naudoti akumuliatoriaus energija @lt
label: Sertificēta lietojama akumulatora enerģija @lv
label: Enerġija tal-batterija użabbli ċċertifikata @mt
label: Gecertificeerde bruikbare batterij-energie @nl
label: Certyfikowana użyteczna energia baterii @pl
label: Energia de bateria utilizável certificada @pt
label: Energie certificată utilizabilă a bateriei @ro
label: Certifikovaná využiteľná energia batérie @sk
label: Certificirana uporabna energija baterije @sl
label: Certifierad användbar batterienergi @sv
comment: The usable battery energy according to the procedure in the UN GTR No 22 as determined during the certification.
comment: Използваемата енергия на батерията съгласно процедурата в UN GTR № 22, определена по време на сертифицирането. @bg
comment: Využitelná energie baterie podle postupu v UN GTR č. 22, jak byla stanovena během certifikace. @cs
comment: Den brugbare batterienergi i henhold til proceduren i FN's GTR nr. 22 som bestemt under certificeringen. @da
comment: Die nutzbare Batterieenergie gemäß dem Verfahren im UN GTR Nr. 22, wie sie bei der Zertifizierung ermittelt wurde. @de
comment: Η χρησιμοποιήσιμη ενέργεια της μπαταρίας σύμφωνα με τη διαδικασία του UN GTR No 22, όπως καθορίστηκε κατά την πιστοποίηση. @el
comment: La energía utilizable de la batería según el procedimiento del GTR n.º 22 de las Naciones Unidas, determinada durante la certificación. @es
comment: Kasutatav akuenergia vastavalt ÜRO GTR nr 22 protseduurile, mis on kindlaks määratud sertifitseerimise käigus. @et
comment: Käyttökelpoinen akkuenergia YK:n maailmanlaajuisen teknisen säännön nro 22 mukaisen menettelyn mukaisesti sertifioinnin aikana määritettynä. @fi
comment: L'énergie de batterie utilisable conformément à la procédure du GTR n° 22 de l'ONU, telle que déterminée lors de la certification. @fr
comment: An fuinneamh ceallraí inúsáidte de réir an nós imeachta in UN GTR Uimh. 22 mar a cinneadh le linn an deimhniúcháin. @ga
comment: Iskoristiva energija baterije u skladu s postupkom iz UN GTR-a br. 22 kako je utvrđeno tijekom certifikacije. @hr
comment: A felhasználható akkumulátor-energia az ENSZ GTR 22. számú eljárása szerint, a tanúsítás során meghatározottak szerint. @hu
comment: L'energia utilizzabile della batteria secondo la procedura del GTR ONU n. 22, determinata durante la certificazione. @it
comment: Naudojama akumuliatoriaus energija pagal JT GTR Nr. 22 procedūrą, nustatytą sertifikavimo metu. @lt
comment: Izmantojamā akumulatora enerģija saskaņā ar procedūru ANO GTR Nr. 22, kas noteikta sertifikācijas laikā. @lv
comment: L-enerġija użabbli tal-batterija skont il-proċedura fir-Regolament Tekniku Globali (GTR) tan-NU Nru 22 kif determinat matul iċ-ċertifikazzjoni. @mt
comment: De bruikbare batterij-energie volgens de procedure in de UN GTR nr. 22, zoals vastgesteld tijdens de certificering. @nl
comment: Użyteczna energia akumulatora zgodnie z procedurą zawartą w regulaminie ONZ GTR nr 22, określona podczas certyfikacji. @pl
comment: A energia utilizável da bateria de acordo com o procedimento do GTR n.º 22 da ONU, conforme determinado durante a certificação. @pt
comment: Energia utilizabilă a bateriei în conformitate cu procedura din GTR nr. 22 al ONU, astfel cum a fost stabilită în timpul certificării. @ro
comment: Využiteľná energia batérie podľa postupu v predpise UN GTR č. 22, ako sa stanovila počas certifikácie. @sk
comment: Uporabna energija baterije v skladu s postopkom iz UN GTR št. 22, določena med certificiranjem. @sl
comment: Den användbara batterienergin enligt förfarandet i FN:s globala tekniska föreskrift nr 22, fastställd under certifieringen. @sv
domain: Capacity, Energy and Voltage
range: xsd:double
related match: value

Remaining usable battery energy
type: DatatypeProperty
unit: KilowattHour
source: https://www.dinmedia.de/en/technical-rule/din-dke-spec-99100/385692321
label: Оставаща използваема енергия на батерията @bg
label: Zbývající využitelná energie baterie @cs
label: Resterende brugbar batterienergi @da
label: Verbleibende nutzbare Batterieenergie @de
label: Εναπομένουσα χρησιμοποιήσιμη ενέργεια μπαταρίας @el
label: Energía de batería utilizable restante @es
label: Järelejäänud kasutatav akuenergia @et
label: Jäljellä oleva käyttökelpoinen akkuenergia @fi
label: Énergie de batterie utilisable restante @fr
label: Fuinneamh ceallraí inúsáidte fágtha @ga
label: Preostala iskoristiva energija baterije @hr
label: Fennmaradó felhasználható akkumulátor-energia @hu
label: Energia residua utilizzabile della batteria @it
label: Likutinė tinkama naudoti akumuliatoriaus energija @lt
label: Atlikusī lietojamā akumulatora enerģija @lv
label: Enerġija tal-batterija li tista' tintuża li fadal @mt
label: Resterende bruikbare batterij-energie @nl
label: Pozostała użyteczna energia baterii @pl
label: Energia de bateria utilizável restante @pt
label: Energie rămasă utilizabilă a bateriei @ro
label: Zostávajúca využiteľná energia batérie @sk
label: Preostala uporabna energija baterije @sl
label: Återstående användbar batterienergi @sv
comment: The usable battery energy at the present point in the lifetime of a battery.
comment: Използваемата енергия на батерията в настоящия момент от живота на батерията. @bg
comment: Využitelná energie baterie v současném okamžiku životnosti baterie. @cs
comment: Den brugbare batterienergi på det nuværende tidspunkt i batteriets levetid. @da
comment: Die nutzbare Batterieenergie zum jetzigen Zeitpunkt der Batterielebensdauer. @de
comment: Η χρησιμοποιήσιμη ενέργεια της μπαταρίας στο παρόν σημείο της διάρκειας ζωής μιας μπαταρίας. @el
comment: La energía utilizable de la batería en el momento actual de la vida útil de una batería. @es
comment: Kasutatav akuenergia aku eluea praegusel hetkel. @et
comment: Akun käyttökelpoinen energia akun elinkaaren nykyhetkellä. @fi
comment: L'énergie de batterie utilisable au moment présent de la durée de vie d'une batterie. @fr
comment: An fuinneamh ceallraí inúsáidte ag an bpointe reatha i saolré ceallraí. @ga
comment: Iskoristiva energija baterije u sadašnjem trenutku životnog vijeka baterije. @hr
comment: Az akkumulátor felhasználható energiája az akkumulátor élettartamának jelenlegi pontján. @hu
comment: L'energia utilizzabile della batteria nel punto attuale della vita di una batteria. @it
comment: Naudojama akumuliatoriaus energija dabartiniu akumuliatoriaus naudojimo моментu. @lt
comment: Izmantojamā akumulatora enerģija pašreizējā akumulatora kalpošanas laikā. @lv
comment: L-enerġija tal-batterija li tista' tintuża fil-punt preżenti fil-ħajja ta' batterija. @mt
comment: De bruikbare batterij-energie op het huidige punt in de levensduur van een batterij. @nl
comment: Użyteczna energia akumulatora w bieżącym momencie jego żywotności. @pl
comment: A energia utilizável da bateria no ponto atual da vida útil de uma bateria. @pt
comment: Energia utilizabilă a bateriei la momentul actual al duratei de viață a unei baterii. @ro
comment: Využiteľná energia batérie v súčasnom bode životnosti batérie. @sk
comment: Preostala uporabna energija baterije na sedanji točki življenjske dobe baterije. @sl
comment: Den användbara batterienergin vid den nuvarande tidpunkten i ett batteris livslängd. @sv
domain: Capacity, Energy and Voltage
range: xsd:double
related match: PropertyValue
related match: AdditionalProductClassificationDetails

State of certified energy (SOCE)
type: DatatypeProperty
governed by: DIN DKE SPEC 99100
unit: Percent
source: Source: ESPR - Annex XIII (1)
label: Състояние на сертифицираната енергия (SOCE) @bg
label: Stav certifikované energie (SOCE) @cs
label: Status for certificeret energi (SOCE) @da
label: Zustand der zertifizierten Energie (SOCE) @de
label: Κατάσταση πιστοποιημένης ενέργειας (SOCE) @el
label: Estado de la energía certificada (SOCE) @es
label: Sertifitseeritud energia olek (SOCE) @et
label: Sertifioidun energian tila (SOCE) @fi
label: État de l'énergie certifiée (SOCE) @fr
label: Staid an fhuinnimh dheimhnithe (SOCE) @ga
label: Stanje certificirane energije (SOCE) @hr
label: A tanúsított energia állapota (SOCE) @hu
label: Stato dell'energia certificata (SOCE) @it
label: Sertifikuotos energijos būsena (SOCE) @lt
label: Sertificētās enerģijas stāvoklis (SOCE) @lv
label: Stat tal-enerġija ċċertifikata (SOCE) @mt
label: Staat van gecertificeerde energie (SOCE) @nl
label: Stan certyfikowanej energii (SOCE) @pl
label: Estado da energia certificada (SOCE) @pt
label: Starea energiei certificate (SOCE) @ro
label: Stav certifikovanej energie (SOCE) @sk
label: Tillstånd för certifierad energi (SOCE) @sv
comment: The measured or on-board usable battery energy performance at a specific point in its lifetime, expressed as a percentage of the certified usable battery energy.
comment: Измерената или бордовата използваема енергийна производителност на батерията в определен момент от нейния живот, изразена като процент от сертифицираната използваема енергия на батерията. @bg
comment: Změřený nebo palubní využitelný energetický výkon baterie v určitém okamžiku její životnosti, vyjádřený jako procento certifikované využitelné energie baterie. @cs
comment: Den målte eller indbyggede brugbare batterienergipræstation på et bestemt tidspunkt i dets levetid, udtrykt som en procentdel af den certificerede brugbare batterienergi. @da
comment: Die gemessene oder an Bord nutzbare Batterieenergieleistung zu einem bestimmten Zeitpunkt ihrer Lebensdauer, ausgedrückt als Prozentsatz der zertifizierten nutzbaren Batterieenergie. @de
comment: Η μετρούμενη ή ενσωματωμένη αξιοποιήσιμη ενεργειακή απόδοση της μπαταρίας σε ένα συγκεκριμένο σημείο της διάρκειας ζωής της, εκφρασμένη ως ποσοστό της πιστοποιημένης αξιοποιήσιμης ενέργειας της μπαταρίας. @el
comment: El rendimiento energético medido o utilizable a bordo de la batería en un punto específico de su vida útil, expresado como un porcentaje de la energía utilizable certificada de la batería. @es
comment: Mõõdetud või parda kasutatav aku energiatõhusus teatud ajahetkel selle eluea jooksul, väljendatuna protsendina sertifitseeritud kasutatavast akuenergiast. @et
comment: Mitattu tai aluksella käytettävissä oleva akun energiatehokkuus tiettynä ajankohtana sen elinkaaren aikana, ilmaistuna prosentteina sertifioidusta käyttökelpoisesta akkuenergiasta. @fi
comment: La performance énergétique mesurée ou utilisable à bord de la batterie à un moment précis de sa durée de vie, exprimée en pourcentage de l'énergie de batterie utilisable certifiée. @fr
comment: An fheidhmíocht fuinnimh ceallraí intomhaiste nó ar bord inúsáidte ag pointe sonrach ina saolré, arna shloinneadh mar chéatadán den fhuinneamh ceallraí inúsáidte deimhnithe. @ga
comment: Izmjerena ili ugrađena iskoristiva energetska učinkovitost baterije u određenom trenutku njezina životnog vijeka, izražena kao postotak certificirane iskoristive energije baterije. @hr
comment: A mért vagy a fedélzeten használható akkumulátor-teljesítmény élettartamának egy adott pontján, a tanúsított felhasználható akkumulátor-energia százalékában kifejezve. @hu
comment: Le prestazioni energetiche della batteria misurate o utilizzabili a bordo in un punto specifico della sua vita, espresse come percentuale dell'energia della batteria utilizzabile certificata. @it
comment: Išmatuotas arba laive naudojamas akumuliatoriaus energijos vartojimo efektyvumas tam tikru jo eksploatavimo моментu, išreikštas procentais nuo sertifikuotos tinkamos naudoti akumuliatoriaus energijos. @lt
comment: Izmērītā vai iebūvētā lietojamā akumulatora enerģētiskā veiktspēja noteiktā tā kalpošanas laika brīdī, izteikta procentos no sertificētās lietojamās akumulatora enerģijas. @lv
comment: Il-prestazzjoni mkejla jew abbord tal-enerġija tal-batterija użabbli f'punt speċifiku fil-ħajja tagħha, espressa bħala perċentwal tal-enerġija tal-batterija użabbli ċċertifikata. @mt
comment: De gemeten of aan boord bruikbare energieprestaties van de batterij op een specifiek punt in de levensduur, uitgedrukt als een percentage van de gecertificeerde bruikbare batterij-energie. @nl
comment: Zmierzona lub pokładowa użytkowa wydajność energetyczna akumulatora w określonym momencie jego cyklu życia, wyrażona jako procent certyfikowanej użytkowej energii akumulatora. @pl
comment: O desempenho energético medido ou a bordo da bateria utilizável num ponto específico da sua vida útil, expresso em percentagem da energia da bateria utilizável certificada. @pt
comment: Performanța energetică măsurată sau utilizabilă la bord a bateriei la un anumit moment din durata de viață a acesteia, exprimată ca procent din energia utilizabilă certificată a bateriei. @ro
comment: Nameraný alebo palubný využiteľný energetický výkon batérie v určitom bode jej životnosti, vyjadrený ako percento certifikovanej využiteľnej energie batérie. @sk
comment: Izmerjena ali na krovu uporabna energijska učinkovitost baterije na določeni točki njene življenjske dobe, izražena kot odstotek certificirane uporabne energije baterije. @sl
comment: Den uppmätta eller inbyggda användbara batterienergiprestandan vid en specifik tidpunkt under dess livslängd, uttryckt i procent av den certifierade användbara batterienergin. @sv
domain: Capacity, Energy and Voltage
range: xsd:double
related match: PropertyValue
related match: AdditionalProductClassificationDetails

State of Charge (SoC)
type: DatatypeProperty
governed by: DIN DKE SPEC 99100
unit: Percent
source: Source: ESPR - Annex XIII (1)
label: Състояние на зареждане (SoC) @bg
label: Stav nabití (SoC) @cs
label: Ladetilstand (SoC) @da
label: Ladezustand (SoC) @de
label: Κατάσταση φόρτισης (SoC) @el
label: Estado de carga (SoC) @es
label: Laetuse tase (SoC) @et
label: Varaustila (SoC) @fi
label: État de charge (SoC) @fr
label: Staid an Luchta (SoC) @ga
label: Stanje napunjenosti (SoC) @hr
label: Töltöttségi állapot (SoC) @hu
label: Stato di carica (SoC) @it
label: Įkrovimo būsena (SoC) @lt
label: Uzlādes stāvoklis (SoC) @lv
label: Stat ta' Kariga (SoC) @mt
label: Laadtoestand (SoC) @nl
label: Stan naładowania (SoC) @pl
label: Estado de Carga (SoC) @pt
label: Stare de încărcare (SoC) @ro
label: Stav nabitia (SoC) @sk
label: Stanje napolnjenosti (SoC) @sl
label: Laddningsstatus (SoC) @sv
comment: The available energy or charge in a battery expressed as a percentage of rated capacity.
comment: Наличната енергия или заряд в батерия, изразена като процент от номиналния капацитет. @bg
comment: Dostupná energie nebo náboj v baterii vyjádřená jako procento jmenovité kapacity. @cs
comment: Den tilgængelige energi eller opladning i et batteri udtrykt i procent af den nominelle kapacitet. @da
comment: Die verfügbare Energie oder Ladung in einer Batterie, ausgedrückt als Prozentsatz der Nennkapazität. @de
comment: Η διαθέσιμη ενέργεια ή φόρτιση σε μια μπαταρία εκφρασμένη ως ποσοστό της ονομαστικής χωρητικότητας. @el
comment: La energía o carga disponible en una batería expresada como porcentaje de la capacidad nominal. @es
comment: Aku saadaolev energia või laeng väljendatuna protsendina nimimahtuvusest. @et
comment: Akun käytettävissä oleva energia tai varaus ilmaistuna prosentteina nimelliskapasiteetista. @fi
comment: L'énergie ou la charge disponible dans une batterie exprimée en pourcentage de la capacité nominale. @fr
comment: An fuinneamh nó an lucht atá ar fáil i gceallra arna shloinneadh mar chéatadán den toilleadh rátáilte. @ga
comment: Dostupna energija ili naboj u bateriji izražen kao postotak nazivnog kapaciteta. @hr
comment: Az akkumulátorban rendelkezésre álló energia vagy töltés a névleges kapacitás százalékában kifejezve. @hu
comment: L'energia o la carica disponibile in una batteria espressa come percentuale della capacità nominale. @it
comment: Turima energija arba įkrova akumuliatoriuje, išreikšta vardinės talpos procentais. @lt
comment: Pieejamā enerģija vai lādiņš akumulatorā, izteikts procentos no nominālās jaudas. @lv
comment: L-enerġija jew il-ħlas disponibbli f'batterija espress bħala perċentwal tal-kapaċità nominali. @mt
comment: De beschikbare energie of lading in een batterij uitgedrukt als een percentage van de nominale capaciteit. @nl
comment: Dostępna energia lub ładunek w akumulatorze wyrażony jako procent pojemności znamionowej. @pl
comment: A energia ou carga disponível numa bateria expressa em percentagem da capacidade nominal. @pt
comment: Energia sau încărcătura disponibilă într-o baterie exprimată ca procent din capacitatea nominală. @ro
comment: Dostupná energia alebo náboj v batérii vyjadrená ako percento menovitej kapacity. @sk
comment: Razpoložljiva energija ali naboj v bateriji, izražen v odstotkih nazivne zmogljivosti. @sl
comment: Den tillgängliga energin eller laddningen i ett batteri uttryckt i procent av den nominella kapaciteten. @sv
domain: Capacity, Energy and Voltage
range: xsd:double
related match: PropertyValue

Minimum voltage
type: DatatypeProperty
governed by: DIN DKE SPEC 99100
unit: Volt
source: Source: ESPR - Annex XIII (1)
label: Минимално напрежение @bg
label: Minimální napětí @cs
label: Minimumsspænding @da
label: Minimale Spannung @de
label: Ελάχιστη τάση @el
label: Tensión mínima @es
label: Minimaalne pinge @et
label: Minimijännite @fi
label: Tension minimale @fr
label: Voltas íosta @ga
label: Minimalni napon @hr
label: Minimális feszültség @hu
label: Tensione minima @it
label: Minimali įtampa @lt
label: Minimālais spriegums @lv
label: Vultaġġ minimu @mt
label: Minimale spanning @nl
label: Napięcie minimalne @pl
label: Tensão mínima @pt
label: Tensiune minimă @ro
label: Minimálne napätie @sk
label: Minimalna napetost @sl
label: Minsta spänning @sv
comment: The lower voltage limit that the safe operation of the battery is rated for.
comment: Долната граница на напрежението, за която е оценена безопасната работа на батерията. @bg
comment: Spodní mez napětí, pro kterou je jmenovitý bezpečný provoz baterie. @cs
comment: Den nedre spændingsgrænse, som batteriets sikre drift er normeret til. @da
comment: Die untere Spannungsgrenze, für die der sichere Betrieb der Batterie ausgelegt ist. @de
comment: Το κατώτερο όριο τάσης για το οποίο ονομαστικοποιείται η ασφαλής λειτουργία της μπαταρίας. @el
comment: El límite de tensión inferior para el que está clasificado el funcionamiento seguro de la batería. @es
comment: Madalaim pingepiir, mille jaoks aku ohutu töö on ette nähtud. @et
comment: Alempi jänniteraja, jolle akun turvallinen käyttö on mitoitettu. @fi
comment: La limite de tension inférieure pour laquelle le fonctionnement sûr de la batterie est évalué. @fr
comment: An teorainn voltais is ísle a bhfuil oibriú sábháilte na ceallraí rátáilte di. @ga
comment: Donja granica napona za koju je ocijenjen siguran rad baterije. @hr
comment: Az alsó feszültséghatár, amelyre az akkumulátor biztonságos működését méretezték. @hu
comment: Il limite di tensione inferiore per cui è previsto il funzionamento sicuro della batteria. @it
comment: Žemutinė įtampos riba, kuriai esant užtikrinamas saugus akumuliatoriaus veikimas. @lt
comment: Zemākais sprieguma ierobežojums, kādam ir paredzēta droša akumulatora darbība. @lv
comment: Il-limitu aktar baxx tal-vultaġġ li l-operazzjoni sikura tal-batterija hija ratata għalih. @mt
comment: De onderste spanningsgrens waarvoor de veilige werking van de batterij is geclassificeerd. @nl
comment: Dolna granica napięcia, dla której znamionowe jest bezpieczne działanie akumulatora. @pl
comment: O limite de tensão inferior para o qual a operação segura da bateria é classificada. @pt
comment: Limita inferioară de tensiune pentru care este evaluată funcționarea sigură a bateriei. @ro
comment: Dolná hranica napätia, na ktorú je dimenzovaná bezpečná prevádzka batérie. @sk
comment: Spodnja meja napetosti, za katero je ocenjeno varno delovanje baterije. @sl
comment: Den nedre spänningsgräns som batteriets säkra drift är klassad för. @sv
domain: Capacity, Energy and Voltage
range: xsd:double
related match: PropertyValue

Maximum voltage
type: DatatypeProperty
governed by: DIN DKE SPEC 99100
unit: Volt
source: Source: ESPR - Annex XIII (1)
label: Максимално напрежение @bg
label: Maximální napětí @cs
label: Maksimal spænding @da
label: Maximale Spannung @de
label: Μέγιστη τάση @el
label: Tensión máxima @es
label: Maksimaalne pinge @et
label: Maksimijännite @fi
label: Tension maximale @fr
label: Voltas uasta @ga
label: Maksimalni napon @hr
label: Maximális feszültség @hu
label: Tensione massima @it
label: Maksimali įtampa @lt
label: Maksimālais spriegums @lv
label: Vultaġġ massimu @mt
label: Maximale spanning @nl
label: Napięcie maksymalne @pl
label: Tensão máxima @pt
label: Tensiune maximă @ro
label: Maximálne napätie @sk
label: Maksimalna napetost @sl
label: Maximal spänning @sv
comment: The upper voltage limit that the safe operation of the battery is rated for.
comment: Горната граница на напрежението, за която е оценена безопасната работа на батерията. @bg
comment: Horní mez napětí, pro kterou je jmenovitý bezpečný provoz baterie. @cs
comment: Den øvre spændingsgrænse, som batteriets sikre drift er normeret til. @da
comment: Die obere Spannungsgrenze, für die der sichere Betrieb der Batterie ausgelegt ist. @de
comment: Το ανώτερο όριο τάσης για το οποίο ονομαστικοποιείται η ασφαλής λειτουργία της μπαταρίας. @el
comment: El límite superior de tensión para el que está clasificado el funcionamiento seguro de la batería. @es
comment: Ülemine pingepiir, mille jaoks aku ohutu töö on ette nähtud. @et
comment: Ylempi jänniteraja, jolle akun turvallinen käyttö on mitoitettu. @fi
comment: La limite de tension supérieure pour laquelle le fonctionnement sûr de la batterie est évalué. @fr
comment: An teorainn voltais uachtarach a bhfuil oibriú sábháilte na ceallraí rátáilte di. @ga
comment: Gornja granica napona za koju je ocijenjen siguran rad baterije. @hr
comment: A felső feszültséghatár, amelyre az akkumulátor biztonságos működését méretezték. @hu
comment: Il limite di tensione superiore per il quale è previsto il funzionamento sicuro della batteria. @it
comment: Viršutinė įtampos riba, kuriai esant užtikrinamas saugus akumuliatoriaus veikimas. @lt
comment: Augstākais sprieguma ierobežojums, kādam ir paredzēta droša akumulatora darbība. @lv
comment: Il-limitu ta' fuq tal-vultaġġ li l-operazzjoni sikura tal-batterija hija ratata għalih. @mt
comment: De bovenste spanningsgrens waarvoor de veilige werking van de batterij is geclassificeerd. @nl
comment: Górna granica napięcia, dla której znamionowe jest bezpieczne działanie akumulatora. @pl
comment: O limite superior de tensão para o qual a operação segura da bateria é classificada. @pt
comment: Limita superioară de tensiune pentru care este evaluată funcționarea sigură a bateriei. @ro
comment: Horná hranica napätia, na ktorú je dimenzovaná bezpečná prevádzka batérie. @sk
comment: Zgornja meja napetosti, za katero je ocenjeno varno delovanje baterije. @sl
comment: Den övre spänningsgräns för vilken batteriets säkra drift är klassad. @sv
domain: Capacity, Energy and Voltage
range: xsd:double
related match: PropertyValue

Nominal voltage
type: DatatypeProperty
governed by: DIN DKE SPEC 99100
unit: Volt
source: Source: ESPR - Annex XIII (1)
label: Номинално напрежение @bg
label: Jmenovité napětí @cs
label: Nominel spænding @da
label: Nennspannung @de
label: Ονομαστική τάση @el
label: Tensión nominal @es
label: Nimipinge @et
label: Nimellisjännite @fi
label: Tension nominale @fr
label: Voltas ainmniúil @ga
label: Nazivni napon @hr
label: Névleges feszültség @hu
label: Tensione nominale @it
label: Nominali įtampa @lt
label: Nominālais spriegums @lv
label: Vultaġġ nominali @mt
label: Nominale spanning @nl
label: Napięcie znamionowe @pl
label: Tensão nominal @pt
label: Tensiune nominală @ro
label: Menovité napätie @sk
label: Nazivna napetost @sl
label: Nominell spänning @sv
comment: The suitable approximate value of the voltage used to designate or identify the battery.
comment: Подходящата приблизителна стойност на напрежението, използвано за означаване или идентифициране на батерията. @bg
comment: Vhodná přibližná hodnota napětí použitá k označení nebo identifikaci baterie. @cs
comment: Den passende omtrentlige værdi af den spænding, der bruges til at betegne eller identificere batteriet. @da
comment: Der geeignete ungefähre Wert der Spannung, der zur Bezeichnung oder Identifizierung der Batterie verwendet wird. @de
comment: Η κατάλληλη κατά προσέγγιση τιμή της τάσης που χρησιμοποιείται για τον προσδιορισμό ή την αναγνώριση της μπαταρίας. @el
comment: El valor aproximado adecuado de la tensión utilizada para designar o identificar la batería. @es
comment: Aku tähistamiseks või identifitseerimiseks kasutatav sobiv ligikaudne pinge väärtus. @et
comment: Akun nimeämiseen tai tunnistamiseen käytettävän jännitteen sopiva likiarvo. @fi
comment: La valeur approximative appropriée de la tension utilisée pour désigner ou identifier la batterie. @fr
comment: An luach neasach oiriúnach den voltas a úsáidtear chun an ceallra a ainmniú nó a shainaithint. @ga
comment: Prikladna približna vrijednost napona koja se koristi za označavanje ili identifikaciju baterije. @hr
comment: Az akkumulátor megjelölésére vagy azonosítására használt feszültség megfelelő közelítő értéke. @hu
comment: Il valore approssimativo adeguato della tensione utilizzata per designare o identificare la batteria. @it
comment: Tinkama apytikslė įtampos vertė, naudojama akumuliatoriui žymėti arba identifikuoti. @lt
comment: Piemērotā aptuvenā sprieguma vērtība, ko izmanto, lai apzīmētu vai identificētu akumulatoru. @lv
comment: Il-valur approssimattiv xieraq tal-vultaġġ użat biex jinnomina jew jidentifika l-batterija. @mt
comment: De geschikte geschatte waarde van de spanning die wordt gebruikt om de batterij aan te duiden of te identificeren. @nl
comment: Odpowiednia przybliżona wartość napięcia używana do oznaczenia lub identyfikacji akumulatora. @pl
comment: O valor aproximado adequado da tensão utilizada para designar ou identificar a bateria. @pt
comment: Valoarea aproximativă adecvată a tensiunii utilizate pentru a desemna sau a identifica bateria. @ro
comment: Vhodná približná hodnota napätia použitá na označenie alebo identifikáciu batérie. @sk
comment: Ustrezna približna vrednost napetosti, ki se uporablja za označevanje ali identifikacijo baterije. @sl
comment: Det lämpliga ungefärliga värdet på spänningen som används för att beteckna eller identifiera batteriet. @sv
domain: Capacity, Energy and Voltage
range: xsd:double

Original power capability
type: DatatypeProperty
governed by: DIN DKE SPEC 99100
unit: Watt
source: Source: ESPR - Annex XIII (1)
label: Оригинална мощност @bg
label: Původní výkonová schopnost @cs
label: Oprindelig effektkapacitet @da
label: Ursprüngliche Leistungsfähigkeit @de
label: Αρχική ικανότητα ισχύος @el
label: Capacidad de potencia original @es
label: Algne võimsusvõimekus @et
label: Alkuperäinen tehokyky @fi
label: Capacité de puissance d'origine @fr
label: Cumas cumhachta bunaidh @ga
label: Izvorna snaga @hr
label: Eredeti teljesítményképesség @hu
label: Capacità di potenza originale @it
label: Originali galia @lt
label: Sākotnējā jaudas spēja @lv
label: Kapaċità oriġinali tal-enerġija @mt
label: Oorspronkelijke vermogenscapaciteit @nl
label: Oryginalna zdolność zasilania @pl
label: Capacidade de potência original @pt
label: Capacitatea de putere originală @ro
label: Pôvodná výkonová schopnosť @sk
label: Izvirna zmogljivost moči @sl
label: Ursprunglig effektkapacitet @sv
comment: The amount of energy that a battery is capable to provide over a given period of time under reference conditions.
comment: Количеството енергия, което батерията е в състояние да осигури за даден период от време при референтни условия. @bg
comment: Množství energie, které je baterie schopna poskytnout za dané časové období za referenčních podmínek. @cs
comment: Den mængde energi, som et batteri er i stand til at levere over en given periode under referencebetingelser. @da
comment: Die Energiemenge, die eine Batterie über einen bestimmten Zeitraum unter Referenzbedingungen liefern kann. @de
comment: Η ποσότητα ενέργειας που μια μπαταρία είναι σε θέση να παρέχει για μια δεδομένη χρονική περίοδο υπό συνθήκες αναφοράς. @el
comment: La cantidad de energía que una batería es capaz de proporcionar durante un período de tiempo determinado en condiciones de referencia. @es
comment: Energia hulk, mida aku on võimeline andma teatud aja jooksul võrdlustingimustes. @et
comment: Energiamäärä, jonka akku pystyy tuottamaan tietyn ajan kuluessa vertailuolosuhteissa. @fi
comment: La quantité d'énergie qu'une batterie est capable de fournir sur une période donnée dans des conditions de référence. @fr
comment: An méid fuinnimh atá ceallraí in ann a sholáthar thar thréimhse áirithe ama faoi choinníollacha tagartha. @ga
comment: Količina energije koju baterija može pružiti tijekom određenog vremenskog razdoblja u referentnim uvjetima. @hr
comment: Az az energiamennyiség, amelyet egy akkumulátor egy adott idő alatt referenciafeltételek mellett képes leadni. @hu
comment: La quantità di energia che una batteria è in grado di fornire in un dato periodo di tempo in condizioni di riferimento. @it
comment: Energijos kiekis, kurį akumuliatorius gali pateikti per tam tikrą laikotarpį etaloninėmis sąlygomis. @lt
comment: Enerģijas daudzums, ko akumulators spēj nodrošināt noteiktā laika periodā atsauces apstākļos. @lv
comment: L-ammont ta' enerġija li batterija kapaċi tipprovdi fuq perjodu ta' żmien partikolari taħt kundizzjonijiet ta' referenza. @mt
comment: De hoeveelheid energie die een batterij kan leveren gedurende een bepaalde periode onder referentieomstandigheden. @nl
comment: Ilość energii, jaką bateria jest w stanie dostarczyć w danym okresie w warunkach referencyjnych. @pl
comment: A quantidade de energia que uma bateria é capaz de fornecer durante um determinado período de tempo em condições de referência. @pt
comment: Cantitatea de energie pe care o baterie este capabilă să o furnizeze într-o anumită perioadă de timp în condiții de referință. @ro
comment: Množstvo energie, ktoré je batéria schopná poskytnúť počas daného časového obdobia za referenčných podmienok. @sk
comment: Količina energije, ki jo je baterija sposobna zagotoviti v določenem časovnem obdobju v referenčnih pogojih. @sl
comment: Den mängd energi som ett batteri kan leverera under en given tidsperiod under referensförhållanden. @sv
domain: Power Capability
range: xsd:double
related match: additionalProperty
related match: ProductCharacteristic

Remaining power capability
type: DatatypeProperty
governed by: DIN DKE SPEC 99100
unit: Watt
source: Source: ESPR - Annex XIII (1)
label: Оставаща мощност @bg
label: Zbývající výkonová schopnost @cs
label: Resterende effektkapacitet @da
label: Verbleibende Leistungsfähigkeit @de
label: Εναπομένουσα ικανότητα ισχύος @el
label: Capacidad de potencia restante @es
label: Järelejäänud võimsusvõimekus @et
label: Jäljellä oleva tehokyky @fi
label: Capacité de puissance restante @fr
label: Cumas cumhachta atá fágtha @ga
label: Preostala snaga @hr
label: Fennmaradó teljesítményképesség @hu
label: Capacità di potenza residua @it
label: Likutinė galia @lt
label: Atlikusī jaudas spēja @lv
label: Kapaċità ta' qawwa li fadal @mt
label: Resterende vermogenscapaciteit @nl
label: Pozostała zdolność zasilania @pl
label: Capacidade de potência restante @pt
label: Capacitatea de putere rămasă @ro
label: Zostávajúca výkonová schopnosť @sk
label: Preostala zmogljivost moči @sl
label: Återstående effektkapacitet @sv
comment: Information on the remaining power capability as information on the state of health of the battery.
comment: Информация за оставащата мощност като информация за състоянието на батерията. @bg
comment: Informace o zbývající výkonové kapacitě jako informace o stavu baterie. @cs
comment: Oplysninger om den resterende effektkapacitet som oplysninger om batteriets sundhedstilstand. @da
comment: Informationen über die verbleibende Leistungsfähigkeit als Information über den Gesundheitszustand der Batterie. @de
comment: Πληροφορίες σχετικά με την εναπομένουσα ικανότητα ισχύος ως πληροφορίες σχετικά με την κατάσταση της υγείας της μπαταρίας. @el
comment: Información sobre la capacidad de potencia restante como información sobre el estado de salud de la batería. @es
comment: Teave järelejäänud võimsuse kohta teabena aku tervisliku seisundi kohta. @et
comment: Tiedot akun jäljellä olevasta tehokyvystä akun kunnon osoituksena. @fi
comment: Informations sur la capacité de puissance restante en tant qu'informations sur l'état de santé de la batterie. @fr
comment: Faisnéis faoin gcumas cumhachta atá fágtha mar fhaisnéis faoi staid sláinte na ceallraí. @ga
comment: Informacije o preostaloj snazi kao informacije o stanju baterije. @hr
comment: Tájékoztatás a fennmaradó teljesítményről, mint az akkumulátor állapotáról. @hu
comment: Informazioni sulla capacità di potenza residua come informazioni sullo stato di salute della batteria. @it
comment: Informacija apie likusią galią kaip informacija apie akumuliatoriaus būklę. @lt
comment: Informācija par atlikušo jaudas spēju kā informācija par akumulatora stāvokli. @lv
comment: Informazzjoni dwar il-kapaċità tal-qawwa li fadal bħala informazzjoni dwar l-istat tas-saħħa tal-batterija. @mt
comment: Informatie over de resterende vermogenscapaciteit als informatie over de gezondheidstoestand van de batterij. @nl
comment: Informacje o pozostałej mocy jako informacje o stanie baterii. @pl
comment: Informações sobre a capacidade de energia restante como informações sobre o estado de saúde da bateria. @pt
comment: Informații despre capacitatea de putere rămasă ca informații despre starea de sănătate a bateriei. @ro
comment: Informácie o zostávajúcej výkonovej kapacite ako informácie o stave batérie. @sk
comment: Informacije o preostali zmogljivosti moči kot informacije o stanju baterije. @sl
comment: Information om återstående effektkapacitet som information om batteriets hälsotillstånd. @sv
domain: Power Capability
range: xsd:double
related match: additionalProperty
related match: ProductCharacteristic

Power fade
type: DatatypeProperty
governed by: DIN DKE SPEC 99100
unit: Percent
source: Source: ESPR - Annex XIII (1)
label: Загуба на мощността @bg
label: Úbytek výkonu @cs
label: Effekttab @da
label: Leistungsabfall @de
label: Εξασθένιση ισχύος @el
label: Pérdida de potencia @es
label: Võimsuse vähenemine @et
label: Tehon heikkeneminen @fi
label: Perte de puissance @fr
label: Laghdú cumhachta @ga
label: Gubitak snage @hr
label: Teljesítménycsökkenés @hu
label: Perdita di potenza @it
label: Galingumo sumažėjimas @lt
label: Jaudas zudums @lv
label: Tnaqqis fil-qawwa @mt
label: Vermogensverlies @nl
label: Zanik mocy @pl
label: Perda de potência @pt
label: Pierderea de putere @ro
label: Úbytok výkonu @sk
label: Izguba moči @sl
label: Effektförlust @sv
comment: The decrease over time and upon usage in the amount of power that a battery can deliver at the rated voltage.
comment: Намаляването с течение на времето и при употреба на количеството мощност, което батерията може да достави при номиналното напрежение. @bg
comment: Pokles množství energie, které je baterie schopna dodat při jmenovitém napětí, v průběhu času a při používání. @cs
comment: Faldet over tid og ved brug i den mængde strøm, som et batteri kan levere ved den nominelle spænding. @da
comment: Die Abnahme der Leistung, die eine Batterie bei Nennspannung im Laufe der Zeit und bei Gebrauch abgeben kann. @de
comment: Η μείωση με την πάροδο του χρόνου και κατά τη χρήση της ποσότητας ισχύος που μπορεί να παραδώσει μια μπαταρία στην ονομαστική τάση. @el
comment: La disminución con el tiempo y el uso de la cantidad de energía que una batería puede entregar a la tensión nominal. @es
comment: Aku nimipingel antava võimsuse vähenemine aja jooksul ja kasutamisel. @et
comment: Akun nimellisjännitteellä toimittaman tehon määrän pieneneminen ajan myötä ja käytön aikana. @fi
comment: La diminution, dans le temps et à l'usage, de la puissance qu'une batterie peut fournir à la tension nominale. @fr
comment: An laghdú le himeacht ama agus ar úsáid sa mhéid cumhachta is féidir le ceallraí a sheachadadh ag an voltas rátáilte. @ga
comment: Smanjenje tijekom vremena i nakon uporabe količine energije koju baterija može isporučiti pri nazivnom naponu. @hr
comment: Az akkumulátor által a névleges feszültségen leadható teljesítmény idővel és használat során bekövetkező csökkenése. @hu
comment: La diminuzione nel tempo e con l'uso della quantità di potenza che una batteria può erogare alla tensione nominale. @it
comment: Akumuliatoriaus tiekiamos galios esant vardinei įtampai sumažėjimas laikui bėgant ir naudojant. @lt
comment: Laika gaitā un lietošanas laikā samazinās jauda, ko akumulators var piegādāt pie nominālā sprieguma. @lv
comment: It-tnaqqis maż-żmien u mal-użu fl-ammont ta 'qawwa li batterija tista' tagħti fil-vultaġġ nominali. @mt
comment: De afname in de tijd en bij gebruik van het vermogen dat een batterij kan leveren bij de nominale spanning. @nl
comment: Zmniejszenie się z upływem czasu i w trakcie użytkowania ilości mocy, jaką akumulator może dostarczyć przy napięciu znamionowym. @pl
comment: A diminuição ao longo do tempo e mediante o uso da quantidade de energia que uma bateria pode fornecer na tensão nominal. @pt
comment: Scăderea în timp și la utilizare a cantității de putere pe care o baterie o poate furniza la tensiunea nominală. @ro
comment: Zníženie množstva energie v priebehu času a pri používaní, ktoré môže batéria dodávať pri menovitom napätí. @sk
comment: Zmanjšanje moči, ki jo lahko baterija odda pri nazivni napetosti, sčasoma in ob uporabi. @sl
comment: Minskningen över tid och vid användning av den mängd effekt som ett batteri kan leverera vid märkspänningen. @sv
domain: Power Capability
range: xsd:double
related match: additionalProperty
related match: ProductCharacteristic

Maximum permitted battery power
type: DatatypeProperty
governed by: DIN DKE SPEC 99100
unit: Watt
source: Source: ESPR - Annex XIII (1)
label: Максимална разрешена мощност на батерията @bg
label: Maximální povolený výkon baterie @cs
label: Maksimal tilladt batterieffekt @da
label: Maximal zulässige Batterieleistung @de
label: Μέγιστη επιτρεπόμενη ισχύς μπαταρίας @el
label: Potencia máxima permitida de la batería @es
label: Aku maksimaalne lubatud võimsus @et
label: Suurin sallittu akun teho @fi
label: Puissance maximale autorisée de la batterie @fr
label: Uaschumhacht ceallraí ceadaithe @ga
label: Maksimalna dopuštena snaga baterije @hr
label: Az akkumulátor maximálisan megengedett teljesítménye @hu
label: Potenza massima consentita della batteria @it
label: Didžiausia leistina akumuliatoriaus galia @lt
label: Maksimālā atļautā akumulatora jauda @lv
label: Qawwa massima permessa tal-batterija @mt
label: Maximaal toegestaan batterijvermogen @nl
label: Maksymalna dozwolona moc baterii @pl
label: Potência máxima permitida da bateria @pt
label: Puterea maximă admisă a bateriei @ro
label: Maximálny povolený výkon batérie @sk
label: Največja dovoljena moč baterije @sl
label: Maximalt tillåten batterieffekt @sv
comment: The value of maximum permitted power the battery is rated for.
comment: Стойността на максималната разрешена мощност, за която е предназначена батерията. @bg
comment: Hodnota maximálního povoleného výkonu, pro který je baterie dimenzována. @cs
comment: Værdien af den maksimalt tilladte effekt, som batteriet er klassificeret til. @da
comment: Der Wert der maximal zulässigen Leistung, für die die Batterie ausgelegt ist. @de
comment: Η τιμή της μέγιστης επιτρεπόμενης ισχύος για την οποία έχει ονομαστεί η μπαταρία. @el
comment: El valor de la potencia máxima permitida para la que está clasificada la batería. @es
comment: Aku maksimaalse lubatud võimsuse väärtus. @et
comment: Akun suurimman sallitun tehon arvo. @fi
comment: La valeur de la puissance maximale autorisée pour laquelle la batterie est conçue. @fr
comment: Luach na huaschumhachta ceadaithe a bhfuil an ceallraí rátáilte ina leith. @ga
comment: Vrijednost najveće dopuštene snage za koju je baterija predviđena. @hr
comment: Az akkumulátor névleges maximális megengedett teljesítményének értéke. @hu
comment: Il valore della potenza massima consentita per cui la batteria è classificata. @it
comment: Didžiausios leistinos galios, kuriai priskiriamas akumuliatorius, vertė. @lt
comment: Maksimālās atļautās jaudas vērtība, kurai akumulators ir paredzēts. @lv
comment: Il-valur tal-qawwa massima permessa li l-batterija hija kklassifikata għaliha. @mt
comment: De waarde van het maximaal toegestane vermogen waarvoor de batterij is geclassificeerd. @nl
comment: Wartość maksymalnej dozwolonej mocy, na jaką jest znamionowa bateria. @pl
comment: O valor da potência máxima permitida para a qual a bateria está classificada. @pt
comment: Valoarea puterii maxime admise pentru care este clasificată bateria. @ro
comment: Hodnota maximálneho povoleného výkonu, na ktorý je batéria dimenzovaná. @sk
comment: Vrednost največje dovoljene moči, za katero je baterija ocenjena. @sl
comment: Värdet på den maximalt tillåtna effekten som batteriet är klassat för. @sv
domain: Power Capability
range: xsd:double
related match: additionalProperty
related match: ProductCharacteristic

Ratio between nominal battery power and battery energy
type: DatatypeProperty
governed by: DIN DKE SPEC 99100
unit: WattPerWattHour
source: Source: ESPR - Annex XIII (1)
label: Съотношение между номинална мощност на батерията и енергия на батерията @bg
label: Poměr mezi jmenovitým výkonem baterie a energií baterie @cs
label: Forholdet mellem nominel batteristrøm og batterienergi @da
label: Verhältnis zwischen Nennleistung der Batterie und Batterieenergie @de
label: Λόγος μεταξύ ονομαστικής ισχύος μπαταρίας και ενέργειας μπαταρίας @el
label: Relación entre la potencia nominal de la batería y la energía de la batería @es
label: Aku nimivõimsuse ja aku energia suhe @et
label: Akun nimellistehon ja akun energian välinen suhde @fi
label: Rapport entre la puissance nominale de la batterie et l'énergie de la batterie @fr
label: Cóimheas idir cumhacht ainmniúil ceallraí agus fuinneamh ceallraí @ga
label: Omjer između nazivne snage baterije i energije baterije @hr
label: Az akkumulátor névleges teljesítménye és az akkumulátor energiája közötti arány @hu
label: Rapporto tra la potenza nominale della batteria e l'energia della batteria @it
label: Vardinės akumuliatoriaus galios ir akumuliatoriaus energijos santykis @lt
label: Attiecība starp nominālo akumulatora jaudu un akumulatora enerģiju @lv
label: Proporzjon bejn il-qawwa nominali tal-batterija u l-enerġija tal-batterija @mt
label: Verhouding tussen nominaal batterijvermogen en batterij-energie @nl
label: Stosunek mocy nominalnej baterii do energii baterii @pl
label: Relação entre a potência nominal da bateria e a energia da bateria @pt
label: Raportul dintre puterea nominală a bateriei și energia bateriei @ro
label: Pomer medzi menovitým výkonom batérie a energiou batérie @sk
label: Razmerje med nazivno močjo baterije in energijo baterije @sl
label: Förhållandet mellan nominell batterieffekt och batterienergi @sv
comment: Provides an indication of the applicable discharge and charge rate in terms of rated capacity (C-rate).
comment: Дава указание за приложимата скорост на разреждане и зареждане по отношение на номиналния капацитет (C-rate). @bg
comment: Poskytuje údaj o použitelné rychlosti vybíjení a nabíjení z hlediska jmenovité kapacity (C-rate). @cs
comment: Giver en indikation af den gældende afladnings- og opladningshastighed i forhold til den nominelle kapacitet (C-rate). @da
comment: Gibt einen Hinweis auf die anwendbare Entlade- und Laderate in Bezug auf die Nennkapazität (C-Rate). @de
comment: Παρέχει ένδειξη του ισχύοντος ρυθμού εκφόρτισης και φόρτισης ως προς την ονομαστική χωρητικότητα (C-rate). @el
comment: Proporciona una indicación de la tasa de descarga y carga aplicable en términos de capacidad nominal (tasa C). @es
comment: Annab teavet kohaldatava tühjenemis- ja laadimiskiiruse kohta nimivõimsuse (C-rate) alusel. @et
comment: Antaa tiedon sovellettavasta purkaus- ja latausnopeudesta nimelliskapasiteettiin (C-rate) nähden. @fi
comment: Fournit une indication du taux de décharge et de charge applicable en termes de capacité nominale (C-rate). @fr
comment: Tugann sé léiriú ar an ráta urscaoilte agus luchtaithe is infheidhme i dtéarmaí toillte rátáilte (C-ráta). @ga
comment: Daje naznaku primjenjive brzine pražnjenja i punjenja u smislu nazivnog kapaciteta (C-stopa). @hr
comment: Jelzi az alkalmazandó kisütési és töltési sebességet a névleges kapacitás (C-ráta) függvényében. @hu
comment: Fornisce un'indicazione della velocità di scarica e di carica applicabile in termini di capacità nominale (C-rate). @it
comment: Pateikiama informacija apie taikomą iškrovos ir įkrovos greitį, atsižvelgiant į vardinę talpą (C koeficientas). @lt
comment: Norāda piemērojamo izlādes un uzlādes ātrumu attiecībā pret nominālo kapacitāti (C-rate). @lv
comment: Jipprovdi indikazzjoni tar-rata ta' skariku u ħlas applikabbli f'termini ta' kapaċità nominali (C-rate). @mt
comment: Geeft een indicatie van de toepasselijke ontlaad- en laadsnelheid in termen van nominale capaciteit (C-rate). @nl
comment: Wskazuje odpowiednią szybkość rozładowania i ładowania w kategoriach pojemności znamionowej (C-rate). @pl
comment: Fornece uma indicação da taxa de descarga e carga aplicável em termos de capacidade nominal (taxa C). @pt
comment: Oferă o indicație a ratei de descărcare și de încărcare aplicabile în ceea ce privește capacitatea nominală (rata C). @ro
comment: Poskytuje údaj o použiteľnej rýchlosti vybíjania a nabíjania z hľadiska menovitej kapacity (C-rate). @sk
comment: Daje navedbo veljavne stopnje praznjenja in polnjenja glede na nazivno zmogljivost (C-stopnja). @sl
comment: Ger en indikation på den tillämpliga urladdnings- och laddningshastigheten i termer av nominell kapacitet (C-rate). @sv
domain: Power Capability
range: xsd:double
related match: value
related match: ProductCharacteristic

Initial round trip energy efficiency
type: DatatypeProperty
governed by: DIN DKE SPEC 99100
unit: Percent
source: Source: ESPR - Annex XIII (1)
label: Първоначална енергийна ефективност при пълен цикъл @bg
label: Počáteční energetická účinnost zpáteční cesty @cs
label: Indledende energieffektivitet ved rundrejse @da
label: Anfängliche Round-Trip-Energieeffizienz @de
label: Αρχική ενεργειακή απόδοση μετ' επιστροφής @el
label: Eficiencia energética inicial de ida y vuelta @es
label: Esialgne edasi-tagasi energiatõhusus @et
label: Alkuperäinen kiertomatkan energiatehokkuus @fi
label: Efficacité énergétique initiale de l'aller-retour @fr
label: Éifeachtúlacht fuinnimh turas tosaigh @ga
label: Početna energetska učinkovitost povratnog putovanja @hr
label: Kezdeti menettérti energiahatékonyság @hu
label: Efficienza energetica iniziale di andata e ritorno @it
label: Pradinis energijos vartojimo efektyvumas abiem kryptimis @lt
label: Sākotnējā turp un atpakaļceļa energoefektivitāte @lv
label: Effiċjenza inizjali tal-enerġija tar-ritorn @mt
label: Initiële energie-efficiëntie van de ronde-trip @nl
label: Początkowa sprawność energetyczna w obie strony @pl
label: Eficiência energética inicial de ida e volta @pt
label: Eficiența energetică inițială a călătoriei dus-întors @ro
label: Počiatočná energetická účinnosť spiatočnej cesty @sk
label: Začetna energetska učinkovitost povratnega potovanja @sl
label: Initial energieffektivitet för rundresa @sv
comment: The ratio of the net energy delivered by a battery during a discharge test to the total energy required to restore the initial state of charge.
comment: Съотношението на нетната енергия, доставена от батерия по време на тест за разреждане, към общата енергия, необходима за възстановяване на първоначалното състояние на заряд. @bg
comment: Poměr čisté energie dodané baterií během vybíjecího testu k celkové energii potřebné k obnovení počátečního stavu nabití. @cs
comment: Forholdet mellem den nettoenergi, der leveres af et batteri under en afladningstest, og den samlede energi, der kræves for at genoprette den oprindelige opladningstilstand. @da
comment: Das Verhältnis der von einer Batterie bei einem Entladetest abgegebenen Nettoenergie zur Gesamtenergie, die zur Wiederherstellung des ursprünglichen Ladezustands erforderlich ist. @de
comment: Ο λόγος της καθαρής ενέργειας που παρέχεται από μια μπαταρία κατά τη διάρκεια μιας δοκιμής εκφόρτισης προς τη συνολική ενέργεια που απαιτείται για την αποκατάσταση της αρχικής κατάστασης φόρτισης. @el
comment: La relación entre la energía neta suministrada por una batería durante una prueba de descarga y la energía total necesaria para restablecer el estado de carga inicial. @es
comment: Aku poolt tühjendustesti ajal tarnitud netoenergia ja esialgse laetuse taastamiseks vajaliku koguenergia suhe. @et
comment: Akun purkaustestin aikana toimittaman nettoenergian suhde alkuperäisen varaustilan palauttamiseen tarvittavaan kokonaisenergiaan. @fi
comment: Le rapport entre l'énergie nette fournie par une batterie lors d'un essai de décharge et l'énergie totale nécessaire pour rétablir l'état de charge initial. @fr
comment: An cóimheas idir an glanfhuinneamh a sheachadann ceallraí le linn tástála urscaoilte agus an fuinneamh iomlán a theastaíonn chun an staid luchtaithe tosaigh a athbhunú. @ga
comment: Omjer neto energije koju baterija isporuči tijekom testa pražnjenja i ukupne energije potrebne za vraćanje početnog stanja napunjenosti. @hr
comment: A kisütési teszt során az akkumulátor által leadott nettó energia és a kezdeti töltöttségi állapot helyreállításához szükséges teljes energia aránya. @hu
comment: Il rapporto tra l'energia netta erogata da una batteria durante un test di scarica e l'energia totale richiesta per ripristinare lo stato di carica iniziale. @it
comment: Akumuliatoriaus iškrovimo bandymo metu tiekiamos grynosios energijos ir visos energijos, reikalingos pradinei įkrovos būsenai atkurti, santykis. @lt
comment: Neto enerģijas, ko akumulators piegādā izlādes testa laikā, attiecība pret kopējo enerģiju, kas nepieciešama, lai atjaunotu sākotnējo uzlādes stāvokli. @lv
comment: Il-proporzjon tal-enerġija netta kkunsinnata minn batterija waqt test ta 'skariku mal-enerġija totali meħtieġa biex tirrestawra l-istat inizjali ta' ħlas. @mt
comment: De verhouding tussen de netto-energie die een batterij levert tijdens een ontladingstest en de totale energie die nodig is om de oorspronkelijke laadtoestand te herstellen. @nl
comment: Stosunek energii netto dostarczonej przez akumulator podczas testu rozładowania do całkowitej energii wymaganej do przywrócenia początkowego stanu naładowania. @pl
comment: A razão entre a energia líquida fornecida por uma bateria durante um teste de descarga e a energia total necessária para restaurar o estado de carga inicial. @pt
comment: Raportul dintre energia netă livrată de o baterie în timpul unui test de descărcare și energia totală necesară pentru a restabili starea inițială de încărcare. @ro
comment: Pomer čistej energie dodanej batériou počas vybíjacieho testu k celkovej energii potrebnej na obnovenie počiatočného stavu nabitia. @sk
comment: Razmerje med neto energijo, ki jo odda baterija med preskusom praznjenja, in skupno energijo, potrebno za ponovno vzpostavitev začetnega stanja napolnjenosti. @sl
comment: Förhållandet mellan den nettoenergi som levereras av ett batteri under ett urladdningstest och den totala energi som krävs för att återställa det ursprungliga laddningstillståndet. @sv
domain: Round Trip Efficiency and Self-Discharge
range: xsd:double
related match: PropertyValue
related match: AdditionalProductClassificationDetails

Round trip energy efficiency at 50% of cycle life
type: DatatypeProperty
governed by: DIN DKE SPEC 99100
unit: Percent
source: Source: ESPR - Annex XIII (1)
label: Енергийна ефективност при пълен цикъл при 50% от живота на цикъла @bg
label: Energetická účinnost zpáteční cesty při 50 % životnosti @cs
label: Energieffektivitet ved rundrejse ved 50 % af cykluslevetiden @da
label: Round-Trip-Energieeffizienz bei 50 % der Zykluslebensdauer @de
label: Ενεργειακή απόδοση μετ' επιστροφής στο 50% της διάρκειας ζωής του κύκλου @el
label: Eficiencia energética de ida y vuelta al 50 % de la vida útil del ciclo @es
label: Edasi-tagasi energiatõhusus 50% tsükli elueast @et
label: Kiertomatkan energiatehokkuus 50 %:ssa käyttöiästä @fi
label: Efficacité énergétique aller-retour à 50 % de la durée de vie du cycle @fr
label: Éifeachtúlacht fuinnimh turas cruinn ag 50% de shaolré an timthrialla @ga
label: Energetska učinkovitost povratnog putovanja pri 50 % životnog ciklusa @hr
label: Menettérti energiahatékonyság a ciklusélettartam 50%-ánál @hu
label: Efficienza energetica di andata e ritorno al 50% della durata del ciclo @it
label: Energijos vartojimo efektyvumas abiem kryptimis, esant 50 % ciklo trukmės @lt
label: Energoefektivitāte turp un atpakaļ pie 50% no cikla mūža @lv
label: Effiċjenza tal-enerġija bir-ritorn f'50% tal-ħajja taċ-ċiklu @mt
label: Energie-efficiëntie bij 50% van de levensduur @nl
label: Sprawność energetyczna w obie strony przy 50% cyklu życia @pl
label: Eficiência energética de ida e volta a 50% da vida útil do ciclo @pt
label: Eficiența energetică a călătoriei dus-întors la 50% din durata de viață a ciclului @ro
label: Energetická účinnosť spiatočnej cesty pri 50 % životnosti cyklu @sk
label: Energetska učinkovitost povratnega potovanja pri 50 % življenjske dobe cikla @sl
label: Energieffektivitet för rundresa vid 50 % av cykellivslängden @sv
comment: Round trip energy efficiency measured at 50% of cycle-life.
comment: Енергийна ефективност при пълен цикъл, измерена при 50% от живота на цикъла. @bg
comment: Energetická účinnost zpáteční cesty měřená při 50 % životnosti. @cs
comment: Energieffektivitet ved rundrejse målt ved 50 % af cykluslevetiden. @da
comment: Round-Trip-Energieeffizienz, gemessen bei 50 % der Zykluslebensdauer. @de
comment: Ενεργειακή απόδοση μετ' επιστροφής μετρημένη στο 50% της διάρκειας ζωής του κύκlu. @el
comment: Eficiencia energética de ida y vuelta medida al 50 % de la vida útil del ciclo. @es
comment: Edasi-tagasi energiatõhusus, mõõdetuna 50% tsükli elueast. @et
comment: Kiertomatkan energiatehokkuus mitattuna 50 %:ssa käyttöiästä. @fi
comment: Efficacité énergétique aller-retour mesurée à 50 % de la durée de vie du cycle. @fr
comment: Éifeachtúlacht fuinnimh turas cruinn arna thomhas ag 50% de shaolré an timthrialla. @ga
comment: Energetska učinkovitost povratnog putovanja izmjerena pri 50 % životnog ciklusa. @hr
comment: A ciklusélettartam 50%-ánál mért menettérti energiahatékonyság. @hu
comment: Efficienza energetica di andata e ritorno misurata al 50% della durata del ciclo. @it
comment: Energijos vartojimo efektyvumas abiem kryptimis, išmatuotas esant 50 % ciklo trukmės. @lt
comment: Energoefektivitāte turp un atpakaļ, mērot pie 50% no cikla mūža. @lv
comment: L-effiċjenza tal-enerġija bir-ritorn imkejla f'50% tal-ħajja taċ-ċiklu. @mt
comment: Energie-efficiëntie van de retourvlucht, gemeten bij 50% van de levensduur. @nl
comment: Sprawność energetyczna w obie strony mierzona przy 50% cyklu życia. @pl
comment: Eficiência energética de ida e volta medida a 50% da vida útil do ciclo. @pt
comment: Eficiența energetică a călătoriei dus-întors măsurată la 50% din durata de viață a ciclului. @ro
comment: Energetická účinnosť spiatočnej cesty meraná pri 50 % životnosti cyklu. @sk
comment: Energetska učinkovitost povratnega potovanja, izmerjena pri 50 % življenjske dobe cikla. @sl
comment: Energieffektivitet för rundresa mätt vid 50 % av cykellivslängden. @sv
domain: Round Trip Efficiency and Self-Discharge
range: xsd:double
related match: PropertyValue
related match: AdditionalProductClassificationDetails

Remaining round trip energy efficiency
type: DatatypeProperty
governed by: DIN DKE SPEC 99100
unit: Percent
source: Source: ESPR - Annex XIII (1)
label: Оставаща енергийна ефективност при пълен цикъл @bg
label: Zbývající energetická účinnost zpáteční cesty @cs
label: Resterende energieffektivitet ved rundrejse @da
label: Verbleibende Round-Trip-Energieeffizienz @de
label: Εναπομένουσα ενεργειακή απόδοση μετ' επιστροφής @el
label: Eficiencia energética restante de ida y vuelta @es
label: Järelejäänud edasi-tagasi energiatõhusus @et
label: Jäljellä oleva kiertomatkan energiatehokkuus @fi
label: Efficacité énergétique restante de l'aller-retour @fr
label: Éifeachtúlacht fuinnimh fágtha turas cruinn @ga
label: Preostala energetska učinkovitost povratnog putovanja @hr
label: Fennmaradó menettérti energiahatékonyság @hu
label: Efficienza energetica residua di andata e ritorno @it
label: Likutinis energijos vartojimo efektyvumas abiem kryptimis @lt
label: Atlikusī turp un atpakaļceļa energoefektivitāte @lv
label: Effiċjenza tal-enerġija li fadal għar-ritorn @mt
label: Resterende energie-efficiëntie voor retour @nl
label: Pozostała sprawność energetyczna w obie strony @pl
label: Eficiência energética de ida e volta restante @pt
label: Eficiența energetică rămasă a călătoriei dus-întors @ro
label: Zostávajúca energetická účinnosť spiatočnej cesty @sk
label: Preostala energetska učinkovitost povratnega potovanja @sl
label: Återstående energieffektivitet för rundresa @sv
comment: The in-use analogy to the initial roundtrip energy efficiency.
comment: Аналогията в употреба на първоначалната енергийна ефективност при пълен цикъл. @bg
comment: Používaná analogie k počáteční energetické účinnosti zpáteční cesty. @cs
comment: Den ibrugtagne analogi til den oprindelige rundrejse-energieffektivitet. @da
comment: Die gebrauchsübliche Analogie zur anfänglichen Roundtrip-Energieeffizienz. @de
comment: Η εν χρήσει αναλογία με την αρχική ενεργειακή απόδοση του ταξιδιού μετ' επιστροφής. @el
comment: La analogía en uso con la eficiencia energética inicial de ida y vuelta. @es
comment: Kasutuses olev analoogia esialgse edasi-tagasi energiatõhususega. @et
comment: Käytössä oleva analogia alkuperäiseen kiertomatkan energiatehokkuuteen. @fi
comment: L'analogie en service avec l'efficacité énergétique initiale de l'aller-retour. @fr
comment: An analach in-úsáide leis an éifeachtúlacht fuinnimh turas tosaigh. @ga
comment: Analogija u uporabi s početnom energetskom učinkovitošću povratnog putovanja. @hr
comment: A kezdeti menettérti energiahatékonyság használatban lévő analógiája. @hu
comment: L'analogia in uso all'efficienza energetica iniziale di andata e ritorno. @it
comment: Pradinio energijos vartojimo efektyvumo dvipusio ryšio analogija. @lt
comment: Sākotnējās turp un atpakaļceļa energoefektivitātes lietošanas analoģija. @lv
comment: L-analoġija fl-użu għall-effiċjenza inizjali tal-enerġija tar-ritorn. @mt
comment: De in-gebruik analogie van de initiële retour energie-efficiëntie. @nl
comment: Analogia użytkowa do początkowej sprawności energetycznej w obie strony. @pl
comment: A analogia em uso à eficiência energética inicial de ida e volta. @pt
comment: Analogia în uz cu eficiența energetică inițială a călătoriei dus-întors. @ro
comment: Používaná analógia k počiatočnej energetickej účinnosti spiatočnej cesty. @sk
comment: Uporabna analogija z začetno energijsko učinkovitostjo povratnega potovanja. @sl
comment: Den analoga användningen till den ursprungliga energieffektiviteten för rundresor. @sv
domain: Round Trip Efficiency and Self-Discharge
range: xsd:double
related match: PropertyValue
related match: AdditionalProductClassificationDetails

Energy round trip efficiency fade
type: DatatypeProperty
governed by: DIN DKE SPEC 99100
unit: Percent
source: Source: ESPR - Annex XIII (1)
label: Затихване на енергийната ефективност при пълен цикъл @bg
label: Úbytek energetické účinnosti zpáteční cesty @cs
label: Fald i energieffektivitet ved rundrejse @da
label: Abnahme der Round-Trip-Energieeffizienz @de
label: Εξασθένιση της ενεργειακής απόδοσης μετ' επιστροφής @el
label: Disminución de la eficiencia energética de ida y vuelta @es
label: Energiatõhususe vähenemine edasi-tagasi @et
label: Kiertomatkan energiatehokkuuden heikkeneminen @fi
label: Baisse de l'efficacité énergétique de l'aller-retour @fr
label: Laghdú ar éifeachtúlacht fuinnimh turas cruinn @ga
label: Gubitak energetske učinkovitosti povratnog putovanja @hr
label: Az menettérti energiahatékonyság csökkenése @hu
label: Perdita di efficienza energetica di andata e ritorno @it
label: Energijos vartojimo efektyvumo sumažėjimas abiem kryptimis @lt
label: Energoefektivitātes samazināšanās turp un atpakaļ @lv
label: Tnaqqis fl-effiċjenza tal-enerġija tar-ritorn @mt
label: Afname van de energie-efficiëntie van de retour @nl
label: Zanik sprawności energetycznej w obie strony @pl
label: Perda de eficiência energética de ida e volta @pt
label: Pierderea eficienței energetice a călătoriei dus-întors @ro
label: Pokles energetickej účinnosti spiatočnej cesty @sk
label: Zmanjšanje energetske učinkovitosti povratnega potovanja @sl
label: Minskad energieffektivitet för rundresan @sv
comment: The decrease of round trip energy efficiency as percentage.
comment: Намаляването на енергийната ефективност при пълен цикъл в проценти. @bg
comment: Pokles energetické účinnosti zpáteční cesty v procentech. @cs
comment: Faldet i energieffektivitet ved rundrejse i procent. @da
comment: Die Abnahme der Round-Trip-Energieeffizienz in Prozent. @de
comment: Η μείωση της ενεργειακής απόδοσης της διαδρομής μετ' επιστροφής ως ποσοστό. @el
comment: La disminución de la eficiencia energética de ida y vuelta en porcentaje. @es
comment: Edasi-tagasi energiatõhususe vähenemine protsentides. @et
comment: Kiertomatkan energiatehokkuuden lasku prosentteina. @fi
comment: La diminution de l'efficacité énergétique de l'aller-retour en pourcentage. @fr
comment: An laghdú ar éifeachtacht fuinnimh turas cruinn mar chéatadán. @ga
comment: Smanjenje energetske učinkovitosti povratnog putovanja u postocima. @hr
comment: A menettérti energiahatékonyság csökkenése százalékban kifejezve. @hu
comment: La diminuzione dell'efficienza energetica di andata e ritorno in percentuale. @it
comment: Energijos vartojimo efektyvumo sumažėjimas procentais. @lt
comment: Energoefektivitātes samazināšanās turp un atpakaļ procentos. @lv
comment: It-tnaqqis fl-effiċjenza tal-enerġija tar-ritorn bħala perċentwal. @mt
comment: De afname van de energie-efficiëntie van de retour als percentage. @nl
comment: Spadek sprawności energetycznej w obie strony w ujęciu procentowym. @pl
comment: A diminuição da eficiência energética de ida e volta em percentagem. @pt
comment: Scăderea eficienței energetice a călătoriei dus-întors ca procent. @ro
comment: Pokles energetickej účinnosti spiatočnej cesty v percentách. @sk
comment: Zmanjšanje energetske učinkovitosti povratnega potovanja v odstotkih. @sl
comment: Minskningen av energieffektiviteten för rundresan i procent. @sv
domain: Round Trip Efficiency and Self-Discharge
range: xsd:double
related match: PropertyValue
related match: AdditionalProductClassificationDetails

Initial self-discharge rate
type: DatatypeProperty
unit: PercentPerMonth
source: https://www.dinmedia.de/en/technical-rule/din-dke-spec-99100/385692321
label: Първоначална скорост на саморазреждане @bg
label: Počáteční rychlost samovybíjení @cs
label: Indledende selvafladningshastighed @da
label: Anfängliche Selbstentladungsrate @de
label: Αρχικός ρυθμός αυτοεκφόρτισης @el
label: Tasa de autodescarga inicial @es
label: Esialgne isetühjenemise määr @et
label: Alkuperäinen itsepurkautumisnopeus @fi
label: Taux d'autodécharge initial @fr
label: Ráta féin-urscaoilte tosaigh @ga
label: Početna stopa samopražnjenja @hr
label: Kezdeti önkisülési ráta @hu
label: Tasso di autoscarica iniziale @it
label: Pradinis savaiminio išsikrovimo greitis @lt
label: Sākotnējais pašizlādes ātrums @lv
label: Rata inizjali ta' skariku personali @mt
label: Initiële zelfontlading @nl
label: Początkowa szybkość samorozładowania @pl
label: Taxa de autodescarga inicial @pt
label: Rata inițială de autodescărcare @ro
label: Počiatočná rýchlosť samovybíjania @sk
label: Začetna stopnja samopraznjenja @sl
label: Initial självurladdningshastighet @sv
comment: The self-discharge-rate in an idle state of the battery in reference conditions at begin of life.
comment: Скоростта на саморазреждане в неактивно състояние на батерията при референтни условия в началото на живота. @bg
comment: Míra samovybíjení v klidovém stavu baterie za referenčních podmínek na začátku životnosti. @cs
comment: Selvafladningshastigheden i en inaktiv tilstand af batteriet under referencebetingelser ved begyndelsen af levetiden. @da
comment: Die Selbstentladungsrate in einem Ruhezustand der Batterie unter Referenzbedingungen zu Beginn der Lebensdauer. @de
comment: Ο ρυθμός αυτοεκφόρτισης σε κατάσταση αδράνειας της μπαταρίας σε συνθήκες αναφοράς στην αρχή της ζωής. @el
comment: La tasa de autodescarga en un estado de reposo de la batería en condiciones de referencia al principio de su vida útil. @es
comment: Isetühjenemise kiirus aku tühikäigul etalonitingimustes kasutusaja alguses. @et
comment: Akun itsepurkautumisnopeus lepotilassa vertailuolosuhteissa käyttöiän alussa. @fi
comment: Le taux d'autodécharge à l'état de repos de la batterie dans des conditions de référence en début de vie. @fr
comment: An ráta féin-urscaoilte i riocht díomhaoin na ceallraí i gcoinníollacha tagartha ag tús an tsaoil. @ga
comment: Stopa samopražnjenja u stanju mirovanja baterije u referentnim uvjetima na početku vijeka trajanja. @hr
comment: Az akkumulátor önkisülési rátája üresjárati állapotban, referencia-körülmények között, az élettartam kezdetén. @hu
comment: Il tasso di autoscarica in uno stato di inattività della batteria in condizioni di riferimento all'inizio della vita. @it
comment: Savaiminio išsikrovimo greitis akumuliatoriaus tuščiosios eigos būsenoje etaloninėmis sąlygomis eksploatavimo pradžioje. @lt
comment: Pašizlādes ātrums akumulatora dīkstāves stāvoklī atsauces apstākļos ekspluatācijas sākumā. @lv
comment: Ir-rata ta' awto-skarika fi stat idle tal-batterija f'kundizzjonijiet ta' referenza fil-bidu tal-ħajja. @mt
comment: De zelfontlading in rusttoestand van de batterij onder referentiecondities aan het begin van de levensduur. @nl
comment: Szybkość samorozładowania w stanie bezczynności akumulatora w warunkach referencyjnych na początku okresu eksploatacji. @pl
comment: A taxa de autodescarga num estado de marcha lenta da bateria em condições de referência no início da vida útil. @pt
comment: Rata de autodescărcare într-o stare de repaus a bateriei în condiții de referință la începutul duratei de viață. @ro
comment: Miera samovybíjania v pokojovom stave batérie za referenčných podmienok na začiatku životnosti. @sk
comment: Stopnja samopraznjenja v stanju mirovanja baterije v referenčnih pogojih na začetku življenjske dobe. @sl
comment: Självurladdningshastigheten i ett viloläge för batteriet under referensförhållanden i början av livslängden. @sv
domain: Round Trip Efficiency and Self-Discharge
range: xsd:double
related match: PropertyValue
related match: AdditionalProductClassificationDetails

Current self-discharge rate
type: DatatypeProperty
unit: PercentPerMonth
source: https://www.dinmedia.de/en/technical-rule/din-dke-spec-99100/385692321
label: Текуща скорост на саморазреждане @bg
label: Aktuální rychlost samovybíjení @cs
label: Nuværende selvafladningshastighed @da
label: Aktuelle Selbstentladungsrate @de
label: Τρέχων ρυθμός αυτοεκφόρτισης @el
label: Tasa de autodescarga actual @es
label: Praegune isetühjenemise määr @et
label: Nykyinen itsepurkautumisnopeus @fi
label: Taux d'autodécharge actuel @fr
label: Ráta reatha féin-urscaoilte @ga
label: Trenutna stopa samopražnjenja @hr
label: Jelenlegi önkisülési ráta @hu
label: Tasso di autoscarica attuale @it
label: Dabartinis savaiminio išsikrovimo greitis @lt
label: Pašreizējais pašizlādes ātrums @lv
label: Rata attwali ta' skariku personali @mt
label: Huidige zelfontlading @nl
label: Aktualna szybkość samorozładowania @pl
label: Taxa de autodescarga atual @pt
label: Rata curentă de autodescărcare @ro
label: Aktuálna rýchlosť samovybíjania @sk
label: Trenutna stopnja samopraznjenja @sl
label: Nuvarande självurladdningshastighet @sv
comment: The change of the self-discharge rate in an idle state of the battery.
comment: Промяната на скоростта на саморазреждане в неактивно състояние на батерията. @bg
comment: Změna rychlosti samovybíjení v klidovém stavu baterie. @cs
comment: Ændringen af selvafladningshastigheden i en inaktiv tilstand af batteriet. @da
comment: Die Änderung der Selbstentladungsrate in einem Ruhezustand der Batterie. @de
comment: Η αλλαγή του ρυθμού αυτοεκφόρτισης σε κατάσταση αδράνειας της μπαταρίας. @el
comment: El cambio de la tasa de autodescarga en un estado de reposo de la batería. @es
comment: Isetühjenemise kiiruse muutus aku tühikäigul. @et
comment: Akun itsepurkautumisnopeuden muutos lepotilassa. @fi
comment: La variation du taux d'autodécharge à l'état de repos de la batterie. @fr
comment: An t-athrú ar an ráta féin-urscaoilte i riocht díomhaoin na ceallraí. @ga
comment: Promjena brzine samopražnjenja u stanju mirovanja baterije. @hr
comment: Az önkisülési sebesség változása az akkumulátor üresjárati állapotában. @hu
comment: La variazione del tasso di autoscarica in uno stato di inattività della batteria. @it
comment: Savaiminio išsikrovimo greičio pokytis akumuliatoriaus tuščiosios eigos būsenoje. @lt
comment: Pašizlādes ātruma izmaiņas akumulatora dīkstāves stāvoklī. @lv
comment: Il-bidla tar-rata ta' awto-skarika fi stat idle tal-batterija. @mt
comment: De verandering van de zelfontlading in een rusttoestand van de batterij. @nl
comment: Zmiana szybkości samorozładowania w stanie bezczynności akumulatora. @pl
comment: A alteração da taxa de auto-descarga num estado de marcha lenta da bateria. @pt
comment: Modificarea ratei de autodescărcare într-o stare de repaus a bateriei. @ro
comment: Zmena rýchlosti samovybíjania v pokojovom stave batérie. @sk
comment: Sprememba stopnje samopraznjenja v stanju mirovanja baterije. @sl
comment: Förändringen av självurladdningshastigheten i ett viloläge för batteriet. @sv
domain: Round Trip Efficiency and Self-Discharge
range: xsd:double
related match: PropertyValue
related match: AdditionalProductClassificationDetails

Evolution of self-discharge rates
type: DatatypeProperty
governed by: DIN DKE SPEC 99100
unit: Percent
source: Source: ESPR - Annex XIII (1)
label: Еволюция на скоростта на саморазреждане @bg
label: Vývoj rychlosti samovybíjení @cs
label: Udvikling af selvafladningshastigheder @da
label: Entwicklung der Selbstentladungsraten @de
label: Εξέλιξη των ρυθμών αυτοεκφόρτισης @el
label: Evolución de las tasas de autodescarga @es
label: Isetühjenemise määrade areng @et
label: Itsepurkautumisnopeuksien kehitys @fi
label: Évolution des taux d'autodécharge @fr
label: Éabhlóid na rátaí féin-urscaoilte @ga
label: Evolucija stopa samopražnjenja @hr
label: Az önkisülési ráták alakulása @hu
label: Evoluzione dei tassi di autoscarica @it
label: Savaiminio išsikrovimo greičio raida @lt
label: Pašizlādes ātrumu attīstība @lv
label: Evoluzzjoni tar-rati ta' skariku personali @mt
label: Evolutie van de zelfontlading @nl
label: Ewolucja szybkości samorozładowania @pl
label: Evolução das taxas de autodescarga @pt
label: Evoluția ratelor de autodescărcare @ro
label: Vývoj rýchlosti samovybíjania @sk
label: Razvoj stopenj samopraznjenja @sl
label: Utveckling av självurladdningshastigheter @sv
comment: The change of self-discharge over time and usage, calculated from the initial and current self-discharge rate.
comment: Промяната на саморазреждането във времето и употребата, изчислена от началната и текущата скорост на саморазреждане. @bg
comment: Změna samovybíjení v čase a při používání, vypočtená z počáteční a aktuální rychlosti samovybíjení. @cs
comment: Ændringen af selvafladning over tid og brug, beregnet ud fra den oprindelige og den nuværende selvafladningshastighed. @da
comment: Die Veränderung der Selbstentladung im Laufe der Zeit und der Nutzung, berechnet aus der anfänglichen und der aktuellen Selbstentladungsrate. @de
comment: Η μεταβολή της αυτοεκφόρτισης με την πάροδο του χρόνου και τη χρήση, υπολογιζόμενη από τον αρχικό και τον τρέχοντα ρυθμό αυτοεκφόρτισης. @el
comment: El cambio de la autodescarga a lo largo del tiempo y el uso, calculado a partir de la tasa de autodescarga inicial y actual. @es
comment: Isetühjenemise muutus aja ja kasutuse jooksul, arvutatuna algse ja praeguse isetühjenemise määra alusel. @et
comment: Itsepurkautumisen muutos ajan ja käytön myötä laskettuna alkuperäisestä ja nykyisestä itsepurkautumisnopeudesta. @fi
comment: L'évolution de l'autodécharge au fil du temps et de l'utilisation, calculée à partir des taux d'autodécharge initial et actuel. @fr
comment: An t-athrú ar fhéin-urscaoileadh le himeacht ama agus úsáide, arna ríomh ón ráta féin-urscaoilte tosaigh agus reatha. @ga
comment: Promjena samopražnjenja tijekom vremena i uporabe, izračunata iz početne i trenutne stope samopražnjenja. @hr
comment: Az önkisülés időbeli és használati változása a kezdeti és a jelenlegi önkisülési rátából számítva. @hu
comment: La variazione dell'autoscarica nel tempo e nell'uso, calcolata sulla base del tasso di autoscarica iniziale e corrente. @it
comment: Savaiminio išsikrovimo pokytis laikui bėgant ir naudojant, apskaičiuotas pagal pradinį ir dabartinį savaiminio išsikrovimo greitį. @lt
comment: Pašizlādes izmaiņas laika gaitā un lietošanas laikā, ko aprēķina no sākotnējā un pašreizējā pašizlādes ātruma. @lv
comment: Il-bidla fl-awto-discharge maż-żmien u l-użu, ikkalkulata mir-rata inizjali u attwali ta' awto-discharge. @mt
comment: De verandering van de zelfontlading in de tijd en het gebruik, berekend op basis van de initiële en de huidige zelfontlading. @nl
comment: Zmiana samorozładowania w czasie i w trakcie użytkowania, obliczona na podstawie początkowej i bieżącej szybkości samorozładowania. @pl
comment: A alteração da auto-descarga ao longo do tempo e da utilização, calculada a partir da taxa de auto-descarga inicial e atual. @pt
comment: Modificarea autodescărcării în timp și în timpul utilizării, calculată pe baza ratei de autodescărcare inițiale și curente. @ro
comment: Zmena samovybíjania v priebehu času a používania, vypočítaná z počiatočnej a aktuálnej rýchlosti samovybíjania. @sk
comment: Sprememba samopraznjenja skozi čas in uporabo, izračunana iz začetne in trenutne stopnje samopraznjenja. @sl
comment: Förändringen av självurladdning över tid och användning, beräknad från den initiala och nuvarande självurladdningshastigheten. @sv
domain: Round Trip Efficiency and Self-Discharge
range: xsd:double
related match: PropertyValue
related match: AdditionalProductClassificationDetails

Initial internal resistance of battery cell and pack
type: DatatypeProperty
governed by: DIN DKE SPEC 99100
unit: Ohm
source: Source: ESPR - Annex XIII (1)
label: Начално вътрешно съпротивление на клетката и пакета на батерията @bg
label: Počáteční vnitřní odpor bateriového článku a sady @cs
label: Indledende intern modstand i battericelle og -pakke @da
label: Anfänglicher Innenwiderstand von Batteriezelle und -paket @de
label: Αρχική εσωτερική αντίσταση της κυψέλης και της συστοιχίας μπαταριών @el
label: Resistencia interna inicial de la celda y del paquete de baterías @es
label: Aku elemendi ja ploki esialgne sisetakistus @et
label: Akkukennon ja -paketin alkuperäinen sisäinen vastus @fi
label: Résistance interne initiale de la cellule et du bloc de batterie @fr
label: Friotaíocht inmheánach tosaigh na cille agus an phacáiste ceallraí @ga
label: Početni unutarnji otpor baterijske ćelije i paketa @hr
label: Akkumulátorcella és -csomag kezdeti belső ellenállása @hu
label: Resistenza interna iniziale della cella e del pacco batteria @it
label: Pradinė akumuliatoriaus elemento ir bloko vidinė varža @lt
label: Akumulatora elementa un bloka sākotnējā iekšējā pretestība @lv
label: Reżistenza interna inizjali taċ-ċellula u l-pakkett tal-batterija @mt
label: Initiële interne weerstand van batterijcel en -pakket @nl
label: Początkowa rezystancja wewnętrzna ogniwa i pakietu akumulatorów @pl
label: Resistência interna inicial da célula e do pacote de bateria @pt
label: Rezistența internă inițială a celulei și a pachetului de baterii @ro
label: Počiatočný vnútorný odpor článku a súpravy batérií @sk
label: Začetna notranja upornost baterijske celice in paketa @sl
label: Initialt internt motstånd i battericell och batteripaket @sv
comment: The opposition to the flow of current within a cell or a battery under reference conditions.
comment: Противодействието на протичането на ток в клетка или батерия при референтни условия. @bg
comment: Odpor proti toku proudu v článku nebo baterii za referenčních podmínek. @cs
comment: Modstanden mod strømflowet i en celle eller et batteri under referencebetingelser. @da
comment: Der Widerstand gegen den Stromfluss in einer Zelle oder einer Batterie unter Referenzbedingungen. @de
comment: Η αντίθεση στη ροή του ρεύματος μέσα σε μια κυψέλη ή μια μπαταρία υπό συνθήκες αναφοράς. @el
comment: La oposición al flujo de corriente dentro de una celda o una batería en condiciones de referencia. @es
comment: Voolu takistus elemendi või aku sees võrdlustingimustes. @et
comment: Virran kulun vastus kennossa tai akussa vertailuolosuhteissa. @fi
comment: L'opposition au passage du courant à l'intérieur d'une cellule ou d'une batterie dans des conditions de référence. @fr
comment: An freasúra in aghaidh sreabhadh an tsrutha laistigh de chill nó de cheallraí faoi choinníollacha tagartha. @ga
comment: Otpor protoku struje unutar ćelije ili baterije pod referentnim uvjetima. @hr
comment: Az áram áramlásával szembeni ellenállás egy cellán vagy akkumulátoron belül referencia-körülmények között. @hu
comment: L'opposizione al flusso di corrente all'interno di una cella o di una batteria in condizioni di riferimento. @it
comment: Priešinimasis srovės tekėjimui elemento ar akumuliatoriaus viduje standartinėmis sąlygomis. @lt
comment: Pretestība strāvas plūsmai šūnā vai akumulatorā atsauces apstākļos. @lv
comment: L-oppożizzjoni għall-fluss tal-kurrent f'ċellula jew batterija taħt kundizzjonijiet ta' referenza. @mt
comment: De weerstand tegen de stroomvloei in een cel of een batterij onder referentieomstandigheden. @nl
comment: Opór wobec przepływu prądu wewnątrz ogniwa lub akumulatora w warunkach referencyjnych. @pl
comment: A oposição ao fluxo de corrente dentro de uma célula ou de uma bateria em condições de referência. @pt
comment: Opoziția la fluxul de curent în interiorul unei celule sau al unei baterii în condiții de referință. @ro
comment: Odpor voči toku prúdu v článku alebo batérii za referenčných podmienok. @sk
comment: Upor proti toku toka znotraj celice ali baterije pod referenčnimi pogoji. @sl
comment: Motståndet mot strömflödet i en cell eller ett batteri under referensförhållanden. @sv
domain: Internal Resistance
range: xsd:double
related match: PropertyValue
related match: ProductCharacteristic

Internal resistance increase of pack
type: DatatypeProperty
governed by: DIN DKE SPEC 99100
unit: Percent
source: Source: ESPR - Annex XIII (1)
label: Увеличаване на вътрешното съпротивление на пакета @bg
label: Nárůst vnitřního odporu sady @cs
label: Forøgelse af den interne modstand i pakken @da
label: Erhöhung des Innenwiderstands des Pakets @de
label: Αύξηση της εσωτερικής αντίστασης του πακέτου @el
label: Aumento de la resistencia interna del paquete @es
label: Paki sisemise takistuse suurenemine @et
label: Pakkauksen sisäisen vastuksen kasvu @fi
label: Augmentation de la résistance interne du pack @fr
label: Méadú ar fhriotaíocht inmheánach an phacáiste @ga
label: Povećanje unutarnjeg otpora paketa @hr
label: A csomag belső ellenállásának növekedése @hu
label: Aumento della resistenza interna del pacco @it
label: Pakuotės vidinės varžos padidėjimas @lt
label: Iepakojuma iekšējās pretestības palielināšanās @lv
label: Żieda fir-reżistenza interna tal-pakkett @mt
label: Toename van de interne weerstand van het pakket @nl
label: Wzrost rezystancji wewnętrznej pakietu @pl
label: Aumento da resistência interna do pacote @pt
label: Creșterea rezistenței interne a pachetului @ro
label: Zvýšenie vnútorného odporu balenia @sk
label: Povečanje notranje upornosti paketa @sl
label: Ökning av det interna motståndet i paketet @sv
comment: The increase over time and upon usage of internal resistance.
comment: Увеличаването във времето и при използване на вътрешното съпротивление. @bg
comment: Nárůst vnitřního odporu v čase a při používání. @cs
comment: Stigningen over tid og ved brug af intern modstand. @da
comment: Die Zunahme des Innenwiderstands im Laufe der Zeit und bei Gebrauch. @de
comment: Η αύξηση της εσωτερικής αντίστασης με την πάροδο του χρόνου και κατά τη χρήση. @el
comment: El aumento con el tiempo y el uso de la resistencia interna. @es
comment: Sisetakistuse suurenemine aja jooksul ja kasutamisel. @et
comment: Sisäisen vastuksen kasvu ajan ja käytön myötä. @fi
comment: L'augmentation dans le temps et à l'usage de la résistance interne. @fr
comment: An méadú le himeacht ama agus ar úsáid na friotaíochta inmheánaí. @ga
comment: Povećanje unutarnjeg otpora tijekom vremena i nakon uporabe. @hr
comment: A belső ellenállás növekedése az idő és a használat során. @hu
comment: L'aumento nel tempo e con l'uso della resistenza interna. @it
comment: Vidinis atsparumas didėja laikui bėgant ir naudojant. @lt
comment: Iekšējās pretestības palielināšanās laika gaitā un lietošanas laikā. @lv
comment: Iż-żieda maż-żmien u mal-użu tar-reżistenza interna. @mt
comment: De toename in de tijd en bij gebruik van de interne weerstand. @nl
comment: Wzrost rezystancji wewnętrznej w czasie i w trakcie użytkowania. @pl
comment: O aumento ao longo do tempo e mediante o uso da resistência interna. @pt
comment: Creșterea în timp și la utilizarea rezistenței interne. @ro
comment: Nárast vnútorného odporu v priebehu času a pri používaní. @sk
comment: Povečanje notranje upornosti skozi čas in ob uporabi. @sl
comment: Ökningen av det interna motståndet över tid och vid användning. @sv
domain: Internal Resistance
range: xsd:double
related match: PropertyValue
related match: ProductCharacteristic

Expected lifetime in calendar years
type: DatatypeProperty
governed by: DIN DKE SPEC 99100
unit: Year
source: Source: ESPR - Annex XIII (1)
label: Очакван живот в календарни години @bg
label: Očekávaná životnost v kalendářních letech @cs
label: Forventet levetid i kalenderår @da
label: Erwartete Lebensdauer in Kalenderjahren @de
label: Αναμενόμενη διάρκεια ζωής σε ημερολογιακά έτη @el
label: Vida útil prevista en años civiles @es
label: Eeldatav eluiga kalendriaastates @et
label: Odotettu käyttöikä kalenterivuosina @fi
label: Durée de vie prévue en années civiles @fr
label: Saolré ionchais i mblianta féilire @ga
label: Očekivani životni vijek u kalendarskim godinama @hr
label: Várható élettartam naptári években @hu
label: Vita attesa in anni di calendario @it
label: Numatoma gyvavimo trukmė kalendoriniais metais @lt
label: Paredzamais kalpošanas laiks kalendārajos gados @lv
label: Stennija tal-ħajja f'snin kalendarji @mt
label: Verwachte levensduur in kalenderjaren @nl
label: Oczekiwana żywotność w latach kalendarzowych @pl
label: Vida útil esperada em anos civis @pt
label: Durata de viață preconizată în ani calendaristici @ro
label: Očakávaná životnosť v kalendárnych rokoch @sk
label: Pričakovana življenjska doba v koledarskih letih @sl
label: Förväntad livslängd i kalenderår @sv
comment: The expected life-time under the reference conditions for which they have been designed in calendar years.
comment: Очакваният живот при референтните условия, за които са проектирани в календарни години. @bg
comment: Očekávaná životnost za referenčních podmínek, pro které byly navrženy, v kalendářních letech. @cs
comment: Den forventede levetid under de referencebetingelser, som de er konstrueret til, i kalenderår. @da
comment: Die erwartete Lebensdauer unter den Referenzbedingungen, für die sie ausgelegt wurden, in Kalenderjahren. @de
comment: Η αναμενόμενη διάρκεια ζωής υπό τις συνθήκες αναφοράς για τις οποίες έχουν σχεδιαστεί σε ημερολογιακά έτη. @el
comment: La vida útil prevista en las condiciones de referencia para las que han sido diseñados en años civiles. @es
comment: Eeldatav eluiga võrdlustingimustes, milleks need on kavandatud kalendriaastates. @et
comment: Odotettu käyttöikä vertailuolosuhteissa, joihin ne on suunniteltu kalenterivuosina. @fi
comment: La durée de vie attendue dans les conditions de référence pour lesquelles ils ont été conçus en années civiles. @fr
comment: An saolré ionchais faoi na coinníollacha tagartha ar ceapadh iad ina leith i mblianta féilire. @ga
comment: Očekivani životni vijek pod referentnim uvjetima za koje su projektirani u kalendarskim godinama. @hr
comment: A referenciafeltételek mellett várható élettartam naptári években, amelyekre tervezték őket. @hu
comment: La durata di vita prevista nelle condizioni di riferimento per cui sono stati progettati in anni di calendario. @it
comment: Numatoma eksploatavimo trukmė etaloninėmis sąlygomis, kurioms jie buvo suprojektuoti kalendoriniais metais. @lt
comment: Paredzamais kalpošanas laiks atsauces apstākļos, kādiem tie ir paredzēti kalendārajos gados. @lv
comment: Il-ħajja mistennija taħt il-kundizzjonijiet ta' referenza li għalihom ġew iddisinjati fi snin kalendarji. @mt
comment: De verwachte levensduur onder de referentieomstandigheden waarvoor ze zijn ontworpen in kalenderjaren. @nl
comment: Oczekiwana żywotność w warunkach referencyjnych, dla których zostały zaprojektowane, w latach kalendarzowych. @pl
comment: A vida útil esperada nas condições de referência para as quais foram concebidos em anos civis. @pt
comment: Durata de viață preconizată în condițiile de referință pentru care au fost proiectate în ani calendaristici. @ro
comment: Očakávaná životnosť za referenčných podmienok, na ktoré boli navrhnuté, v kalendárnych rokoch. @sk
comment: Pričakovana življenjska doba pod referenčnimi pogoji, za katere so bili zasnovani v koledarskih letih. @sl
comment: Den förväntade livslängden under de referensförhållanden för vilka de har konstruerats i kalenderår. @sv
domain: Battery Lifetime
range: xsd:double
related match: duration

Expected lifetime: Number of charge-discharge cycles
type: DatatypeProperty
governed by: DIN DKE SPEC 99100
unit: Unitless
source: Source: ESPR - Annex XIII (1)
label: Очакван живот: Брой цикли на зареждане и разреждане @bg
label: Očekávaná životnost: Počet cyklů nabití a vybití @cs
label: Forventet levetid: Antal opladnings-afladningscyklusser @da
label: Erwartete Lebensdauer: Anzahl der Lade-Entlade-Zyklen @de
label: Αναμενόμενη διάρκεια ζωής: Αριθμός κύκλων φόρτισης-εκφόρτισης @el
label: Vida útil prevista: Número de ciclos de carga y descarga @es
label: Eeldatav eluiga: laadimis-tühjenemistsüklite arv @et
label: Odotettu käyttöikä: Lataus-purkausjaksojen määrä @fi
label: Durée de vie prévue : Nombre de cycles de charge-décharge @fr
label: Saolré ionchais: Líon na dtimthriallta luchtaithe-urscaoilte @ga
label: Očekivani životni vijek: Broj ciklusa punjenja i pražnjenja @hr
label: Várható élettartam: Töltési-kisütési ciklusok száma @hu
label: Vita attesa: Numero di cicli di carica-scarica @it
label: Numatoma gyvavimo trukmė: įkrovimo ir iškrovimo ciklų skaičius @lt
label: Paredzamais kalpošanas laiks: Uzlādes-izlādes ciklu skaits @lv
label: Stennija tal-ħajja: Numru ta' ċikli ta' ċarġ u skariku @mt
label: Verwachte levensduur: Aantal laad-ontlaadcycli @nl
label: Oczekiwana żywotność: Liczba cykli ładowania i rozładowania @pl
label: Vida útil esperada: Número de ciclos de carga-descarga @pt
label: Durata de viață preconizată: Numărul de cicluri de încărcare-descărcare @ro
label: Očakávaná životnosť: Počet cyklov nabíjania a vybíjania @sk
label: Pričakovana življenjska doba: Število ciklov polnjenja in praznjenja @sl
label: Förväntad livslängd: Antal laddnings-urladdningscykler @sv
comment: The expected life-time under the reference conditions for which they have been designed in terms of cycles.
comment: Очакваният живот при референтните условия, за които са проектирани по отношение на циклите. @bg
comment: Očekávaná životnost za referenčních podmínek, pro které byly navrženy, z hlediska cyklů. @cs
comment: Den forventede levetid under de referencebetingelser, som de er konstrueret til, i cyklusser. @da
comment: Die erwartete Lebensdauer unter den Referenzbedingungen, für die sie ausgelegt wurden, in Zyklen. @de
comment: Η αναμενόμενη διάρκεια ζωής υπό τις συνθήκες αναφοράς για τις οποίες έχουν σχεδιαστεί όσον αφορά τους κύκτους. @el
comment: La vida útil prevista en las condiciones de referencia para las que han sido diseñados en términos de ciclos. @es
comment: Eeldatav eluiga võrdlustingimustes, milleks need on ette nähtud tsüklite osas. @et
comment: Odotettu käyttöikä vertailuolosuhteissa, joihin ne on suunniteltu jaksojen osalta. @fi
comment: La durée de vie attendue dans les conditions de référence pour lesquelles ils ont été conçus en termes de cycles. @fr
comment: An saolré ionchais faoi na coinníollacha tagartha ar ceapadh iad ina leith i dtéarmaí timthriallta. @ga
comment: Očekivani životni vijek pod referentnim uvjetima za koje su projektirani u smislu ciklusa. @hr
comment: A referencia-körülmények között várható élettartam ciklusokban kifejezve. @hu
comment: La durata di vita prevista nelle condizioni di riferimento per cui sono stati progettati in termini di cicli. @it
comment: Numatoma eksploatavimo trukmė etaloninėmis sąlygomis, kurioms jie buvo suprojektuoti, išreikšta ciklais. @lt
comment: Paredzamais kalpošanas laiks atsauces apstākļos, kādiem tie ir paredzēti ciklu izteiksmē. @lv
comment: Il-ħajja mistennija taħt il-kundizzjonijiet ta' referenza li għalihom ġew iddisinjati f'termini ta' ċikli. @mt
comment: De verwachte levensduur onder de referentieomstandigheden waarvoor ze zijn ontworpen in termen van cycli. @nl
comment: Oczekiwana żywotność w warunkach referencyjnych, dla których zostały zaprojektowane, pod względem cykli. @pl
comment: A vida útil esperada nas condições de referência para as quais foram concebidos em termos de ciclos. @pt
comment: Durata de viață preconizată în condițiile de referință pentru care au fost proiectate în ceea ce privește ciclurile. @ro
comment: Očakávaná životnosť za referenčných podmienok, na ktoré boli navrhnuté, z hľadiska cyklov. @sk
comment: Pričakovana življenjska doba pod referenčnimi pogoji, za katere so bili zasnovani v smislu ciklov. @sl
comment: Den förväntade livslängden under de referensförhållanden för vilka de har konstruerats i termer av cykler. @sv
domain: Battery Lifetime
range: xsd:integer
related match: PropertyValue
related match: ProductCharacteristic

Number of full charging and discharging cycles
type: DatatypeProperty
governed by: DIN DKE SPEC 99100
unit: Unitless
source: Source: ESPR - Annex XIII (1)
label: Брой пълни цикли на зареждане и разреждане @bg
label: Počet úplných nabíjecích a vybíjecích cyklů @cs
label: Antal fulde opladnings- og afladningscyklusser @da
label: Anzahl der vollständigen Lade- und Entladezyklen @de
label: Αριθμός πλήρων κύκλων φόρτισης και εκφόρτισης @el
label: Número de ciclos completos de carga y descarga @es
label: Täielike laadimis- ja tühjendustsüklite arv @et
label: Täydellisten lataus- ja purkausjaksojen määrä @fi
label: Nombre de cycles complets de charge et de décharge @fr
label: Líon na dtimthriallta iomlána luchtaithe agus urscaoilte @ga
label: Broj punih ciklusa punjenja i pražnjenja @hr
label: A teljes töltési és kisütési ciklusok száma @hu
label: Numero di cicli completi di carica e scarica @it
label: Visų įkrovimo ir iškrovimo ciklų skaičius @lt
label: Pilnu uzlādes un izlādes ciklu skaits @lv
label: Numru ta' ċikli sħaħ ta' ċċarġjar u ħatt @mt
label: Aantal volledige laad- en ontlaadcycli @nl
label: Liczba pełnych cykli ładowania i rozładowania @pl
label: Número de ciclos completos de carga e descarga @pt
label: Numărul de cicluri complete de încărcare și descărcare @ro
label: Počet úplných nabíjacích a vybíjacích cyklov @sk
label: Število polnih ciklov polnjenja in praznjenja @sl
label: Antal fullständiga laddnings- och urladdningscykler @sv
comment: The value for the number of full charging and discharging cycles should result from the aggregation of partial cycles occurring in the use phase.
comment: Стойността за броя на пълните цикли на зареждане и разреждане трябва да е резултат от агрегирането на частични цикли, възникващи във фазата на използване. @bg
comment: Hodnota počtu úplných nabíjecích a vybíjecích cyklů by měla být výsledkem agregace dílčích cyklů, ke kterým dochází ve fázi používání. @cs
comment: Værdien for antallet af fulde opladnings- og afladningscyklusser bør være resultatet af en aggregering af de delvise cyklusser, der forekommer i brugsfasen. @da
comment: Der Wert für die Anzahl der vollständigen Lade- und Entladezyklen sollte sich aus der Aggregation von Teilzyklen ergeben, die in der Nutzungsphase auftreten. @de
comment: Η τιμή για τον αριθμό των πλήρων κύκλων φόρτισης και εκφόρτισης θα πρέπει να προκύπτει από τη συνάθροιση των μερικών κύκλων που συμβαίνουν στη φάση χρήσης. @el
comment: El valor del número de ciclos completos de carga y descarga debe resultar de la agregación de los ciclos parciales que se producen en la fase de uso. @es
comment: Täielike laadimis- ja tühjendustsüklite arvu väärtus peaks tulenema kasutusetapis esinevate osaliste tsüklite liitmisest. @et
comment: Täysien lataus- ja purkausjaksojen lukumäärän arvon tulisi johtua käyttöjakson aikana tapahtuvien osittaisten jaksojen yhteenlaskemisesta. @fi
comment: La valeur du nombre de cycles complets de charge et de décharge doit résulter de l'agrégation des cycles partiels se produisant dans la phase d'utilisation. @fr
comment: Ba cheart go dtiocfadh luach líon na dtimthriallta iomlána luchtaithe agus urscaoilte as comhiomlánú na dtimthriallta páirteach a tharlaíonn sa chéim úsáide. @ga
comment: Vrijednost za broj punih ciklusa punjenja i pražnjenja trebala bi proizlaziti iz zbrajanja djelomičnih ciklusa koji se javljaju u fazi uporabe. @hr
comment: A teljes töltési és kisütési ciklusok számának értékét a használati fázisban előforduló részleges ciklusok összesítéséből kell levezetni. @hu
comment: Il valore del numero di cicli completi di carica e scarica deve risultare dall'aggregazione dei cicli parziali che si verificano nella fase di utilizzo. @it
comment: Visų įkrovimo ir iškrovimo ciklų skaičiaus vertė turėtų būti nustatyta pagal dalinių ciklų, vykstančių naudojimo etape, visumą. @lt
comment: Pilnu uzlādes un izlādes ciklu skaita vērtībai jābūt daļēju ciklu summēšanas rezultātam, kas notiek lietošanas fāzē. @lv
comment: Il-valur għan-numru ta 'ċikli sħaħ ta' ċċarġjar u ħatt għandu jirriżulta mill-aggregazzjoni ta 'ċikli parzjali li jseħħu fil-fażi tal-użu. @mt
comment: De waarde voor het aantal volledige laad- en ontlaadcycli moet het resultaat zijn van de aggregatie van gedeeltelijke cycli die optreden in de gebruiksfase. @nl
comment: Wartość liczby pełnych cykli ładowania i rozładowania powinna wynikać z agregacji cykli częściowych występujących w fazie użytkowania. @pl
comment: O valor para o número de ciclos completos de carga e descarga deve resultar da agregação de ciclos parciais que ocorrem na fase de utilização. @pt
comment: Valoarea pentru numărul de cicluri complete de încărcare și descărcare ar trebui să rezulte din agregarea ciclurilor parțiale care au loc în faza de utilizare. @ro
comment: Hodnota počtu úplných nabíjacích a vybíjacích cyklov by mala byť výsledkom agregácie čiastkových cyklov, ktoré sa vyskytujú vo fáze používania. @sk
comment: Vrednost za število polnih ciklov polnjenja in praznjenja mora biti rezultat združevanja delnih ciklov, ki se pojavijo v fazi uporabe. @sl
comment: Värdet för antalet fullständiga laddnings- och urladdningscykler bör vara resultatet av en aggregering av partiella cykler som inträffar i användningsfasen. @sv
domain: Battery Lifetime
range: xsd:integer
related match: value

Cycle-life reference test
type: DatatypeProperty
governed by: DIN DKE SPEC 99100
source: Source: ESPR - Annex XIII (1)
label: Референтен тест за живот на цикъла @bg
label: Referenční test životnosti @cs
label: Referencetest for cykluslevetid @da
label: Referenztest für die Zykluslebensdauer @de
label: Δοκιμή αναφοράς κύκλου ζωής @el
label: Prueba de referencia del ciclo de vida @es
label: Tsükli eluea võrdluskatse @et
label: Käyttöiän vertailutesti @fi
label: Test de référence de la durée de vie du cycle @fr
label: Tástáil tagartha saolré @ga
label: Referentni test životnog ciklusa @hr
label: Ciklus-élettartam referenciateszt @hu
label: Test di riferimento del ciclo di vita @it
label: Ciklo trukmės etaloninis bandymas @lt
label: Cikla mūža atsauces tests @lv
label: Test ta' referenza taċ-ċiklu tal-ħajja @mt
label: Referentietest cyclusduur @nl
label: Test referencyjny cyklu życia @pl
label: Teste de referência do ciclo de vida @pt
label: Test de referință pentru ciclul de viață @ro
label: Referenčný test životnosti @sk
label: Referenčni preskus življenjske dobe cikla @sl
label: Referenstest för cykellivslängd @sv
comment: The reference test used for determining the expected battery lifetime in cycles.
comment: Референтният тест, използван за определяне на очаквания живот на батерията в цикли. @bg
comment: Referenční test použitý pro stanovení očekávané životnosti baterie v cyklech. @cs
comment: Den referencetest, der anvendes til at bestemme den forventede batterilevetid i cyklusser. @da
comment: Der Referenztest, der zur Bestimmung der erwarteten Batterielebensdauer in Zyklen verwendet wird. @de
comment: Η δοκιμή αναφοράς που χρησιμοποιείται για τον προσδιορισμό της αναμενόμενης διάρκειας ζωής της μπαταρίας σε κύκλους. @el
comment: La prueba de referencia utilizada para determinar la vida útil prevista de la batería en ciclos. @es
comment: Võrdluskatse, mida kasutatakse aku eeldatava eluea määramiseks tsüklites. @et
comment: Vertailutesti, jota käytetään akun odotetun käyttöiän määrittämiseen jaksoina. @fi
comment: Le test de référence utilisé pour déterminer la durée de vie attendue de la batterie en cycles. @fr
comment: An tástáil tagartha a úsáidtear chun saolré ionchais na ceallraí i dtimthriallta a chinneadh. @ga
comment: Referentni test koji se koristi za određivanje očekivanog vijeka trajanja baterije u ciklusima. @hr
comment: Az akkumulátor várható élettartamának ciklusokban történő meghatározására használt referenciateszt. @hu
comment: Il test di riferimento utilizzato per determinare la durata prevista della batteria in cicli. @it
comment: Etaloninis bandymas, naudojamas numatomam akumuliatoriaus tarnavimo laikui ciklais nustatyti. @lt
comment: Atsauces tests, ko izmanto, lai noteiktu paredzamo akumulatora kalpošanas laiku ciklos. @lv
comment: It-test ta' referenza użat biex jiddetermina l-ħajja mistennija tal-batterija f'ċikli. @mt
comment: De referentietest die wordt gebruikt voor het bepalen van de verwachte levensduur van de batterij in cycli. @nl
comment: Test referencyjny stosowany do określania oczekiwanej żywotności baterii w cyklach. @pl
comment: O teste de referência usado para determinar a vida útil esperada da bateria em ciclos. @pt
comment: Testul de referință utilizat pentru determinarea duratei de viață preconizate a bateriei în cicluri. @ro
comment: Referenčný test používaný na určenie očakávanej životnosti batérie v cykloch. @sk
comment: Referenčni preskus, ki se uporablja za določanje pričakovane življenjske dobe baterije v ciklih. @sl
comment: Referenstestet som används för att fastställa den förväntade batterilivslängden i cykler. @sv
domain: Battery Lifetime
range: xsd:string
related match: PropertyValue
related match: AdditionalProductClassificationDetails

C-rate of relevant cycle-life test
type: DatatypeProperty
governed by: DIN DKE SPEC 99100
unit: AmperePerAmpereHour
source: Source: ESPR - Annex XIII (1)
label: C-стойност на съответния тест за живот на цикъла @bg
label: C-rychlost příslušného testu životnosti @cs
label: C-rate for relevant cykluslevetidstest @da
label: C-Rate des relevanten Zykluslebensdauertests @de
label: Ρυθμός C της σχετικής δοκιμής κύκλου ζωής @el
label: Tasa C de la prueba de ciclo de vida pertinente @es
label: Vastava tsükli eluea testi C-määr @et
label: Asiaankuuluvan käyttöiän testin C-nopeus @fi
label: Taux C de l'essai de durée de vie de cycle pertinent @fr
label: C-ráta na tástála saolré-timthrialla ábhartha @ga
label: C-stopa relevantnog testa životnog ciklusa @hr
label: A vonatkozó ciklus-élettartam teszt C-rátája @hu
label: C-rate del test di ciclo di vita pertinente @it
label: Atitinkamo gyvavimo ciklo bandymo C sparta @lt
label: Attiecīgā cikla mūža testa C-likme @lv
label: C-rate tat-test rilevanti taċ-ċiklu tal-ħajja @mt
label: C-snelheid van de relevante levensduurtest @nl
label: Współczynnik C odpowiedniego testu żywotności cyklicznej @pl
label: Taxa C do ensaio de ciclo de vida relevante @pt
label: Rata C a testului de ciclu de viață relevant @ro
label: C-rýchlosť príslušného testu životnosti @sk
label: Stopnja C ustreznega preskusa življenjske dobe cikla @sl
label: C-hastighet för relevant cykellivslängdstest @sv
comment: Applied charge and discharge rate in terms of rated capacity (C-rate) of relevant cycle-life reference test.
comment: Приложена скорост на зареждане и разреждане по отношение на номиналния капацитет (C-rate) на съответния референтен тест за живот на цикъла. @bg
comment: Aplikovaná rychlost nabíjení a vybíjení z hlediska jmenovité kapacity (C-rate) příslušného referenčního testu životnosti. @cs
comment: Anvendt opladnings- og afladningshastighed i forhold til nominel kapacitet (C-rate) for den relevante referencetest for cykluslevetid. @da
comment: Angewandte Lade- und Entladerate in Bezug auf die Nennkapazität (C-Rate) des relevanten Zyklus-Lebensdauer-Referenztests. @de
comment: Εφαρμοσμένος ρυθμός φόρτισης και εκφόρτισης ως προς την ονομαστική χωρητικότητα (C-rate) της σχετικής δοκιμής αναφοράς κύκlu ζωής. @el
comment: Tasa de carga y descarga aplicada en términos de capacidad nominal (tasa C) de la prueba de referencia del ciclo de vida pertinente. @es
comment: Kohaldatud laadimis- ja tühjenemismäär nimivõimsuse (C-rate) alusel vastava tsükli eluea võrdluskatse puhul. @et
comment: Sovellettu lataus- ja purkausnopeus nimelliskapasiteetin (C-nopeus) mukaan asiaankuuluvassa käyttöiän vertailutestissä. @fi
comment: Taux de charge et de décharge appliqué en termes de capacité nominale (C-rate) de l'essai de référence de durée de vie de cycle pertinent. @fr
comment: Ráta luchtaithe agus urscaoilte feidhmeach i dtéarmaí toillte rátáilte (C-ráta) na tástála tagartha saolré-timthrialla ábhartha. @ga
comment: Primijenjena brzina punjenja i pražnjenja u smislu nazivnog kapaciteta (C-stopa) relevantnog referentnog testa životnog ciklusa. @hr
comment: Alkalmazott töltési és kisütési sebesség a névleges kapacitás (C-ráta) függvényében a vonatkozó ciklus-élettartam referenciateszt során. @hu
comment: Tasso di carica e scarica applicato in termini di capacità nominale (C-rate) del test di riferimento del ciclo di vita pertinente. @it
comment: Taikomas įkrovos ir iškrovos greitis, atsižvelgiant į vardinę talpą (C koeficientas), atliekant atitinkamą gyvavimo ciklo etaloninį bandymą. @lt
comment: Piemērotais uzlādes un izlādes ātrums attiecībā pret nominālo kapacitāti (C-likme) attiecīgajā cikla mūža atsauces testā. @lv
comment: Rata ta' ċarġ u skariku applikata f'termini ta' kapaċità nominali (C-rate) tat-test ta' referenza rilevanti taċ-ċiklu tal-ħajja. @mt
comment: Toegepaste laad- en ontlaadsnelheid in termen van nominale capaciteit (C-rate) van de relevante referentietest voor de levensduur. @nl
comment: Zastosowana szybkość ładowania i rozładowania w kategoriach pojemności znamionowej (współczynnik C) w odpowiednim teście referencyjnym cyklu życia. @pl
comment: Taxa de carga e descarga aplicada em termos de capacidade nominal (taxa C) do ensaio de referência de ciclo de vida relevante. @pt
comment: Rata de încărcare și descărcare aplicată în termeni de capacitate nominală (rata C) a testului de referință relevant pentru ciclul de viață. @ro
comment: Aplikovaná rýchlosť nabíjania a vybíjania z hľadiska menovitej kapacity (C-rate) príslušného referenčného testu životnosti. @sk
comment: Uporabljena stopnja polnjenja in praznjenja glede na nazivno zmogljivost (stopnja C) ustreznega referenčnega preskusa življenjske dobe cikla. @sl
comment: Tillämpad laddnings- och urladdningshastighet i termer av nominell kapacitet (C-hastighet) för relevant cykellivslängdsreferenstest. @sv
domain: Battery Lifetime
range: xsd:double
related match: value

Energy throughput
type: DatatypeProperty
governed by: DIN DKE SPEC 99100
unit: KilowattHour
source: Source: ESPR - Annex XIII (1)
label: Енергиен капацитет @bg
label: Energetická propustnost @cs
label: Gennemløb af energi @da
label: Energiedurchsatz @de
label: Διέλευση ενέργειας @el
label: Rendimiento energético @es
label: Energia läbilaskevõime @et
label: Energian läpäisykyky @fi
label: Débit d'énergie @fr
label: Tréchur fuinnimh @ga
label: Protok energije @hr
label: Energiaáramlás @hu
label: Produzione di energia @it
label: Energijos pralaidumas @lt
label: Enerģijas caurlaidspēja @lv
label: Rendiment tal-enerġija @mt
label: Energiedoorvoer @nl
label: Przepustowość energetyczna @pl
label: Rendimento energético @pt
label: Randament energetic @ro
label: Energetická priepustnosť @sk
label: Pretok energije @sl
label: Energegenomströmning @sv
comment: The overall sum of the energy throughput over the battery lifetime at a specific time during usage.
comment: Общата сума на енергийния капацитет през целия живот на батерията в определен момент по време на употреба. @bg
comment: Celková suma energetické propustnosti za dobu životnosti baterie v určitém čase během používání. @cs
comment: Den samlede sum af energigennemstrømningen i løbet af batteriets levetid på et bestemt tidspunkt under brugen. @da
comment: Die Gesamtsumme des Energiedurchsatzes über die Batterielebensdauer zu einem bestimmten Zeitpunkt während der Nutzung. @de
comment: Το συνολικό άθροισμα της ενεργειακής απόδοσης κατά τη διάρκεια ζωής της μπαταρίας σε μια συγκεκριμένη χρονική στιγμή κατά τη χρήση. @el
comment: La suma total del rendimiento energético a lo largo de la vida útil de la batería en un momento específico durante el uso. @es
comment: Energia läbilaskevõime kogusumma aku eluea jooksul konkreetsel ajahetkel kasutamise ajal. @et
comment: Energian kokonaisläpäisykyky akun elinkaaren aikana tiettynä käyttöaikana. @fi
comment: La somme globale du débit d'énergie sur la durée de vie de la batterie à un moment précis de son utilisation. @fr
comment: Suim iomlán an tréchuir fuinnimh thar shaolré na ceallraí ag am ar leith le linn úsáide. @ga
comment: Ukupni zbroj protoka energije tijekom životnog vijeka baterije u određeno vrijeme tijekom uporabe. @hr
comment: Az akkumulátor élettartama alatt, a használat egy adott időpontjában mért teljes energiaáramlás. @hu
comment: La somma complessiva del rendimento energetico durante la vita della batteria in un momento specifico durante l'uso. @it
comment: Bendra energijos pralaidumo suma per visą akumuliatoriaus tarnavimo laiką tam tikru naudojimo metu. @lt
comment: Kopējā enerģijas caurlaidspējas summa visā akumulatora kalpošanas laikā noteiktā lietošanas brīdī. @lv
comment: Is-somma totali tar-rendiment tal-enerġija matul il-ħajja tal-batterija f'ħin speċifiku waqt l-użu. @mt
comment: De totale som van de energiedoorvoer gedurende de levensduur van de batterij op een specifiek tijdstip tijdens het gebruik. @nl
comment: Całkowita suma przepustowości energii w całym okresie eksploatacji baterii w określonym czasie jej użytkowania. @pl
comment: A soma total do rendimento energético ao longo da vida útil da bateria num momento específico durante a utilização. @pt
comment: Suma totală a randamentului energetic pe parcursul duratei de viață a bateriei la un anumit moment în timpul utilizării. @ro
comment: Celková suma energetickej priepustnosti počas životnosti batérie v určitom čase počas používania. @sk
comment: Skupna vsota pretoka energije v življenjski dobi baterije ob določenem času med uporabo. @sl
comment: Den totala summan av energigenomströmningen under batteriets livslängd vid en viss tidpunkt under användningen. @sv
domain: Battery Lifetime
range: xsd:double
related match: PropertyValue
related match: ProductCharacteristic

Capacity throughput
type: DatatypeProperty
governed by: DIN DKE SPEC 99100
unit: AmpereHour
source: Source: ESPR - Annex XIII (1)
label: Капацитет на пропускане @bg
label: Kapacitní propustnost @cs
label: Kapacitetsgennemstrømning @da
label: Kapazitätsdurchsatz @de
label: Διέλευση χωρητικότητας @el
label: Rendimiento de la capacidad @es
label: Mahutavuse läbilaskevõime @et
label: Kapasiteetin läpäisykyky @fi
label: Débit de capacité @fr
label: Tréchur toillte @ga
label: Propusnost kapaciteta @hr
label: Kapacitásáteresztő képesség @hu
label: Portata di capacità @it
label: Pralaidumo pajėgumas @lt
label: Kapacitātes caurlaidspēja @lv
label: Rendiment tal-kapaċità @mt
label: Capaciteitsdoorvoer @nl
label: Przepustowość pojemności @pl
label: Capacidade de produção @pt
label: Capacitate de transfer @ro
label: Kapacitná priepustnosť @sk
label: Pretočna zmogljivost @sl
label: Kapacitetsgenomströmning @sv
comment: The overall sum of the capacity throughput over the battery lifetime at a specific time during usage.
comment: Общата сума на пропускателния капацитет през живота на батерията в определен момент по време на употреба. @bg
comment: Celkový součet kapacity za dobu životnosti baterie v určitém čase během používání. @cs
comment: Den samlede sum af kapacitetsgennemstrømningen i løbet af batteriets levetid på et bestemt tidspunkt under brugen. @da
comment: Die Gesamtsumme des Kapazitätsdurchsatzes über die Batterielebensdauer zu einem bestimmten Zeitpunkt während der Nutzung. @de
comment: Το συνολικό άθροισμα της διέλευσης χωρητικότητας κατά τη διάρκεια ζωής της μπαταρίας σε μια συγκεκριμένη χρονική στιγμή κατά τη χρήση. @el
comment: La suma total de la capacidad de producción a lo largo de la vida útil de la batería en un momento específico durante el uso. @es
comment: Mahutavuse kogusumma aku eluea jooksul konkreetsel ajahetkel kasutamise ajal. @et
comment: Kapasiteetin kokonaisläpäisykyky akun elinkaaren aikana tiettynä käyttöaikana. @fi
comment: La somme globale du débit de capacité sur la durée de vie de la batterie à un moment précis de son utilisation. @fr
comment: Suim iomlán an tréchuir toillte thar shaolré na ceallraí ag am ar leith le linn úsáide. @ga
comment: Ukupni zbroj propusnosti kapaciteta tijekom životnog vijeka baterije u određeno vrijeme tijekom uporabe. @hr
comment: A kapacitáskihasználás teljes összege az akkumulátor élettartama alatt, a használat egy adott időpontjában. @hu
comment: La somma complessiva della produttività di capacità durante la vita della batteria in un momento specifico durante l'uso. @it
comment: Bendra pajėgumų pralaidumo suma per visą akumuliatoriaus tarnavimo laiką tam tikru naudojimo metu. @lt
comment: Kopējā jaudas caurlaidspējas summa visā akumulatora kalpošanas laikā noteiktā lietošanas brīdī. @lv
comment: Is-somma totali tal-kapaċità matul il-ħajja tal-batterija f'ħin speċifiku waqt l-użu. @mt
comment: De totale som van de capaciteitsdoorvoer gedurende de levensduur van de batterij op een specifiek tijdstip tijdens het gebruik. @nl
comment: Całkowita suma przepustowości w całym okresie eksploatacji baterii w określonym czasie jej użytkowania. @pl
comment: A soma total da capacidade de produção ao longo da vida útil da bateria num momento específico durante a utilização. @pt
comment: Suma totală a capacității de transfer pe parcursul duratei de viață a bateriei la un anumit moment în timpul utilizării. @ro
comment: Celkový súčet kapacity počas životnosti batérie v určitom čase počas používania. @sk
comment: Skupna vsota pretoka zmogljivosti v življenjski dobi baterije ob določenem času med uporabo. @sl
comment: Den totala summan av kapacitetsgenomströmningen under batteriets livslängd vid en viss tidpunkt under användningen. @sv
domain: Battery Lifetime
range: xsd:double
related match: PropertyValue
related match: AdditionalProductClassificationDetails

Capacity threshold for exhaustion
type: DatatypeProperty
governed by: DIN DKE SPEC 99100
unit: Percent
source: Source: ESPR - Annex XIII (1)
label: Праг на капацитета за изчерпване @bg
label: Kapacitní práh pro vyčerpání @cs
label: Kapacitetstærskel for udtømning @da
label: Kapazitätsschwelle für die Erschöpfung @de
label: Όριο χωρητικότητας για εξάντληση @el
label: Umbral de capacidad de agotamiento @es
label: Ammendumise võimsuspiir @et
label: Kapasiteetin kynnysarvo loppuun käytetylle @fi
label: Seuil de capacité d'épuisement @fr
label: Tairseach toillte le haghaidh ídithe @ga
label: Prag kapaciteta za iscrpljivanje @hr
label: Kimerülési kapacitásküszöb @hu
label: Soglia di capacità per l'esaurimento @it
label: Išsekimo ribinė talpa @lt
label: Izsīkuma kapacitātes slieksnis @lv
label: Limitu tal-kapaċità għall-eżawriment @mt
label: Capaciteitsdrempel voor uitputting @nl
label: Próg pojemności do wyczerpania @pl
label: Limiar de capacidade de exaustão @pt
label: Pragul de capacitate pentru epuizare @ro
label: Kapacitný prah pre vyčerpanie @sk
label: Mejna vrednost zmogljivosti za izčrpanje @sl
label: Kapacitetströskel för utmattning @sv
comment: The percentage of SOCE, above which the battery is still considered operational.
comment: Процентът на SOCE, над който батерията все още се счита за работеща. @bg
comment: Procento SOCE, nad kterým je baterie stále považována za provozuschopnou. @cs
comment: Den procentdel af SOCE, over hvilken batteriet stadig betragtes som funktionsdygtigt. @da
comment: Der Prozentsatz des SOCE, oberhalb dessen die Batterie noch als betriebsbereit gilt. @de
comment: Το ποσοστό του SOCE, πάνω από το οποίο η μπαταρία εξακολουθεί να θεωρείται λειτουργική. @el
comment: El porcentaje de SOCE por encima del cual la batería se sigue considerando operativa. @es
comment: SOCE protsent, millest kõrgemal loetakse aku endiselt töökorras olevaks. @et
comment: SOCE:n prosenttiosuus, jonka yläpuolella akkua pidetään edelleen toimintakuntoisena. @fi
comment: Le pourcentage de SOCE au-dessus duquel la batterie est encore considérée comme opérationnelle. @fr
comment: An céatadán de SOCE, a meastar go bhfuil an ceallraí fós ag feidhmiú os a chionn. @ga
comment: Postotak SOCE-a iznad kojeg se baterija i dalje smatra operativnom. @hr
comment: A SOCE százalékos aránya, amely felett az akkumulátor még működőképesnek minősül. @hu
comment: La percentuale di SOCE al di sopra della quale la batteria è ancora considerata operativa. @it
comment: SOCE procentinė dalis, virš kurios akumuliatorius vis dar laikomas veikiančiu. @lt
comment: SOCE procentuālais daudzums, virs kura akumulators joprojām tiek uzskatīts par darbināmu. @lv
comment: Il-perċentwal tas-SOCE, li 'l fuq minnu l-batterija għadha meqjusa operattiva. @mt
comment: Het percentage van de SOCE waarboven de batterij nog als operationeel wordt beschouwd. @nl
comment: Procent SOCE, powyżej którego bateria jest nadal uważana za sprawną. @pl
comment: A percentagem de SOCE acima da qual a bateria ainda é considerada operacional. @pt
comment: Procentajul de SOCE, peste care bateria este încă considerată operațională. @ro
comment: Percento SOCE, nad ktorým sa batéria stále považuje za prevádzkyschopnú. @sk
comment: Odstotek SOCE, nad katerim se baterija še vedno šteje za delujočo. @sl
comment: Den procentandel av SOCE över vilken batteriet fortfarande anses vara funktionsdugligt. @sv
domain: Battery Lifetime
range: xsd:double
related match: PropertyValue
related match: ProductCharacteristic

Temperature range idle state, lower boundary
type: DatatypeProperty
governed by: DIN DKE SPEC 99100
unit: DegreeCelsius
source: Source: ESPR - Annex XIII (1)
label: Температурен диапазон в неактивно състояние, долна граница @bg
label: Teplotní rozsah v klidovém stavu, spodní hranice @cs
label: Temperaturområde i dvaletilstand, nedre grænse @da
label: Temperaturbereich Ruhezustand, untere Grenze @de
label: Εύρος θερμοκρασίας σε κατάσταση αδράνειας, κάτω όριο @el
label: Rango de temperatura en reposo, límite inferior @es
label: Temperatuurivahemiku tühikäigul, alumine piir @et
label: Lämpötila-alueen lepotila, alaraja @fi
label: Plage de température à l'état de repos, limite inférieure @fr
label: Raon teochta i stát díomhaoin, an teorainn íochtarach @ga
label: Temperaturni raspon u stanju mirovanja, donja granica @hr
label: Hőmérséklet-tartomány üresjárati állapotban, alsó határ @hu
label: Intervallo di temperatura stato di inattività, limite inferiore @it
label: Temperatūros diapazono tuščiosios eigos būsena, apatinė riba @lt
label: Temperatūras diapazona dīkstāves stāvoklis, apakšējā robeža @lv
label: Firxa tat-temperatura fl-istat idle, konfini t'isfel @mt
label: Temperatuurbereik rusttoestand, ondergrens @nl
label: Zakres temperatur w stanie spoczynku, dolna granica @pl
label: Faixa de temperatura em estado de repouso, limite inferior @pt
label: Intervalul de temperatură în stare de repaus, limita inferioară @ro
label: Teplotný rozsah v kľudovom stave, spodná hranica @sk
label: Temperaturno območje v stanju mirovanja, spodnja meja @sl
label: Temperaturområde i viloläge, nedre gräns @sv
comment: The lower boundary of the surrounding temperature range the battery can withstand when not in use.
comment: Долната граница на температурния диапазон на околната среда, на който батерията може да издържи, когато не се използва. @bg
comment: Spodní hranice rozsahu okolních teplot, které baterie vydrží, když se nepoužívá. @cs
comment: Den nedre grænse for det omgivende temperaturområde, som batteriet kan modstå, når det ikke er i brug. @da
comment: Die untere Grenze des Umgebungstemperaturbereichs, dem die Batterie standhalten kann, wenn sie nicht in Gebrauch ist. @de
comment: Το κάτω όριο του εύρους θερμοκρασίας περιβάλλοντος που μπορεί να αντέξει η μπαταρία όταν δεν χρησιμοποιείται. @el
comment: El límite inferior del rango de temperatura ambiente que la batería puede soportar cuando no está en uso. @es
comment: Ümbritseva temperatuurivahemiku alumine piir, mida aku talub, kui seda ei kasutata. @et
comment: Ympäröivän lämpötila-alueen alaraja, jonka akku kestää, kun se ei ole käytössä. @fi
comment: La limite inférieure de la plage de température ambiante que la batterie peut supporter lorsqu'elle n'est pas utilisée. @fr
comment: An teorainn íochtarach den raon teochta máguaird is féidir leis an gceallraí a sheasamh nuair nach bhfuil sé in úsáid. @ga
comment: Donja granica raspona okolne temperature koju baterija može podnijeti kada se ne koristi. @hr
comment: Az akkumulátor által használaton kívül elviselhető környezeti hőmérséklet-tartomány alsó határa. @hu
comment: Il limite inferiore dell'intervallo di temperatura ambiente che la batteria può sopportare quando non è in uso. @it
comment: Apatinė aplinkos temperatūros diapazono riba, kurią akumuliatorius gali atlaikyti, kai jis nenaudojamas. @lt
comment: Apkārtējās vides temperatūras diapazona apakšējā robeža, ko akumulators var izturēt, kad to neizmanto. @lv
comment: Il-konfini l-aktar baxx tal-firxa tat-temperatura tal-madwar li l-batterija tista 'tiflaħ għaliha meta ma tkunx qed tintuża. @mt
comment: De ondergrens van het omgevingstemperatuurbereik waartegen de batterij bestand is wanneer ze niet wordt gebruikt. @nl
comment: Dolna granica zakresu temperatur otoczenia, jaką akumulator może wytrzymać, gdy nie jest używany. @pl
comment: O limite inferior da faixa de temperatura ambiente que a bateria pode suportar quando não está em uso. @pt
comment: Limita inferioară a intervalului de temperatură înconjurătoare la care bateria poate rezista atunci când nu este utilizată. @ro
comment: Spodná hranica rozsahu okolitej teploty, ktorú batéria vydrží, keď sa nepoužíva. @sk
comment: Spodnja meja temperaturnega območja okolice, ki jo baterija prenese, kadar ni v uporabi. @sl
comment: Den nedre gränsen för det omgivande temperaturområde som batteriet tål när det inte används. @sv
domain: Temperature Conditions
range: xsd:double
related match: PropertyValue

Temperature range idle state, upper boundary
type: DatatypeProperty
governed by: DIN DKE SPEC 99100
unit: DegreeCelsius
source: Source: ESPR - Annex XIII (1)
label: Температурен диапазон в неактивно състояние, горна граница @bg
label: Teplotní rozsah v klidovém stavu, horní hranice @cs
label: Temperaturområde i dvaletilstand, øvre grænse @da
label: Temperaturbereich Ruhezustand, obere Grenze @de
label: Εύρος θερμοκρασίας σε κατάσταση αδράνειας, άνω όριο @el
label: Rango de temperatura en reposo, límite superior @es
label: Temperatuurivahemiku tühikäigul, ülemine piir @et
label: Lämpötila-alueen lepotila, yläraja @fi
label: Plage de température à l'état de repos, limite supérieure @fr
label: Raon teochta i stát díomhaoin, an teorainn uachtarach @ga
label: Temperaturni raspon u stanju mirovanja, gornja granica @hr
label: Hőmérséklet-tartomány üresjárati állapotban, felső határ @hu
label: Intervallo di temperatura stato di inattività, limite superiore @it
label: Temperatūros diapazono tuščiosios eigos būsena, viršutinė riba @lt
label: Temperatūras diapazona dīkstāves stāvoklis, augšējā robeža @lv
label: Firxa tat-temperatura fl-istat idle, konfini ta' fuq @mt
label: Temperatuurbereik rusttoestand, bovengrens @nl
label: Zakres temperatur w stanie spoczynku, górna granica @pl
label: Faixa de temperatura em estado de repouso, limite superior @pt
label: Intervalul de temperatură în stare de repaus, limita superioară @ro
label: Teplotný rozsah v kľudovom stave, horná hranica @sk
label: Temperaturno območje v stanju mirovanja, zgornja meja @sl
label: Temperaturområde i viloläge, övre gräns @sv
comment: The upper boundary of the surrounding temperature range the battery can withstand when not in use.
comment: Горната граница на температурния диапазон на околната среда, на който батерията може да издържи, когато не се използва. @bg
comment: Horní hranice rozsahu okolních teplot, které baterie vydrží, když se nepoužívá. @cs
comment: Den øverste grænse for det omgivende temperaturområde, som batteriet kan modstå, når det ikke er i brug. @da
comment: Die obere Grenze des Umgebungstemperaturbereichs, dem die Batterie standhalten kann, wenn sie nicht in Gebrauch ist. @de
comment: Το άνω όριο του εύρους θερμοκρασίας περιβάλλοντος που μπορεί να αντέξει η μπαταρία όταν δεν χρησιμοποιείται. @el
comment: El límite superior del rango de temperatura ambiente que la batería puede soportar cuando no está en uso. @es
comment: Ümbritseva temperatuurivahemiku ülemine piir, mida aku talub, kui seda ei kasutata. @et
comment: Ympäristön lämpötila-alueen yläraja, jonka akku kestää, kun se ei ole käytössä. @fi
comment: La limite supérieure de la plage de température ambiante que la batterie peut supporter lorsqu'elle n'est pas utilisée. @fr
comment: An teorainn uachtarach den raon teochta máguaird is féidir leis an gceallraí a sheasamh nuair nach bhfuil sé in úsáid. @ga
comment: Gornja granica raspona okolne temperature koju baterija može podnijeti kada se ne koristi. @hr
comment: Az akkumulátor által használaton kívül elviselhető környezeti hőmérséklet-tartomány felső határa. @hu
comment: Il limite superiore dell'intervallo di temperatura ambiente che la batteria può sopportare quando non è in uso. @it
comment: Viršutinė aplinkos temperatūros diapazono riba, kurią akumuliatorius gali atlaikyti, kai jis nenaudojamas. @lt
comment: Apkārtējās vides temperatūras diapazona augšējā robeža, ko akumulators var izturēt, kad to neizmanto. @lv
comment: Il-konfini ta' fuq tal-firxa tat-temperatura tal-madwar li l-batterija tista' tiflaħ għaliha meta ma tkunx qed tintuża. @mt
comment: De bovengrens van het omgevingstemperatuurbereik waartegen de batterij bestand is wanneer ze niet wordt gebruikt. @nl
comment: Górna granica zakresu temperatur otoczenia, jaką akumulator może wytrzymać, gdy nie jest używany. @pl
comment: O limite superior da faixa de temperatura ambiente que a bateria pode suportar quando não está em uso. @pt
comment: Limita superioară a intervalului de temperatură înconjurătoare la care bateria poate rezista atunci când nu este utilizată. @ro
comment: Horná hranica rozsahu okolitej teploty, ktorú batéria vydrží, keď sa nepoužíva. @sk
comment: Zgornja meja temperaturnega območja okolice, ki jo baterija prenese, kadar ni v uporabi. @sl
comment: Den övre gränsen för det omgivande temperaturområde som batteriet tål när det inte används. @sv
domain: Temperature Conditions
range: xsd:double
related match: PropertyValue

Time spent in extreme temperatures above boundary
type: DatatypeProperty
governed by: DIN DKE SPEC 99100
unit: Minute
source: Source: ESPR - Annex XIII (1)
label: Време, прекарано при екстремни температури над границата @bg
label: Čas strávený v extrémních teplotách nad hranicí @cs
label: Tid tilbragt i ekstreme temperaturer over grænsen @da
label: Zeit, die in extremen Temperaturen über der Grenze verbracht wurde @de
label: Χρόνος που δαπανάται σε ακραίες θερμοκρασίες πάνω από το όριο @el
label: Tiempo pasado en temperaturas extremas por encima del límite @es
label: Aeg, mis on veedetud äärmuslikes temperatuurides üle piiri @et
label: Aika, joka on vietetty äärilämpötiloissa rajan yläpuolella @fi
label: Temps passé à des températures extrêmes au-dessus de la limite @fr
label: Am a chaitear i dteochtaí foircneacha os cionn na teorann @ga
label: Vrijeme provedeno u ekstremnim temperaturama iznad granice @hr
label: A határ feletti szélsőséges hőmérsékleten eltöltött idő @hu
label: Tempo trascorso a temperature estreme al di sopra del limite @it
label: Laikas, praleistas esant ekstremalioms temperatūroms virš ribos @lt
label: Laiks, kas pavadīts ekstremālās temperatūrās virs robežas @lv
label: Ħin li nqatta' f'temperaturi estremi 'l fuq mil-limitu @mt
label: Tijd doorgebracht in extreme temperaturen boven de grens @nl
label: Czas spędzony w ekstremalnych temperaturach powyżej granicy @pl
label: Tempo gasto em temperaturas extremas acima do limite @pt
label: Timpul petrecut la temperaturi extreme peste limită @ro
label: Čas strávený v extrémnych teplotách nad hranicou @sk
label: Čas, preživet v ekstremnih temperaturah nad mejo @sl
label: Tid tillbringad i extrema temperaturer över gränsen @sv
comment: The aggregated time in which temperatures above the upper boundary of the temperature range are prevalent.
comment: Сумарното време, през което преобладават температури над горната граница на температурния диапазон. @bg
comment: Souhrnná doba, po kterou převládají teploty nad horní hranicí teplotního rozsahu. @cs
comment: Den samlede tid, hvor temperaturer over den øvre grænse af temperaturområdet er fremherskende. @da
comment: Die aggregierte Zeit, in der Temperaturen oberhalb der oberen Grenze des Temperaturbereichs vorherrschen. @de
comment: Ο συνολικός χρόνος κατά τον οποίο επικρατούν θερμοκρασίες πάνω από το ανώτερο όριο του εύρους θερμοκρασιών. @el
comment: El tiempo agregado en el que prevalecen temperaturas por encima del límite superior del rango de temperatura. @es
comment: Summeeritud aeg, mille jooksul valitsevad temperatuurid üle temperatuurivahemiku ülemise piiri. @et
comment: Yhteenlaskettu aika, jolloin lämpötila-alueen ylärajan ylittävät lämpötilat ovat vallitsevia. @fi
comment: Le temps agrégé pendant lequel les températures supérieures à la limite supérieure de la plage de température sont prédominantes. @fr
comment: An t-am comhiomlán ina bhfuil teochtaí os cionn teorainn uachtarach an raoin teochta i réim. @ga
comment: Ukupno vrijeme u kojem prevladavaju temperature iznad gornje granice temperaturnog raspona. @hr
comment: Az összesített idő, amely alatt a hőmérséklet-tartomány felső határa feletti hőmérsékletek uralkodnak. @hu
comment: Il tempo aggregato in cui prevalgono temperature superiori al limite superiore dell'intervallo di temperatura. @it
comment: Bendras laikas, per kurį vyrauja aukštesnė nei viršutinė temperatūros diapazono riba. @lt
comment: Kopējais laiks, kurā dominē temperatūra virs temperatūras diapazona augšējās robežas. @lv
comment: Il-ħin aggregat li fih jipprevalu temperaturi 'l fuq mil-limitu ta' fuq tal-firxa tat-temperatura. @mt
comment: De geaggregeerde tijd waarin temperaturen boven de bovengrens van het temperatuurbereik de overhand hebben. @nl
comment: Zagregowany czas, w którym dominują temperatury powyżej górnej granicy zakresu temperatur. @pl
comment: O tempo agregado em que prevalecem temperaturas acima do limite superior da faixa de temperatura. @pt
comment: Timpul agregat în care predomină temperaturile peste limita superioară a intervalului de temperatură. @ro
comment: Súhrnný čas, v ktorom prevládajú teploty nad hornou hranicou teplotného rozsahu. @sk
comment: Skupni čas, v katerem prevladujejo temperature nad zgornjo mejo temperaturnega območja. @sl
comment: Den sammanlagda tiden under vilken temperaturer över den övre gränsen för temperaturområdet är förhärskande. @sv
domain: Temperature Conditions
range: xsd:double
related match: PropertyValue

Time spent in extreme temperatures below boundary
type: DatatypeProperty
governed by: DIN DKE SPEC 99100
unit: Minute
source: Source: ESPR - Annex XIII (1)
label: Време, прекарано при екстремни температури под границата @bg
label: Čas strávený v extrémních teplotách pod hranicí @cs
label: Tid tilbragt i ekstreme temperaturer under grænsen @da
label: Zeit, die bei extremen Temperaturen unterhalb der Grenze verbracht wurde @de
label: Χρόνος που δαπανάται σε ακραίες θερμοκρασίες κάτω από το όριο @el
label: Tiempo pasado en temperaturas extremas por debajo del límite @es
label: Aeg, mis veedetakse äärmuslikes temperatuurides alla piiri @et
label: Aika, joka on vietetty äärilämpötiloissa rajan alapuolella @fi
label: Temps passé à des températures extrêmes en dessous de la limite @fr
label: Am a chaitear i dteochtaí foircneacha faoi bhun na teorann @ga
label: Vrijeme provedeno u ekstremnim temperaturama ispod granice @hr
label: A határ alatti szélsőséges hőmérsékleten eltöltött idő @hu
label: Tempo trascorso a temperature estreme al di sotto del limite @it
label: Laikas, praleistas esant ekstremalioms temperatūroms žemiau ribos @lt
label: Laiks, kas pavadīts ekstremālās temperatūrās zem robežas @lv
label: Ħin li nqatta' f'temperaturi estremi taħt il-limitu @mt
label: Tijd doorgebracht in extreme temperaturen onder de grens @nl
label: Czas spędzony w ekstremalnych temperaturach poniżej granicy @pl
label: Tempo gasto em temperaturas extremas abaixo do limite @pt
label: Timpul petrecut la temperaturi extreme sub limită @ro
label: Čas strávený v extrémnych teplotách pod hranicou @sk
label: Čas, preživet v ekstremnih temperaturah pod mejo @sl
label: Tid tillbringad i extrema temperaturer under gränsen @sv
comment: The aggregated time in which temperatures below the lower boundary of the temperature range are prevalent.
comment: Сумарното време, през което преобладават температури под долната граница на температурния диапазон. @bg
comment: Souhrnná doba, po kterou převládají teploty pod dolní hranicí teplotního rozsahu. @cs
comment: Den samlede tid, hvor temperaturer under den nedre grænse af temperaturområdet er fremherskende. @da
comment: Die aggregierte Zeit, in der Temperaturen unterhalb der unteren Grenze des Temperaturbereichs vorherrschen. @de
comment: Ο συνολικός χρόνος κατά τον οποίο επικρατούν θερμοκρασίες κάτω από το κατώτερο όριο του εύρους θερμοκρασιών. @el
comment: El tiempo agregado en el que prevalecen temperaturas por debajo del límite inferior del rango de temperatura. @es
comment: Summeeritud aeg, mille jooksul valitsevad temperatuurid alla temperatuurivahemiku alumise piiri. @et
comment: Yhteenlaskettu aika, jolloin lämpötila-alueen alarajan alittavat lämpötilat ovat vallitsevia. @fi
comment: Le temps agrégé pendant lequel les températures inférieures à la limite inférieure de la plage de température sont prédominantes. @fr
comment: An t-am comhiomlán ina bhfuil teochtaí faoi bhun theorainn íochtair an raoin teochta i réim. @ga
comment: Ukupno vrijeme u kojem prevladavaju temperature ispod donje granice temperaturnog raspona. @hr
comment: Az összesített idő, amely alatt a hőmérséklet-tartomány alsó határa alatti hőmérsékletek uralkodnak. @hu
comment: Il tempo aggregato in cui prevalgono temperature inferiori al limite inferiore dell'intervallo di temperatura. @it
comment: Bendras laikas, per kurį vyrauja žemesnė nei apatinė temperatūros diapazono riba. @lt
comment: Kopējais laiks, kurā dominē temperatūra zem temperatūras diapazona apakšējās robežas. @lv
comment: Il-ħin aggregat li fih jipprevalu temperaturi taħt il-limitu l-aktar baxx tal-firxa tat-temperatura. @mt
comment: De geaggregeerde tijd waarin temperaturen onder de ondergrens van het temperatuurbereik de overhand hebben. @nl
comment: Zagregowany czas, w którym dominują temperatury poniżej dolnej granicy zakresu temperatur. @pl
comment: O tempo agregado em que prevalecem temperaturas abaixo do limite inferior da faixa de temperatura. @pt
comment: Timpul agregat în care predomină temperaturile sub limita inferioară a intervalului de temperatură. @ro
comment: Súhrnný čas, v ktorom prevládajú teploty pod dolnou hranicou teplotného rozsahu. @sk
comment: Skupni čas, v katerem prevladujejo temperature pod spodnjo mejo temperaturnega območja. @sl
comment: Den sammanlagda tiden under vilken temperaturer under den nedre gränsen för temperaturområdet är förhärskande. @sv
domain: Temperature Conditions
range: xsd:double
related match: PropertyValue

Time spent charging during extreme temperatures above boundary
type: DatatypeProperty
governed by: DIN DKE SPEC 99100
unit: Minute
source: Source: ESPR - Annex XIII (1)
label: Време, прекарано в зареждане при екстремни температури над границата @bg
label: Doba strávená nabíjením při extrémních teplotách nad hranicí @cs
label: Tid brugt på opladning ved ekstreme temperaturer over grænsen @da
label: Zeit, die mit dem Laden bei extremen Temperaturen oberhalb der Grenze verbracht wird @de
label: Χρόνος φόρτισης σε ακραίες θερμοκρασίες πάνω από το όριο @el
label: Tiempo de carga a temperaturas extremas por encima del límite @es
label: Aeg, mis kulub laadimisele äärmuslikel temperatuuridel üle piiri @et
label: Latausaika äärimmäisissä lämpötiloissa rajan yläpuolella @fi
label: Temps de charge à des températures extrêmes au-dessus de la limite @fr
label: Am a chaitear ag luchtú le linn teochtaí foircneacha os cionn na teorann @ga
label: Vrijeme provedeno u punjenju tijekom ekstremnih temperatura iznad granice @hr
label: A határérték feletti szélsőséges hőmérsékleten történő töltéssel töltött idő @hu
label: Tempo trascorso in carica a temperature estreme sopra il limite @it
label: Laikas, praleistas kraunant esant ekstremalioms temperatūroms virš ribos @lt
label: Laiks, kas pavadīts, uzlādējot ekstremālās temperatūrās virs robežas @lv
label: Ħin mgħoddi jiċċarġja waqt temperaturi estremi 'l fuq mil-limitu @mt
label: Tijd besteed aan opladen bij extreme temperaturen boven de grens @nl
label: Czas ładowania w ekstremalnych temperaturach powyżej granicy @pl
label: Tempo gasto a carregar durante temperaturas extremas acima do limite @pt
label: Timpul petrecut la încărcare în timpul temperaturilor extreme peste limită @ro
label: Čas strávený nabíjaním pri extrémnych teplotách nad hranicou @sk
label: Čas, porabljen za polnjenje med ekstremnimi temperaturami nad mejo @sl
label: Tid som spenderas på laddning vid extrema temperaturer över gränsen @sv
comment: The aggregated time in which the battery is charged while temperatures above the upper boundary are prevalent.
comment: Агрегираното време, през което батерията се зарежда, докато преобладават температури над горната граница. @bg
comment: Souhrnná doba, po kterou je baterie nabita, zatímco převládají teploty nad horní mezí. @cs
comment: Den samlede tid, hvor batteriet oplades, mens temperaturer over den øvre grænse er fremherskende. @da
comment: Die aggregierte Zeit, in der die Batterie geladen wird, während Temperaturen oberhalb der oberen Grenze vorherrschen. @de
comment: Ο συνολικός χρόνος κατά τον οποίο η μπαταρία φορτίζεται ενώ επικρατούν θερμοκρασίες πάνω από το ανώτερο όριο. @el
comment: El tiempo agregado en el que se carga la batería mientras prevalecen temperaturas por encima del límite superior. @es
comment: Summeeritud aeg, mille jooksul akut laetakse, kui valitsevad temperatuurid üle ülemise piiri. @et
comment: Yhteenlaskettu aika, jolloin akkua ladataan, kun lämpötila on ylemmän rajan yläpuolella. @fi
comment: Le temps total pendant lequel la batterie est chargée alors que des températures supérieures à la limite supérieure sont prévalentes. @fr
comment: An t-am comhiomlán ina ngearrtar an ceallraí fad is a bhíonn teochtaí os cionn na teorann uachtair i réim. @ga
comment: Skupno vrijeme u kojem se baterija puni dok prevladavaju temperature iznad gornje granice. @hr
comment: Az összesített idő, amely alatt az akkumulátort töltik, miközben a felső határ feletti hőmérséklet uralkodik. @hu
comment: Il tempo aggregato in cui la batteria viene caricata mentre prevalgono temperature al di sopra del limite superiore. @it
comment: Bendras laikas, per kurį akumuliatorius įkraunamas, kai vyrauja aukštesnė nei viršutinė riba. @lt
comment: Apkopotais laiks, kurā akumulators tiek uzlādēts, kamēr valda temperatūra virs augšējās robežas. @lv
comment: Il-ħin aggregat li fih il-batterija tiġi ċċarġjata filwaqt li jipprevalu temperaturi 'l fuq mil-limitu ta' fuq. @mt
comment: De geaggregeerde tijd waarin de batterij wordt opgeladen terwijl de temperaturen boven de bovengrens heersen. @nl
comment: Zagregowany czas, w którym akumulator jest ładowany, gdy dominują temperatury powyżej górnej granicy. @pl
comment: O tempo agregado em que a bateria é carregada enquanto as temperaturas acima do limite superior prevalecem. @pt
comment: Timpul agregat în care bateria este încărcată în timp ce predomină temperaturi peste limita superioară. @ro
comment: Súhrnný čas, počas ktorého sa batéria nabíja, zatiaľ čo prevládajú teploty nad hornou hranicou. @sk
comment: Skupni čas, v katerem se baterija polni, medtem ko prevladujejo temperature nad zgornjo mejo. @sl
comment: Den sammanlagda tiden under vilken batteriet laddas medan temperaturer över den övre gränsen är vanliga. @sv
domain: Temperature Conditions
range: xsd:double
related match: PropertyValue

Time spent charging during extreme temperatures below boundary
type: DatatypeProperty
governed by: DIN DKE SPEC 99100
unit: Minute
source: Source: ESPR - Annex XIII (1)
label: Време, прекарано в зареждане при екстремни температури под границата @bg
label: Doba strávená nabíjením při extrémních teplotách pod hranicí @cs
label: Tid brugt på opladning ved ekstreme temperaturer under grænsen @da
label: Zeit, die mit dem Laden bei extremen Temperaturen unterhalb der Grenze verbracht wird @de
label: Χρόνος φόρτισης σε ακραίες θερμοκρασίες κάτω από το όριο @el
label: Tiempo de carga a temperaturas extremas por debajo del límite @es
label: Aeg, mis kulub laadimisele äärmuslikel temperatuuridel alla piiri @et
label: Latausaika äärimmäisissä lämpötiloissa rajan alapuolella @fi
label: Temps de charge à des températures extrêmes en dessous de la limite @fr
label: Am a chaitear ag luchtú le linn teochtaí foircneacha faoi bhun na teorann @ga
label: Vrijeme provedeno u punjenju tijekom ekstremnih temperatura ispod granice @hr
label: A határérték alatti szélsőséges hőmérsékleten történő töltéssel töltött idő @hu
label: Tempo trascorso in carica a temperature estreme al di sotto del limite @it
label: Laikas, praleistas kraunant esant ekstremalioms temperatūroms žemiau ribos @lt
label: Laiks, kas pavadīts, uzlādējot ekstremālās temperatūrās zem robežas @lv
label: Ħin mgħoddi jiċċarġja waqt temperaturi estremi taħt il-limitu @mt
label: Tijd besteed aan opladen bij extreme temperaturen onder de grens @nl
label: Czas ładowania w ekstremalnych temperaturach poniżej granicy @pl
label: Tempo gasto a carregar durante temperaturas extremas abaixo do limite @pt
label: Timpul petrecut la încărcare în timpul temperaturilor extreme sub limită @ro
label: Čas strávený nabíjaním pri extrémnych teplotách pod hranicou @sk
label: Čas, porabljen za polnjenje med ekstremnimi temperaturami pod mejo @sl
label: Tid som spenderas på laddning vid extrema temperaturer under gränsen @sv
comment: The aggregated time in which the battery is charged while temperatures below the lower boundary are prevalent.
comment: Агрегираното време, през което батерията се зарежда, докато преобладават температури под долната граница. @bg
comment: Souhrnná doba, po kterou je baterie nabita, zatímco převládají teploty pod dolní mezí. @cs
comment: Den samlede tid, hvor batteriet oplades, mens temperaturer under den nedre grænse er fremherskende. @da
comment: Die aggregierte Zeit, in der die Batterie geladen wird, während Temperaturen unterhalb der unteren Grenze vorherrschen. @de
comment: Ο συνολικός χρόνος κατά τον οποίο η μπαταρία φορτίζεται ενώ επικρατούν θερμοκρασίες κάτω από το κατώτερο όριο. @el
comment: El tiempo agregado en el que se carga la batería mientras prevalecen temperaturas por debajo del límite inferior. @es
comment: Summeeritud aeg, mille jooksul akut laetakse, kui valitsevad temperatuurid alla alampiiri. @et
comment: Yhteenlaskettu aika, jolloin akkua ladataan, kun lämpötila on alemman rajan alapuolella. @fi
comment: Le temps total pendant lequel la batterie est chargée alors que des températures inférieures à la limite inférieure sont prévalentes. @fr
comment: An t-am comhiomlán ina ngearrtar an ceallraí fad is a bhíonn teochtaí faoi bhun na teorann íochtair i réim. @ga
comment: Skupno vrijeme u kojem se baterija puni dok prevladavaju temperature ispod donje granice. @hr
comment: Az összesített idő, amely alatt az akkumulátort töltik, miközben az alsó határ alatti hőmérséklet uralkodik. @hu
comment: Il tempo aggregato in cui la batteria viene caricata mentre prevalgono temperature al di sotto del limite inferiore. @it
comment: Bendras laikas, per kurį akumuliatorius įkraunamas, kai vyrauja žemesnė nei apatinė riba. @lt
comment: Apkopotais laiks, kurā akumulators tiek uzlādēts, kamēr valda temperatūra zem apakšējās robežas. @lv
comment: Il-ħin aggregat li fih il-batterija tiġi ċċarġjata filwaqt li jipprevalu temperaturi taħt il-limitu t'isfel. @mt
comment: De geaggregeerde tijd waarin de batterij wordt opgeladen terwijl de temperaturen onder de ondergrens heersen. @nl
comment: Zagregowany czas, w którym akumulator jest ładowany, gdy dominują temperatury poniżej dolnej granicy. @pl
comment: O tempo agregado em que a bateria é carregada enquanto as temperaturas abaixo do limite inferior prevalecem. @pt
comment: Timpul agregat în care bateria este încărcată în timp ce predomină temperaturi sub limita inferioară. @ro
comment: Súhrnný čas, počas ktorého sa batéria nabíja, zatiaľ čo prevládajú teploty pod dolnou hranicou. @sk
comment: Skupni čas, v katerem se baterija polni, medtem ko prevladujejo temperature pod spodnjo mejo. @sl
comment: Den sammanlagda tiden under vilken batteriet laddas medan temperaturer under den nedre gränsen är vanliga. @sv
domain: Temperature Conditions
range: xsd:double
related match: PropertyValue

Number of deep discharge events
type: DatatypeProperty
governed by: DIN DKE SPEC 99100
unit: Unitless
source: Source: ESPR - Annex XIII (1)
label: Брой събития с дълбок разряд @bg
label: Počet událostí hlubokého vybití @cs
label: Antal dybe afladningshændelser @da
label: Anzahl der Tiefentladungsereignisse @de
label: Αριθμός συμβάντων βαθιάς εκφόρτισης @el
label: Número de eventos de descarga profunda @es
label: Sügavtühjenemise sündmuste arv @et
label: Syväpurkaustapahtumien määrä @fi
label: Nombre d'événements de décharge profonde @fr
label: Líon na n-imeachtaí doimhne urscaoilte @ga
label: Broj događaja dubokog pražnjenja @hr
label: Mélykisülési események száma @hu
label: Numero di eventi di scarica profonda @it
label: Gilaus iškrovimo įvykių skaičius @lt
label: Dziļās izlādes notikumu skaits @lv
label: Numru ta' avvenimenti ta' skariku profond @mt
label: Aantal diepe ontladingsgebeurtenissen @nl
label: Liczba zdarzeń głębokiego rozładowania @pl
label: Numărul de evenimente de descărcare profundă @ro
label: Počet udalostí hlbokého vybitia @sk
label: Število dogodkov globokega praznjenja @sl
label: Antal djupurladdningshändelser @sv
comment: The number of occasions in which voltage has dropped below the lower operational limit.
comment: Броят на случаите, в които напрежението е паднало под долната работна граница. @bg
comment: Počet případů, kdy napětí kleslo pod spodní provozní mez. @cs
comment: Antallet af tilfælde, hvor spændingen er faldet til under den nedre driftsgrænse. @da
comment: Die Anzahl der Fälle, in denen die Spannung unter die untere Betriebsgrenze gefallen ist. @de
comment: Ο αριθμός των περιπτώσεων κατά τις οποίες η τάση έχει πέσει κάτω από το κατώτερο λειτουργικό όριο. @el
comment: El número de ocasiones en que la tensión ha caído por debajo del límite operativo inferior. @es
comment: Juhtude arv, mil pinge on langenud alla alumise tööpiiri. @et
comment: Niiden kertojen lukumäärä, jolloin jännite on laskenut alemman toimintarajan alapuolelle. @fi
comment: Le nombre de fois où la tension est tombée en dessous de la limite opérationnelle inférieure. @fr
comment: Líon na n-ócáidí inar thit an voltas faoi bhun na teorann oibríochtúla íochtair. @ga
comment: Broj slučajeva u kojima je napon pao ispod donje radne granice. @hr
comment: Azoknak az eseteknek a száma, amikor a feszültség az alsó működési határ alá esett. @hu
comment: Il numero di occasioni in cui la tensione è scesa al di sotto del limite operativo inferiore. @it
comment: Atvejų, kai įtampa nukrito žemiau apatinės darbinės ribos, skaičius. @lt
comment: Gadījumu skaits, kad spriegums ir nokrities zem apakšējās darbības robežas. @lv
comment: L-għadd ta' okkażjonijiet li fihom il-vultaġġ niżel taħt il-limitu operattiv l-aktar baxx. @mt
comment: Het aantal keren dat de spanning onder de onderste operationele limiet is gedaald. @nl
comment: Liczba przypadków, w których napięcie spadło poniżej dolnej granicy eksploatacyjnej. @pl
comment: O número de ocasiões em que a tensão caiu abaixo do limite operacional inferior. @pt
comment: Numărul de ocazii în care tensiunea a scăzut sub limita operațională inferioară. @ro
comment: Počet prípadov, v ktorých napätie kleslo pod dolnú prevádzkovú hranicu. @sk
comment: Število primerov, v katerih je napetost padla pod spodnjo mejo delovanja. @sl
comment: Antalet tillfällen då spänningen har sjunkit under den nedre driftgränsen. @sv
domain: Negative Events and Accidents
range: xsd:integer
related match: Event

Number of overcharge events
type: DatatypeProperty
unit: Unitless
source: https://www.dinmedia.de/en/technical-rule/din-dke-spec-99100/385692321
label: Брой събития с презареждане @bg
label: Počet událostí přebití @cs
label: Antal overopladningshændelser @da
label: Anzahl der Überladungsereignisse @de
label: Αριθμός συμβάντων υπερφόρτισης @el
label: Número de eventos de sobrecarga @es
label: Ülelaadimise sündmuste arv @et
label: Ylilataustapahtumien määrä @fi
label: Nombre d'événements de surcharge @fr
label: Líon na n-imeachtaí rómhuirear @ga
label: Broj događaja prekomjernog punjenja @hr
label: Túltöltési események száma @hu
label: Numero di eventi di sovraccarico @it
label: Perkrovimo įvykių skaičius @lt
label: Pārlādes notikumu skaits @lv
label: Numru ta' avvenimenti ta' ħlas żejjed @mt
label: Aantal overbelastingsgebeurtenissen @nl
label: Liczba zdarzeń przeładowania @pl
label: Numărul de evenimente de supraîncărcare @ro
label: Počet udalostí prebitia @sk
label: Število dogodkov prenapolnjenosti @sl
label: Antal överladdningshändelser @sv
comment: The number of occasions in which voltage has increased above the upper operational limit.
comment: Броят на случаите, в които напрежението се е повишило над горната работна граница. @bg
comment: Počet případů, kdy napětí stouplo nad horní provozní mez. @cs
comment: Antallet af tilfælde, hvor spændingen er steget over den øvre driftsgrænse. @da
comment: Die Anzahl der Fälle, in denen die Spannung über die obere Betriebsgrenze gestiegen ist. @de
comment: Ο αριθμός των περιπτώσεων κατά τις οποίες η τάση έχει αυξηθεί πάνω από το ανώτερο λειτουργικό όριο. @el
comment: El número de ocasiones en que la tensión ha superado el límite operativo superior. @es
comment: Juhtude arv, mil pinge on tõusnud üle ülemise tööpiiri. @et
comment: Niiden kertojen lukumäärä, jolloin jännite on noussut ylemmän toimintarajan yläpuolelle. @fi
comment: Le nombre de fois où la tension a dépassé la limite opérationnelle supérieure. @fr
comment: Líon na n-ócáidí inar mhéadaigh an voltas os cionn na teorann oibríochtúla uachtair. @ga
comment: Broj slučajeva u kojima je napon porastao iznad gornje radne granice. @hr
comment: Azoknak az eseteknek a száma, amikor a feszültség a felső működési határ fölé emelkedett. @hu
comment: Il numero di occasioni in cui la tensione è aumentata al di sopra del limite operativo superiore. @it
comment: Atvejų, kai įtampa pakilo virš viršutinės darbinės ribos, skaičius. @lt
comment: Gadījumu skaits, kad spriegums ir palielinājies virs augšējās darbības robežas. @lv
comment: L-għadd ta' okkażjonijiet li fihom il-vultaġġ żdied 'il fuq mil-limitu operattiv ta' fuq. @mt
comment: Het aantal keren dat de spanning boven de bovenste operationele limiet is gestegen. @nl
comment: Liczba przypadków, w których napięcie wzrosło powyżej górnej granicy eksploatacyjnej. @pl
comment: O número de ocasiões em que a tensão aumentou acima do limite operacional superior. @pt
comment: Numărul de ocazii în care tensiunea a crescut peste limita operațională superioară. @ro
comment: Počet prípadov, v ktorých napätie stúplo nad hornú prevádzkovú hranicu. @sk
comment: Število primerov, v katerih se je napetost povečala nad zgornjo mejo delovanja. @sl
comment: Antalet tillfällen då spänningen har ökat över den övre driftgränsen. @sv
domain: Negative Events and Accidents
range: xsd:integer
related match: Event

Information on accidents
type: DatatypeProperty
governed by: DIN DKE SPEC 99100
source: Source: ESPR - Annex XIII (1)
label: Информация за произшествия @bg
label: Informace o nehodách @cs
label: Oplysninger om ulykker @da
label: Informationen zu Unfällen @de
label: Πληροφορίες για ατυχήματα @el
label: Información sobre accidentes @es
label: Teave õnnetuste kohta @et
label: Tietoja onnettomuuksista @fi
label: Informations sur les accidents @fr
label: Faisnéis faoi thionóiscí @ga
label: Informacije o nesrećama @hr
label: Információk a balesetekről @hu
label: Informazioni sugli incidenti @it
label: Informacija apie nelaimingus atsitikimus @lt
label: Informācija par negadījumiem @lv
label: Informazzjoni dwar l-inċidenti @mt
label: Informatie over ongevallen @nl
label: Informacje o wypadkach @pl
label: Informações sobre acidentes @pt
label: Informații despre accidente @ro
label: Informácie o nehodách @sk
label: Informacije o nesrečah @sl
label: Information om olyckor @sv
comment: Information and data resulting from use such as accidents, based on measuring abrupt positive or negative acceleration.
comment: Информация и данни, произтичащи от употреба, като например произшествия, въз основа на измерване на рязко положително или отрицателно ускорение. @bg
comment: Informace a údaje vyplývající z používání, jako jsou nehody, na základě měření náhlého kladného nebo záporného zrychlení. @cs
comment: Information og data som følge af brug, f.eks. ulykker, baseret på måling af brat positiv eller negativ acceleration. @da
comment: Informationen und Daten, die sich aus der Nutzung ergeben, wie z. B. Unfälle, basierend auf der Messung abrupter positiver oder negativer Beschleunigung. @de
comment: Πληροφορίες και δεδομένα που προκύπτουν από τη χρήση, όπως ατυχήματα, με βάση τη μέτρηση της απότομης θετικής ή αρνητικής επιτάχυνσης. @el
comment: Información y datos resultantes del uso, como accidentes, basados en la medición de la aceleración brusca positiva o negativa. @es
comment: Kasutamisest tulenev teave ja andmed, näiteks õnnetused, mis põhinevad järsu positiivse või negatiivse kiirenduse mõõtmisel. @et
comment: Käytöstä, kuten onnettomuuksista, saadut tiedot, jotka perustuvat äkillisen positiivisen tai negatiivisen kiihtyvyyden mittaamiseen. @fi
comment: Informations et données résultant de l'utilisation, telles que les accidents, basées sur la mesure d'une accélération brusque positive ou négative. @fr
comment: Faisnéis agus sonraí a eascraíonn as úsáid mar thionóiscí, bunaithe ar luasghéarú tobann dearfach nó diúltach a thomhas. @ga
comment: Informacije i podaci koji proizlaze iz uporabe, kao što su nesreće, na temelju mjerenja naglog pozitivnog ili negativnog ubrzanja. @hr
comment: A használatból származó információk és adatok, például balesetek, a hirtelen pozitív vagy negatív gyorsulás mérése alapján. @hu
comment: Informazioni e dati derivanti dall'uso, come gli incidenti, basati sulla misurazione di un'accelerazione brusca positiva o negativa. @it
comment: Informacija ir duomenys, gauti naudojant, pvz., nelaimingus atsitikimus, remiantis staigiu teigiamu arba neigiamu pagreičiu. @lt
comment: Informācija un dati, kas iegūti, lietojot, piemēram, negadījumus, pamatojoties uz pēkšņa pozitīva vai negatīva paātrinājuma mērīšanu. @lv
comment: Informazzjoni u data li tirriżulta mill-użu bħal inċidenti, ibbażata fuq il-kejl ta 'aċċelerazzjoni f'daqqa pożittiva jew negattiva. @mt
comment: Informatie en gegevens die voortvloeien uit gebruik, zoals ongevallen, op basis van het meten van abrupte positieve of negatieve versnelling. @nl
comment: Informacje i dane wynikające z użytkowania, takie jak wypadki, na podstawie pomiaru gwałtownego dodatniego lub ujemnego przyspieszenia. @pl
comment: Informações e dados resultantes do uso, como acidentes, com base na medição da aceleração abrupta positiva ou negativa. @pt
comment: Informații și date rezultate din utilizare, cum ar fi accidentele, bazate pe măsurarea accelerației bruște pozitive sau negative. @ro
comment: Informácie a údaje vyplývajúce z používania, ako sú nehody, na základe merania náhleho kladného alebo záporného zrýchlenia. @sk
comment: Informacije in podatki, ki izhajajo iz uporabe, kot so nesreče, ki temeljijo na merjenju nenadnega pozitivnega ali negativnega pospeška. @sl
comment: Information och data som härrör från användning, t.ex. olyckor, baserat på mätning av plötslig positiv eller negativ acceleration. @sv
domain: Negative Events and Accidents
range: xsd:string
related match: Event