DPP Core Ontology - EPD Indicators
type: Ontology
imports: Product.jsonld
imports: EPDMetadata.jsonld
imports: EPDLifecycle.jsonld
title: Основна онтология на DPP - Показатели за EPD @bg
title: Základní ontologie DPP - Indikátory EPD @cs
title: DPP-kerneontologi - EPD-indikatorer @da
title: DPP-Kernontologie - EPD-Indikatoren @de
title: Βασική Οντολογία DPP - Δείκτες EPD @el
title: Ontología principal de DPP - Indicadores de EPD @es
title: DPP põhi-ontoloogia - EPD indikaatorid @et
title: DPP-ydinontologia - EPD-indikaattorit @fi
title: Ontologie de base DPP - Indicateurs EPD @fr
title: Croí-Ointeolaíocht DPP - Táscairí EPD @ga
title: Osnovna ontologija DPP-a - EPD pokazatelji @hr
title: DPP alapontológia - EPD mutatók @hu
title: Ontologia di base DPP - Indicatori EPD @it
title: DPP pagrindinė ontologija - EPD rodikliai @lt
title: DPP pamatontoloģija - EPD rādītāji @lv
title: Ontoloġija Ewlenija tad-DPP - Indikaturi EPD @mt
title: DPP-kernontologie - EPD-indicatoren @nl
title: Podstawowa ontologia DPP - Wskaźniki EPD @pl
title: Ontologia principal do DPP - Indicadores de EPD @pt
title: Ontologia de bază DPP - Indicatori EPD @ro
title: Základná ontológia DPP - Indikátory EPD @sk
title: Osnovna ontologija DPP - Kazalniki EPD @sl
title: DPP-kärnontologi - EPD-indikatorer @sv
description: Defines the specific environmental impact indicators used in Environmental Product Declarations.
description: Дефинира специфичните показатели за въздействие върху околната среда, използвани в Екологичните продуктови декларации. @bg
description: Definuje specifické indikátory dopadu na životní prostředí používané v Environmentálních prohlášeních o produktu. @cs
description: Definerer de specifikke miljøpåvirkningsindikatorer, der anvendes i miljøvaredeklarationer. @da
description: Definiert die spezifischen Umweltwirkungsindikatoren, die in Umweltproduktdeklarationen verwendet werden. @de
description: Ορίζει τους ειδικούς δείκτες περιβαλλοντικών επιπτώσεων που χρησιμοποιούνται στις Περιβαλλοντικές Δηλώσεις Προϊόντων. @el
description: Define los indicadores específicos de impacto ambiental utilizados en las Declaraciones Ambientales de Producto. @es
description: Määratleb konkreetsed keskkonnamõju indikaatorid, mida kasutatakse keskkonnadeklaratsioonides. @et
description: Määrittää erityiset ympäristövaikutusindikaattorit, joita käytetään ympäristöselosteissa. @fi
description: Définit les indicateurs spécifiques d'impact environnemental utilisés dans les déclarations environnementales de produit. @fr
description: Sainmhíníonn sé na táscairí sainráite don tionchar ar an gcomhshaol a úsáidtear i nDearbhuithe Comhshaoil Táirge. @ga
description: Definira specifične pokazatelje utjecaja na okoliš koji se koriste u Izjavama o ekološkim svojstvima proizvoda. @hr
description: Meghatározza a környezetvédelmi terméknyilatkozatokban használt konkrét környezeti hatásmutatókat. @hu
description: Definisce gli specifici indicatori di impatto ambientale utilizzati nelle Dichiarazioni ambientali di prodotto. @it
description: Apibrėžia specifinius poveikio aplinkai rodiklius, naudojamus poveikio aplinkai deklaracijose. @lt
description: Definē konkrētus ietekmes uz vidi rādītājus, ko izmanto produkta vides deklarācijās. @lv
description: Jiddefinixxi l-indikaturi speċifiċi tal-impatt ambjentali użati fid-Dikjarazzjonijiet Ambjentali tal-Prodott. @mt
description: Definieert de specifieke milieueffectindicatoren die worden gebruikt in milieuproductverklaringen. @nl
description: Definiuje specyficzne wskaźniki wpływu na środowisko stosowane w deklaracjach środowiskowych produktu. @pl
description: Define os indicadores específicos de impacto ambiental utilizados nas Declarações Ambientais do Produto. @pt
description: Definește indicatorii specifici de impact asupra mediului utilizați în Declarațiile de mediu ale produsului. @ro
description: Definuje špecifické indikátory vplyvu na životné prostredie používané v environmentálnych vyhláseniach o produkte. @sk
description: Določa posebne kazalnike vpliva na okolje, ki se uporabljajo v okoljskih deklaracijah proizvoda. @sl
description: Definierar de specifika miljöpåverkansindikatorer som används i miljövarudeklarationer. @sv
version info: v3

Indicator
type: ObjectProperty
label: Показател @bg
label: Ukazatel @cs
label: Indikator @da
label: Δείκτης @el
label: Indicador @es
label: Indikaator @et
label: Indikaattori @fi
label: Indicateur @fr
label: Táscaire @ga
label: Pokazatelj @hr
label: Indikátor @hu
label: Indicatore @it
label: Rodiklis @lt
label: Rādītājs @lv
label: Indikatur @mt
label: Wskaźnik @pl
label: Ukazovateľ @sk
label: Kazalnik @sl
comment: A generic property representing an environmental impact indicator.
comment: Общо свойство, представляващо показател за въздействие върху околната среда. @bg
comment: Obecná vlastnost představující ukazatel dopadu na životní prostředí. @cs
comment: En generisk egenskab, der repræsenterer en miljøpåvirkningsindikator. @da
comment: Eine generische Eigenschaft, die einen Umweltwirkungsindikator darstellt. @de
comment: Μια γενική ιδιότητα που αντιπροσωπεύει έναν δείκτη περιβαλλοντικών επιπτώσεων. @el
comment: Una propiedad genérica que representa un indicador de impacto ambiental. @es
comment: Üldine omadus, mis esindab keskkonnamõju indikaatorit. @et
comment: Yleinen ominaisuus, joka edustaa ympäristövaikutusindikaattoria. @fi
comment: Une propriété générique représentant un indicateur d'impact environnemental. @fr
comment: Airí ginearálta a léiríonn táscaire tionchair comhshaoil. @ga
comment: Generičko svojstvo koje predstavlja pokazatelj utjecaja na okoliš. @hr
comment: Egy általános tulajdonság, amely egy környezeti hatásmutatót képvisel. @hu
comment: Una proprietà generica che rappresenta un indicatore di impatto ambientale. @it
comment: Bendroji savybė, reiškianti poveikio aplinkai rodiklį. @lt
comment: Vispārīga īpašība, kas atspoguļo ietekmes uz vidi rādītāju. @lv
comment: Proprjetà ġenerika li tirrappreżenta indikatur tal-impatt ambjentali. @mt
comment: Een generieke eigenschap die een milieueffectindicator vertegenwoordigt. @nl
comment: Właściwość ogólna reprezentująca wskaźnik wpływu na środowisko. @pl
comment: Uma propriedade genérica que representa um indicador de impacto ambiental. @pt
comment: O proprietate generică reprezentând un indicator de impact asupra mediului. @ro
comment: Všeobecná vlastnosť predstavujúca ukazovateľ vplyvu na životné prostredie. @sk
comment: Splošna lastnost, ki predstavlja kazalnik vpliva na okolje. @sl
comment: En generisk egenskap som representerar en miljöpåverkansindikator. @sv
domain: EPDBlock

Global Warming Potential
type: ObjectProperty
label: Потенциал за глобално затопляне @bg
label: Potenciál globálního oteplování @cs
label: Global opvarmningspotentiale @da
label: Globales Erwärmungspotential @de
label: Δυναμικό Παγκόσμιας Θέρμανσης @el
label: Potencial de calentamiento global @es
label: Globaalse soojenemise potentsiaal @et
label: Ilmaston lämmitysvaikutuspotentiaali @fi
label: Potentiel de réchauffement global @fr
label: Féidearthacht Teasa Domhanda @ga
label: Potencijal globalnog zagrijavanja @hr
label: Globális felmelegedési potenciál @hu
label: Potenziale di riscaldamento globale @it
label: Globalinio atšilimo potencialas @lt
label: Globālās sasilšanas potenciāls @lv
label: Potenzjal ta' sħana globali @mt
label: Global warming potential @nl
label: Potencjał tworzenia efektu cieplarnianego @pl
label: Potencial de aquecimento global @pt
label: Potențial de încălzire globală @ro
label: Potenciál globálneho otepľovania @sk
label: Potencial globalnega segrevanja @sl
label: Global uppvärmningspotential @sv
unit: KilogramCO2Equivalent
governed by: EN 15804:2012+A2:2019
sub property of: Indicator
domain: EPDBlock
range: ImpactValues
comment: Global Warming Potential
comment: Потенциал за глобално затопляне @bg
comment: Potenciál globálního oteplování @cs
comment: Global opvarmningspotentiale @da
comment: Globales Erwärmungspotential @de
comment: Δυναμικό Παγκόσμιας Θέρμανσης @el
comment: Potencial de calentamiento global @es
comment: Globaalse soojenemise potentsiaal @et
comment: Ilmaston lämmitysvaikutuspotentiaali @fi
comment: Potentiel de réchauffement global @fr
comment: Féidearthacht Teasa Domhanda @ga
comment: Potencijal globalnog zagrijavanja @hr
comment: Globális felmelegedési potenciál @hu
comment: Potenziale di riscaldamento globale @it
comment: Globalinio atšilimo potencialas @lt
comment: Globālās sasilšanas potenciāls @lv
comment: Potenzjal ta' sħana globali @mt
comment: Global warming potential @nl
comment: Potencjał tworzenia efektu cieplarnianego @pl
comment: Potencial de aquecimento global @pt
comment: Potențial de încălzire globală @ro
comment: Potenciál globálneho otepľovania @sk
comment: Potencial globalnega segrevanja @sl
comment: Global uppvärmningspotential @sv

Global Warming Potential, Fossil
type: ObjectProperty
label: Потенциал за глобално затопляне, изкопаеми горива @bg
label: Potenciál globálního oteplování, fosilní @cs
label: Global opvarmningspotentiale, fossilt @da
label: Globales Erwärmungspotential, fossile Quellen @de
label: Δυναμικό Παγκόσμιας Θέρμανσης, ορυκτά καύσιμα @el
label: Potencial de calentamiento global, fósil @es
label: Globaalse soojenemise potentsiaal, fossiilne @et
label: Ilmaston lämmitysvaikutuspotentiaali, fossiilinen @fi
label: Potentiel de réchauffement global, fossile @fr
label: Féidearthacht Teasa Domhanda, Fósil @ga
label: Potencijal globalnog zagrijavanja, fosilni @hr
label: Globális felmelegedési potenciál, fosszilis @hu
label: Potenziale di riscaldamento globale, fossile @it
label: Globalinio atšilimo potencialas, fosilinis @lt
label: Globālās sasilšanas potenciāls, fosilais @lv
label: Potenzjal ta' sħana globali, fossili @mt
label: Global warming potential, fossiel @nl
label: Potencjał tworzenia efektu cieplarnianego, paliwa kopalne @pl
label: Potencial de aquecimento global, fóssil @pt
label: Potențial de încălzire globală, fosil @ro
label: Potenciál globálneho otepľovania, fosílne @sk
label: Potencial globalnega segrevanja, fosilni @sl
label: Global uppvärmningspotential, fossil @sv
unit: KilogramCO2Equivalent
governed by: EN 15804:2012+A2:2019
sub property of: Indicator
domain: EPDBlock
range: ImpactValues
comment: Global Warming Potential, Fossil
comment: Потенциал за глобално затопляне, изкопаеми горива @bg
comment: Potenciál globálního oteplování, fosilní @cs
comment: Global opvarmningspotentiale, fossilt @da
comment: Globales Erwärmungspotential, fossile Quellen @de
comment: Δυναμικό Παγκόσμιας Θέρμανσης, ορυκτά καύσιμα @el
comment: Potencial de calentamiento global, fósil @es
comment: Globaalse soojenemise potentsiaal, fossiilne @et
comment: Ilmaston lämmitysvaikutuspotentiaali, fossiilinen @fi
comment: Potentiel de réchauffement global, fossile @fr
comment: Féidearthacht Teasa Domhanda, Fósil @ga
comment: Potencijal globalnog zagrijavanja, fosilni @hr
comment: Globális felmelegedési potenciál, fosszilis @hu
comment: Potenziale di riscaldamento globale, fossile @it
comment: Globalinio atšilimo potencialas, fosilinis @lt
comment: Globālās sasilšanas potenciāls, fosilais @lv
comment: Potenzjal ta' sħana globali, fossili @mt
comment: Global warming potential, fossiel @nl
comment: Potencjał tworzenia efektu cieplarnianego, paliwa kopalne @pl
comment: Potencial de aquecimento global, fóssil @pt
comment: Potențial de încălzire globală, fosil @ro
comment: Potenciál globálneho otepľovania, fosílne @sk
comment: Potencial globalnega segrevanja, fosilni @sl
comment: Global uppvärmningspotential, fossil @sv

Global Warming Potential, Biogenic
type: ObjectProperty
label: Потенциал за глобално затопляне, биогенен @bg
label: Potenciál globálního oteplování, biogenní @cs
label: Global opvarmningspotentiale, biogen @da
label: Globales Erwärmungspotential, biogen @de
label: Δυναμικό Παγκόσμιας Θέρμανσης, βιογενές @el
label: Potencial de calentamiento global, biogénico @es
label: Globaalse soojenemise potentsiaal, biogeenne @et
label: Ilmaston lämmitysvaikutuspotentiaali, biogeeninen @fi
label: Potentiel de réchauffement global, biogénique @fr
label: Féidearthacht Teasa Domhanda, Bithigineach @ga
label: Potencijal globalnog zagrijavanja, biogeni @hr
label: Globális felmelegedési potenciál, biogén @hu
label: Potenziale di riscaldamento globale, biogenico @it
label: Globalinio atšilimo potencialas, biogeninis @lt
label: Globālās sasilšanas potenciāls, biogēns @lv
label: Potenzjal ta' sħana globali, bijoġeniku @mt
label: Global warming potential, biogeen @nl
label: Potencjał tworzenia efektu cieplarnianego, biogeniczny @pl
label: Potencial de aquecimento global, biogênico @pt
label: Potențial de încălzire globală, biogenic @ro
label: Potenciál globálneho otepľovania, biogénny @sk
label: Potencial globalnega segrevanja, biogen @sl
label: Global uppvärmningspotential, biogen @sv
unit: KilogramCO2Equivalent
governed by: EN 15804:2012+A2:2019
sub property of: Indicator
domain: EPDBlock
range: ImpactValues
comment: Global Warming Potential, Biogenic
comment: Потенциал за глобално затопляне, биогенен @bg
comment: Potenciál globálního oteplování, biogenní @cs
comment: Global opvarmningspotentiale, biogen @da
comment: Globales Erwärmungspotential, biogen @de
comment: Δυναμικό Παγκόσμιας Θέρμανσης, βιογενές @el
comment: Potencial de calentamiento global, biogénico @es
comment: Globaalse soojenemise potentsiaal, biogeenne @et
comment: Ilmaston lämmitysvaikutuspotentiaali, biogeeninen @fi
comment: Potentiel de réchauffement global, biogénique @fr
comment: Féidearthacht Teasa Domhanda, Bithigineach @ga
comment: Potencijal globalnog zagrijavanja, biogeni @hr
comment: Globális felmelegedési potenciál, biogén @hu
comment: Potenziale di riscaldamento globale, biogenico @it
comment: Globalinio atšilimo potencialas, biogeninis @lt
comment: Globālās sasilšanas potenciāls, biogēns @lv
comment: Potenzjal ta' sħana globali, bijoġeniku @mt
comment: Global warming potential, biogeen @nl
comment: Potencjał tworzenia efektu cieplarnianego, biogeniczny @pl
comment: Potencial de aquecimento global, biogênico @pt
comment: Potențial de încălzire globală, biogenic @ro
comment: Potenciál globálneho otepľovania, biogénny @sk
comment: Potencial globalnega segrevanja, biogen @sl
comment: Global uppvärmningspotential, biogen @sv

Global Warming Potential, Land Use and Land Use Change
type: ObjectProperty
label: Потенциал за глобално затопляне, земеползване и промяна на земеползването @bg
label: Potenciál globálního oteplování, využití půdy a změny využití půdy @cs
label: Global opvarmningspotentiale, arealanvendelse og arealændringer @da
label: Globales Erwärmungspotential, Landnutzung und Landnutzungsänderung @de
label: Δυναμικό Παγκόσμιας Θέρμανσης, χρήση γης και αλλαγή χρήσης γης @el
label: Potencial de calentamiento global, uso y cambio de uso del suelo @es
label: Globaalse soojenemise potentsiaal, maakasutus ja maakasutuse muutus @et
label: Ilmaston lämmitysvaikutuspotentiaali, maa- ja maankäytön muutos @fi
label: Potentiel de réchauffement global, utilisation et changement de l'utilisation des terres @fr
label: Féidearthacht Teasa Domhanda, Úsáid Talún agus Athrú ar Úsáid Talún @ga
label: Potencijal globalnog zagrijavanja, korištenje zemljišta i promjena korištenja zemljišta @hr
label: Globális felmelegedési potenciál, földhasználat és földhasználat változás @hu
label: Potenziale di riscaldamento globale, uso e cambiamento del suolo @it
label: Globalinio atšilimo potencialas, žemės naudojimas ir jo pokyčiai @lt
label: Globālās sasilšanas potenciāls, zemes izmantošana un izmaiņas zemes izmantošanā @lv
label: Potenzjal ta' sħana globali, użu u bidla fl-użu tal-art @mt
label: Global warming potential, landgebruik en landgebruiksverandering @nl
label: Potencjał tworzenia efektu cieplarnianego, użytkowanie i zmiana użytkowania ziemi @pl
label: Potencial de aquecimento global, uso e alteração do uso do solo @pt
label: Potențial de încălzire globală, utilizarea și schimbarea utilizării terenurilor @ro
label: Potenciál globálneho otepľovania, využívanie pôdy a zmena využívania pôdy @sk
label: Potencial globalnega segrevanja, raba tal in spremembe rabe tal @sl
label: Global uppvärmningspotential, markanvändning och markanvändningsförändring @sv
unit: KilogramCO2Equivalent
governed by: EN 15804:2012+A2:2019
sub property of: Indicator
domain: EPDBlock
range: ImpactValues
comment: Global Warming Potential, Land Use and Land Use Change
comment: Потенциал за глобално затопляне, земеползване и промяна на земеползването @bg
comment: Potenciál globálního oteplování, využití půdy a změny využití půdy @cs
comment: Global opvarmningspotentiale, arealanvendelse og arealændringer @da
comment: Globales Erwärmungspotential, Landnutzung und Landnutzungsänderung @de
comment: Δυναμικό Παγκόσμιας Θέρμανσης, χρήση γης και αλλαγή χρήσης γης @el
comment: Potencial de calentamiento global, uso y cambio de uso del suelo @es
comment: Globaalse soojenemise potentsiaal, maakasutus ja maakasutuse muutus @et
comment: Ilmaston lämmitysvaikutuspotentiaali, maa- ja maankäytön muutos @fi
comment: Potentiel de réchauffement global, utilisation et changement de l'utilisation des terres @fr
comment: Féidearthacht Teasa Domhanda, Úsáid Talún agus Athrú ar Úsáid Talún @ga
comment: Potencijal globalnog zagrijavanja, korištenje zemljišta i promjena korištenja zemljišta @hr
comment: Globális felmelegedési potenciál, földhasználat és földhasználat változás @hu
comment: Potenziale di riscaldamento globale, uso e cambiamento del suolo @it
comment: Globalinio atšilimo potencialas, žemės naudojimas ir jo pokyčiai @lt
comment: Globālās sasilšanas potenciāls, zemes izmantošana un izmaiņas zemes izmantošanā @lv
comment: Potenzjal ta' sħana globali, użu u bidla fl-użu tal-art @mt
comment: Global warming potential, landgebruik en landgebruiksverandering @nl
comment: Potencjał tworzenia efektu cieplarnianego, użytkowanie i zmiana użytkowania ziemi @pl
comment: Potencial de aquecimento global, uso e alteração do uso do solo @pt
comment: Potențial de încălzire globală, utilizarea și schimbarea utilizării terenurilor @ro
comment: Potenciál globálneho otepľovania, využívanie pôdy a zmena využívania pôdy @sk
comment: Potencial globalnega segrevanja, raba tal in spremembe rabe tal @sl
comment: Global uppvärmningspotential, markanvändning och markanvändningsförändring @sv

Global Warming Potential, Greenhouse Gases
type: ObjectProperty
label: Потенциал за глобално затопляне, парникови газове @bg
label: Potenciál globálního oteplování, skleníkové plyny @cs
label: Global opvarmningspotentiale, drivhusgasser @da
label: Globales Erwärmungspotential, Treibhausgase @de
label: Δυναμικό Παγκόσμιας Θέρμανσης, αέρια του θερμοκηπίου @el
label: Potencial de calentamiento global, gases de efecto invernadero @es
label: Globaalse soojenemise potentsiaal, kasvuhoonegaasid @et
label: Ilmaston lämmitysvaikutuspotentiaali, kasvihuonekaasut @fi
label: Potentiel de réchauffement global, gaz à effet de serre @fr
label: Féidearthacht Teasa Domhanda, Gáis Cheapacháin Teasa @ga
label: Potencijal globalnog zagrijavanja, staklenički plinovi @hr
label: Globális felmelegedési potenciál, üvegházhatású gázok @hu
label: Potenziale di riscaldamento globale, gas serra @it
label: Globalinio atšilimo potencialas, šiltnamio efektą sukeliančios dujos @lt
label: Globālās sasilšanas potenciāls, siltumnīcefekta gāzes @lv
label: Potenzjal ta' sħana globali, gassijiet serra @mt
label: Global warming potential, broeikasgassen @nl
label: Potencjał tworzenia efektu cieplarnianego, gazy cieplarniane @pl
label: Potencial de aquecimento global, gases de efeito estufa @pt
label: Potențial de încălzire globală, gaze cu efect de seră @ro
label: Potenciál globálneho otepľovania, skleníkové plyny @sk
label: Potencial globalnega segrevanja, toplogredni plini @sl
label: Global uppvärmningspotential, växthusgaser @sv
unit: KilogramCO2Equivalent
governed by: EN 15804:2012+A2:2019
sub property of: Indicator
domain: EPDBlock
range: ImpactValues
comment: Global Warming Potential, Greenhouse Gases
comment: Потенциал за глобално затопляне, парникови газове @bg
comment: Potenciál globálního oteplování, skleníkové plyny @cs
comment: Global opvarmningspotentiale, drivhusgasser @da
comment: Globales Erwärmungspotential, Treibhausgase @de
comment: Δυναμικό Παγκόσμιας Θέρμανσης, αέρια του θερμοκηπίου @el
comment: Potencial de calentamiento global, gases de efecto invernadero @es
comment: Globaalse soojenemise potentsiaal, kasvuhoonegaasid @et
comment: Ilmaston lämmitysvaikutuspotentiaali, kasvihuonekaasut @fi
comment: Potentiel de réchauffement global, gaz à effet de serre @fr
comment: Féidearthacht Teasa Domhanda, Gáis Cheapacháin Teasa @ga
comment: Potencijal globalnog zagrijavanja, staklenički plinovi @hr
comment: Globális felmelegedési potenciál, üvegházhatású gázok @hu
comment: Potenziale di riscaldamento globale, gas serra @it
comment: Globalinio atšilimo potencialas, šiltnamio efektą sukeliančios dujos @lt
comment: Globālās sasilšanas potenciāls, siltumnīcefekta gāzes @lv
comment: Potenzjal ta' sħana globali, gassijiet serra @mt
comment: Global warming potential, broeikasgassen @nl
comment: Potencjał tworzenia efektu cieplarnianego, gazy cieplarniane @pl
comment: Potencial de aquecimento global, gases de efeito estufa @pt
comment: Potențial de încălzire globală, gaze cu efect de seră @ro
comment: Potenciál globálneho otepľovania, skleníkové plyny @sk
comment: Potencial globalnega segrevanja, toplogredni plini @sl
comment: Global uppvärmningspotential, växthusgaser @sv

Ozone Depletion Potential
type: ObjectProperty
label: Потенциал за изчерпване на озона @bg
label: Potenciál ničení ozonu @cs
label: Ozonnedbrydningspotentiale @da
label: Ozonabbaupotenzial @de
label: Δυναμικό Καταστροφής του Όζοντος @el
label: Potencial de agotamiento del ozono @es
label: Osoonikihi kadumise potentsiaal @et
label: Otsonikerroksen heikkenemispotentiaali @fi
label: Potentiel d’appauvrissement de la couche d’ozone @fr
label: Féidearthacht Laghdaithe Ózóin @ga
label: Potencijal za uništavanje ozonskog omotača @hr
label: Ózonréteg károsodási potenciál @hu
label: Potenziale di esaurimento dello strato di ozono @it
label: Ozoną mažinantis potencialas @lt
label: Ozona samazināšanās potenciāls @lv
label: Potenzjal ta' tnaqqis tal-ozonu @mt
label: Ozonelaagafbraakpotentieel @nl
label: Potencjał niszczenia warstwy ozonowej @pl
label: Potencial de esgotamento do ozono @pt
label: Potențial de epuizare a ozonului @ro
label: Potenciál poškodzovania ozónovej vrstvy @sk
label: Potencial za zmanjšanje ozonskega plašča @sl
label: Potential för nedbrytning av ozonskiktet @sv
unit: KilogramCFC11Equivalent
governed by: EN 15804:2012+A2:2019
sub property of: Indicator
domain: EPDBlock
range: ImpactValues
comment: Ozone Depletion Potential
comment: Потенциал за изчерпване на озона @bg
comment: Potenciál ničení ozonu @cs
comment: Ozonnedbrydningspotentiale @da
comment: Ozonabbaupotenzial @de
comment: Δυναμικό Καταστροφής του Όζοντος @el
comment: Potencial de agotamiento del ozono @es
comment: Osoonikihi kadumise potentsiaal @et
comment: Otsonikerroksen heikkenemispotentiaali @fi
comment: Potentiel d’appauvrissement de la couche d’ozone @fr
comment: Féidearthacht Laghdaithe Ózóin @ga
comment: Potencijal za uništavanje ozonskog omotača @hr
comment: Ózonréteg károsodási potenciál @hu
comment: Potenziale di esaurimento dello strato di ozono @it
comment: Ozoną mažinantis potencialas @lt
comment: Ozona samazināšanās potenciāls @lv
comment: Potenzjal ta' tnaqqis tal-ozonu @mt
comment: Ozonelaagafbraakpotentieel @nl
comment: Potencjał niszczenia warstwy ozonowej @pl
comment: Potencial de esgotamento do ozono @pt
comment: Potențial de epuizare a ozonului @ro
comment: Potenciál poškodzovania ozónovej vrstvy @sk
comment: Potencial za zmanjšanje ozonskega plašča @sl
comment: Potential för nedbrytning av ozonskiktet @sv

Acidification Potential
type: ObjectProperty
label: Потенциал за натрупване на киселини @bg
label: Potenciál acidifikace @cs
label: Forsuringspotential @da
label: Versauerungspotential @de
label: Δυναμικό Οξίνισης @el
label: Potencial de acidificación @es
label: Happestumise potentsiaal @et
label: Happamoitumispotentiaali @fi
label: Potentiel d'acidification @fr
label: Féidearthacht Aigéadú @ga
label: Potencijal zakiseljavanja @hr
label: Savanyodási potenciál @hu
label: Potenziale di acidificazione @it
label: Rūgštėjimo potencialas @lt
label: Skābuma potenciāls @lv
label: Potenzjal ta' aċidifikazzjoni @mt
label: Verzuringspotentieel @nl
label: Potencjał zakwaszenia @pl
label: Potencial de acidificação @pt
label: Potențial de acidifiere @ro
label: Potenciál acidifikácie @sk
label: Potencial zakisanosti @sl
label: Försurningspotential @sv
unit: MoleHydrogenIonEquivalent
governed by: EN 15804:2012+A2:2019
sub property of: Indicator
domain: EPDBlock
range: ImpactValues
comment: Acidification Potential
comment: Потенциал за натрупване на киселини @bg
comment: Potenciál acidifikace @cs
comment: Forsuringspotential @da
comment: Versauerungspotential @de
comment: Δυναμικό Οξίνισης @el
comment: Potencial de acidificación @es
comment: Happestumise potentsiaal @et
comment: Happamoitumispotentiaali @fi
comment: Potentiel d'acidification @fr
comment: Féidearthacht Aigéadú @ga
comment: Potencijal zakiseljavanja @hr
comment: Savanyodási potenciál @hu
comment: Potenziale di acidificazione @it
comment: Rūgštėjimo potencialas @lt
comment: Skābuma potenciāls @lv
comment: Potenzjal ta' aċidifikazzjoni @mt
comment: Verzuringspotentieel @nl
comment: Potencjał zakwaszenia @pl
comment: Potencial de acidificação @pt
comment: Potențial de acidifiere @ro
comment: Potenciál acidifikácie @sk
comment: Potencial zakisanosti @sl
comment: Försurningspotential @sv

Eutrophication Potential, Freshwater
type: ObjectProperty
label: Потенциал за евтрофикация, прясна вода @bg
label: Potenciál eutrofikace, sladká voda @cs
label: Eutrofieringspotentiale, ferskvand @da
label: Eutrophierungspotential, Süßwasser @de
label: Δυναμικό Ευτροφισμού, γλυκό νερό @el
label: Potencial de eutrofización, agua dulce @es
label: Eutrofeerimise potentsiaal, magevesi @et
label: Eutrofikointipotentiaali, makea vesi @fi
label: Potentiel d'eutrophisation, eau douce @fr
label: Féidearthacht Eutrófachta, fionnuisce @ga
label: Potencijal eutrofikacije, slatka voda @hr
label: Eutrofizációs potenciál, édesvíz @hu
label: Potenziale di eutrofizzazione, acqua dolce @it
label: Eutrofikacijos potencialas, gėlas vanduo @lt
label: Eutrofikācijas potenciāls, saldūdens @lv
label: Potenzjal ta' eutrofikazzjoni, ilma ħelu @mt
label: Eutrofiëringspotentieel, zoet water @nl
label: Potencjał eutrofizacji, woda słodka @pl
label: Potencial de eutrofização, água doce @pt
label: Potențial de eutrofizare, apă dulce @ro
label: Potenciál eutrofikácie, sladká voda @sk
label: Potencial eutrofikacije, sladka voda @sl
label: Eutrofieringspotential, sötvatten @sv
unit: KilogramPhosphorusEquivalent
governed by: EN 15804:2012+A2:2019
sub property of: Indicator
domain: EPDBlock
range: ImpactValues
comment: Eutrophication Potential, Freshwater
comment: Потенциал за евтрофикация, прясна вода @bg
comment: Potenciál eutrofikace, sladká voda @cs
comment: Eutrofieringspotentiale, ferskvand @da
comment: Eutrophierungspotential, Süßwasser @de
comment: Δυναμικό Ευτροφισμού, γλυκό νερό @el
comment: Potencial de eutrofización, agua dulce @es
comment: Eutrofeerimise potentsiaal, magevesi @et
comment: Eutrofikointipotentiaali, makea vesi @fi
comment: Potentiel d'eutrophisation, eau douce @fr
comment: Féidearthacht Eutrófachta, fionnuisce @ga
comment: Potencijal eutrofikacije, slatka voda @hr
comment: Eutrofizációs potenciál, édesvíz @hu
comment: Potenziale di eutrofizzazione, acqua dolce @it
comment: Eutrofikacijos potencialas, gėlas vanduo @lt
comment: Eutrofikācijas potenciāls, saldūdens @lv
comment: Potenzjal ta' eutrofikazzjoni, ilma ħelu @mt
comment: Eutrofiëringspotentieel, zoet water @nl
comment: Potencjał eutrofizacji, woda słodka @pl
comment: Potencial de eutrofização, água doce @pt
comment: Potențial de eutrofizare, apă dulce @ro
comment: Potenciál eutrofikácie, sladká voda @sk
comment: Potencial eutrofikacije, sladka voda @sl
comment: Eutrofieringspotential, sötvatten @sv

Eutrophication Potential, Marine
type: ObjectProperty
label: Потенциал за евтрофикация, морска вода @bg
label: Potenciál eutrofikace, mořská voda @cs
label: Eutrofieringspotentiale, havvand @da
label: Eutrophierungspotential, Meerwasser @de
label: Δυναμικό Ευτροφισμού, θαλασσινό νερό @el
label: Potencial de eutrofización, agua marina @es
label: Eutrofeerimise potentsiaal, merevesi @et
label: Eutrofikointipotentiaali, merivesi @fi
label: Potentiel d'eutrophisation, eau marine @fr
label: Féidearthacht Eutrófachta, Uisce Muirí @ga
label: Potencijal eutrofikacije, morska voda @hr
label: Eutrofizációs potenciál, tengervíz @hu
label: Potenziale di eutrofizzazione, acqua marina @it
label: Eutrofikacijos potencialas, jūros vanduo @lt
label: Eutrofikācijas potenciāls, jūras ūdens @lv
label: Potenzjal ta' eutrofikazzjoni, ilma tal-baħar @mt
label: Eutrofiëringspotentieel, zeewater @nl
label: Potencjał eutrofizacji, woda morska @pl
label: Potencial de eutrofização, água do mar @pt
label: Potențial de eutrofizare, apă marină @ro
label: Potenciál eutrofikácie, morská voda @sk
label: Potencial eutrofikacije, morska voda @sl
label: Eutrofieringspotential, havsvatten @sv
unit: KilogramNitrogenEquivalent
governed by: EN 15804:2012+A2:2019
sub property of: Indicator
domain: EPDBlock
range: ImpactValues
comment: Eutrophication Potential, Marine
comment: Потенциал за евтрофикация, морска вода @bg
comment: Potenciál eutrofikace, mořská voda @cs
comment: Eutrofieringspotentiale, havvand @da
comment: Eutrophierungspotential, Meerwasser @de
comment: Δυναμικό Ευτροφισμού, θαλασσινό νερό @el
comment: Potencial de eutrofización, agua marina @es
comment: Eutrofeerimise potentsiaal, merevesi @et
comment: Eutrofikointipotentiaali, merivesi @fi
comment: Potentiel d'eutrophisation, eau marine @fr
comment: Féidearthacht Eutrófachta, Uisce Muirí @ga
comment: Potencijal eutrofikacije, morska voda @hr
comment: Eutrofizációs potenciál, tengervíz @hu
comment: Potenziale di eutrofizzazione, acqua marina @it
comment: Eutrofikacijos potencialas, jūros vanduo @lt
comment: Eutrofikācijas potenciāls, jūras ūdens @lv
comment: Potenzjal ta' eutrofikazzjoni, ilma tal-baħar @mt
comment: Eutrofiëringspotentieel, zeewater @nl
comment: Potencjał eutrofizacji, woda morska @pl
comment: Potencial de eutrofização, água do mar @pt
comment: Potențial de eutrofizare, apă marină @ro
comment: Potenciál eutrofikácie, morská voda @sk
comment: Potencial eutrofikacije, morska voda @sl
comment: Eutrofieringspotential, havsvatten @sv

Eutrophication Potential, Terrestrial
type: ObjectProperty
label: Потенциал за евтрофикация, суша @bg
label: Potenciál eutrofikace, půda @cs
label: Eutrofieringspotentiale, terrestrisk @da
label: Eutrophierungspotential, terrestrisch @de
label: Δυναμικό Ευτροφισμού, χερσαίο @el
label: Potencial de eutrofización, terrestre @es
label: Eutrofeerimise potentsiaal, maismaa @et
label: Eutrofikointipotentiaali, maaperä @fi
label: Potentiel d'eutrophisation, terrestre @fr
label: Féidearthacht Eutrófachta, Talún @ga
label: Potencijal eutrofikacije, kopneni @hr
label: Eutrofizációs potenciál, szárazföldi @hu
label: Potenziale di eutrofizzazione, terrestre @it
label: Eutrofikacijos potencialas, sausumos @lt
label: Eutrofikācijas potenciāls, sauszemes @lv
label: Potenzjal ta' eutrofikazzjoni, terrestri @mt
label: Eutrofiëringspotentieel, terrestrisch @nl
label: Potencjał eutrofizacji, lądowy @pl
label: Potencial de eutrofização, terrestre @pt
label: Potențial de eutrofizare, terestru @ro
label: Potenciál eutrofikácie, terestrický @sk
label: Potencial eutrofikacije, kopenski @sl
label: Eutrofieringspotential, mark @sv
unit: MoleNitrogenEquivalent
governed by: EN 15804:2012+A2:2019
sub property of: Indicator
domain: EPDBlock
range: ImpactValues
comment: Eutrophication Potential, Terrestrial
comment: Потенциал за евтрофикация, суша @bg
comment: Potenciál eutrofikace, půda @cs
comment: Eutrofieringspotentiale, terrestrisk @da
comment: Eutrophierungspotential, terrestrisch @de
comment: Δυναμικό Ευτροφισμού, χερσαίο @el
comment: Potencial de eutrofización, terrestre @es
comment: Eutrofeerimise potentsiaal, maismaa @et
comment: Eutrofikointipotentiaali, maaperä @fi
comment: Potentiel d'eutrophisation, terrestre @fr
comment: Féidearthacht Eutrófachta, Talún @ga
comment: Potencijal eutrofikacije, kopneni @hr
comment: Eutrofizációs potenciál, szárazföldi @hu
comment: Potenziale di eutrofizzazione, terrestre @it
comment: Eutrofikacijos potencialas, sausumos @lt
comment: Eutrofikācijas potenciāls, sauszemes @lv
comment: Potenzjal ta' eutrofikazzjoni, terrestri @mt
comment: Eutrofiëringspotentieel, terrestrisch @nl
comment: Potencjał eutrofizacji, lądowy @pl
comment: Potencial de eutrofização, terrestre @pt
comment: Potențial de eutrofizare, terestru @ro
comment: Potenciál eutrofikácie, terestrický @sk
comment: Potencial eutrofikacije, kopenski @sl
comment: Eutrofieringspotential, mark @sv

Photochemical Ozone Creation Potential
type: ObjectProperty
label: Потенциал за създаване на фотохимичен озон @bg
label: Potenciál tvorby fotochemického ozonu @cs
label: Fotokemisk ozondannelsespotentiale @da
label: Foto-chemisches Ozonbildungspotenzial @de
label: Δυναμικό Δημιουργίας Φωτοχημικού Όζοντος @el
label: Potencial de creación de ozono fotoquímico @es
label: Foto-keemilise osooni teke potentsiaal @et
label: Valokemiallisen otsonin muodostumispotentiaali @fi
label: Potentiel de création d’ozone photochimique @fr
label: Féidearthacht Cruthaithe Ózóin Fótaimiúla @ga
label: Potencijal za stvaranje fotokemijskog ozona @hr
label: Fotokémiai ózonképződési potenciál @hu
label: Potenziale di formazione di ozono fotochimico @it
label: Fotocheminio ozono susidarymo potencialas @lt
label: Fotohīmiskā ozona veidošanās potenciāls @lv
label: Potenzjal ta' ħolqien ta' ozonu fotoċimiku @mt
label: Fotochemisch ozonvormingspotentieel @nl
label: Potencjał fotochemicznego tworzenia ozonu @pl
label: Potencial de criação de ozono fotoquímico @pt
label: Potențial de creare a ozonului fotochimic @ro
label: Potenciál fotochemickej tvorby ozónu @sk
label: Potencial za nastanek fotokemijskega ozona @sl
label: Potential för fotokemisk ozonbildning @sv
unit: KilogramNMVOCEquivalent
governed by: EN 15804:2012+A2:2019
sub property of: Indicator
domain: EPDBlock
range: ImpactValues
comment: Photochemical Ozone Creation Potential
comment: Потенциал за създаване на фотохимичен озон @bg
comment: Potenciál tvorby fotochemického ozonu @cs
comment: Fotokemisk ozondannelsespotentiale @da
comment: Foto-chemisches Ozonbildungspotenzial @de
comment: Δυναμικό Δημιουργίας Φωτοχημικού Όζοντος @el
comment: Potencial de creación de ozono fotoquímico @es
comment: Foto-keemilise osooni teke potentsiaal @et
comment: Valokemiallisen otsonin muodostumispotentiaali @fi
comment: Potentiel de création d’ozone photochimique @fr
comment: Féidearthacht Cruthaithe Ózóin Fótaimiúla @ga
comment: Potencijal za stvaranje fotokemijskog ozona @hr
comment: Fotokémiai ózonképződési potenciál @hu
comment: Potenziale di formazione di ozono fotochimico @it
comment: Fotocheminio ozono susidarymo potencialas @lt
comment: Fotohīmiskā ozona veidošanās potenciāls @lv
comment: Potenzjal ta' ħolqien ta' ozonu fotoċimiku @mt
comment: Fotochemisch ozonvormingspotentieel @nl
comment: Potencjał fotochemicznego tworzenia ozonu @pl
comment: Potencial de criação de ozono fotoquímico @pt
comment: Potențial de creare a ozonului fotochimic @ro
comment: Potenciál fotochemickej tvorby ozónu @sk
comment: Potencial za nastanek fotokemijskega ozona @sl
comment: Potential för fotokemisk ozonbildning @sv

Abiotic Depletion Potential (elements)
type: ObjectProperty
label: Потенциал за изчерпване на абиотични елементи @bg
label: Potenciál vyčerpání abiotických prvků @cs
label: Abiotisk nedbrydningspotentiale (elementer) @da
label: Abiotisches Erschöpfungspotenzial (Elemente) @de
label: Δυναμικό Εξάντλησης Αβιοτικών Στοιχείων @el
label: Potencial de agotamiento abiótico (elementos) @es
label: Abiootiliste elementide ammendumispotentsiaal @et
label: Abioottisten alkuaineiden ehtymispotentiaali @fi
label: Potentiel d'épuisement abiotiques (éléments) @fr
label: Féidearthacht Díothaithe Aibitheach (eilimintí) @ga
label: Potencijal iscrpljivanja abiotičkih elemenata @hr
label: Abiotikus kimerülési potenciál (elemek) @hu
label: Potenziale di esaurimento abiotico (elementi) @it
label: Abiotinių elementų išeikvojimo potencialas @lt
label: Abiotisko elementu izsīkšanas potenciāls @lv
label: Potenzjal ta' tnaqqis abjotiku (elementi) @mt
label: Abiotisch uitputtingspotentieel (elementen) @nl
label: Potencjał wyczerpywania zasobów abiotycznych (pierwiastków) @pl
label: Potencial de esgotamento abiótico (elementos) @pt
label: Potențial de epuizare abiotică (elemente) @ro
label: Potenciál vyčerpania abiotických prvkov @sk
label: Potencial izčrpanja abiotičnih elementov @sl
label: Abiotisk uttömningspotential @sv
unit: KilogramAntimonyEquivalent
governed by: EN 15804:2012+A2:2019
sub property of: Indicator
domain: EPDBlock
range: ImpactValues
comment: Abiotic Depletion Potential (elements)
comment: Потенциал за изчерпване на абиотични елементи @bg
comment: Potenciál vyčerpání abiotických prvků @cs
comment: Abiotisk nedbrydningspotentiale (elementer) @da
comment: Abiotisches Erschöpfungspotenzial (Elemente) @de
comment: Δυναμικό Εξάντλησης Αβιοτικών Στοιχείων @el
comment: Potencial de agotamiento abiótico (elementos) @es
comment: Abiootiliste elementide ammendumispotentsiaal @et
comment: Abioottisten alkuaineiden ehtymispotentiaali @fi
comment: Potentiel d'épuisement abiotiques (éléments) @fr
comment: Féidearthacht Díothaithe Aibitheach (eilimintí) @ga
comment: Potencijal iscrpljivanja abiotičkih elemenata @hr
comment: Abiotikus kimerülési potenciál (elemek) @hu
comment: Potenziale di esaurimento abiotico (elementi) @it
comment: Abiotinių elementų išeikvojimo potencialas @lt
comment: Abiotisko elementu izsīkšanas potenciāls @lv
comment: Potenzjal ta' tnaqqis abjotiku (elementi) @mt
comment: Abiotisch uitputtingspotentieel (elementen) @nl
comment: Potencjał wyczerpywania zasobów abiotycznych (pierwiastków) @pl
comment: Potencial de esgotamento abiótico (elementos) @pt
comment: Potențial de epuizare abiotică (elemente) @ro
comment: Potenciál vyčerpania abiotických prvkov @sk
comment: Potencial izčrpanja abiotičnih elementov @sl
comment: Abiotisk uttömningspotential @sv

Abiotic Depletion Potential (fossil fuels)
type: ObjectProperty
label: Потенциал за изчерпване на абиотични горива @bg
label: Potenciál vyčerpání abiotických paliv @cs
label: Abiotisk nedbrydningspotentiale (fossile brændstoffer) @da
label: Abiotisches Erschöpfungspotenzial (fossile Brennstoffe) @de
label: Δυναμικό Εξάντλησης Αβιοτικών Καυσίμων @el
label: Potencial de agotamiento abiótico (combustibles fósiles) @es
label: Abiootiliste fossiilkütuste ammendumispotentsiaal @et
label: Abioottisten fossiilisten polttoaineiden ehtymispotentiaali @fi
label: Potentiel d'épuisement abiotiques (combustibles fossiles) @fr
label: Féidearthacht Díothaithe Aibitheach (breoslaí iontaise) @ga
label: Potencijal iscrpljivanja abiotičkih goriva @hr
label: Abiotikus kimerülési potenciál (fosszilis tüzelőanyagok) @hu
label: Potenziale di esaurimento abiotico (combustibili fossili) @it
label: Abiotinių išteklių išeikvojimo potencialas (fossiliniai kuras) @lt
label: Abiotisko kurināmo izsīkšanas potenciāls @lv
label: Potenzjal ta' tnaqqis abjotiku (fjuwils fossili) @mt
label: Abiotisch uitputtingspotentieel (fossiele brandstoffen) @nl
label: Potencjał wyczerpywania zasobów abiotycznych (paliwa kopalne) @pl
label: Potencial de esgotamento abiótico (combustíveis fósseis) @pt
label: Potențial de epuizare abiotică (combustibili fosili) @ro
label: Potenciál vyčerpania abiotických palív @sk
label: Potencial izčrpanja abiotičnih goriv @sl
label: Abiotisk uttömningspotential (fossila bränslen) @sv
unit: Megajoule
governed by: EN 15804:2012+A2:2019
sub property of: Indicator
domain: EPDBlock
range: ImpactValues
comment: Abiotic Depletion Potential (fossil fuels)
comment: Потенциал за изчерпване на абиотични горива @bg
comment: Potenciál vyčerpání abiotických paliv @cs
comment: Abiotisk nedbrydningspotentiale (fossile brændstoffer) @da
comment: Abiotisches Erschöpfungspotenzial (fossile Brennstoffe) @de
comment: Δυναμικό Εξάντλησης Αβιοτικών Καυσίμων @el
comment: Potencial de agotamiento abiótico (combustibles fósiles) @es
comment: Abiootiliste fossiilkütuste ammendumispotentsiaal @et
comment: Abioottisten fossiilisten polttoaineiden ehtymispotentiaali @fi
comment: Potentiel d'épuisement abiotiques (combustibles fossiles) @fr
comment: Féidearthacht Díothaithe Aibitheach (breoslaí iontaise) @ga
comment: Potencijal iscrpljivanja abiotičkih goriva @hr
comment: Abiotikus kimerülési potenciál (fosszilis tüzelőanyagok) @hu
comment: Potenziale di esaurimento abiotico (combustibili fossili) @it
comment: Abiotinių išteklių išeikvojimo potencialas (fossiliniai kuras) @lt
comment: Abiotisko kurināmo izsīkšanas potenciāls @lv
comment: Potenzjal ta' tnaqqis abjotiku (fjuwils fossili) @mt
comment: Abiotisch uitputtingspotentieel (fossiele brandstoffen) @nl
comment: Potencjał wyczerpywania zasobów abiotycznych (paliwa kopalne) @pl
comment: Potencial de esgotamento abiótico (combustíveis fósseis) @pt
comment: Potențial de epuizare abiotică (combustibili fosili) @ro
comment: Potenciál vyčerpania abiotických palív @sk
comment: Potencial izčrpanja abiotičnih goriv @sl
comment: Abiotisk uttömningspotential (fossila bränslen) @sv

Water Depletion Potential
type: ObjectProperty
label: Потенциал за изчерпване на вода @bg
label: Potenciál vyčerpání vody @cs
label: Vandforbrugspotentiale @da
label: Wassererschöpfungspotenzial @de
label: Δυναμικό Εξάντλησης Νερού @el
label: Potencial de agotamiento de agua @es
label: Vee ammendumispotentsiaal @et
label: Veden ehtymispotentiaali @fi
label: Potentiel d'épuisement de l'eau @fr
label: Féidearthacht Díothaithe Uisce @ga
label: Potencijal iscrpljivanja vode @hr
label: Vízfelhasználási potenciál @hu
label: Potenziale di esaurimento dell'acqua @it
label: Vandens išeikvojimo potencialas @lt
label: Ūdens izsīkšanas potenciāls @lv
label: Potenzjal ta' tnaqqis tal-ilma @mt
label: Wateruitputtingspotentieel @nl
label: Potencjał wyczerpywania zasobów wodnych @pl
label: Potencial de esgotamento hídrico @pt
label: Potențial de epuizare a apei @ro
label: Potenciál vyčerpania vody @sk
label: Potencial izčrpanja vode @sl
label: Vattenuttagspotential @sv
unit: CubicMeter
governed by: EN 15804:2012+A2:2019
sub property of: Indicator
domain: EPDBlock
range: ImpactValues
comment: Water Depletion Potential
comment: Потенциал за изчерпване на вода @bg
comment: Potenciál vyčerpání vody @cs
comment: Vandforbrugspotentiale @da
comment: Wassererschöpfungspotenzial @de
comment: Δυναμικό Εξάντλησης Νερού @el
comment: Potencial de agotamiento de agua @es
comment: Vee ammendumispotentsiaal @et
comment: Veden ehtymispotentiaali @fi
comment: Potentiel d'épuisement de l'eau @fr
comment: Féidearthacht Díothaithe Uisce @ga
comment: Potencijal iscrpljivanja vode @hr
comment: Vízfelhasználási potenciál @hu
comment: Potenziale di esaurimento dell'acqua @it
comment: Vandens išeikvojimo potencialas @lt
comment: Ūdens izsīkšanas potenciāls @lv
comment: Potenzjal ta' tnaqqis tal-ilma @mt
comment: Wateruitputtingspotentieel @nl
comment: Potencjał wyczerpywania zasobów wodnych @pl
comment: Potencial de esgotamento hídrico @pt
comment: Potențial de epuizare a apei @ro
comment: Potenciál vyčerpania vody @sk
comment: Potencial izčrpanja vode @sl
comment: Vattenuttagspotential @sv

Particulate matter emissions
type: ObjectProperty
label: Емисии на фини прахови частици @bg
label: Emise částic @cs
label: Partikelemissioner @da
label: Feinstaubemissionen @de
label: Εκπομπές αιωρούμενων σωματιδίων @el
label: Emisiones de material particulado @es
label: Tahkete osakeste heide @et
label: Hiukkaspäästöt @fi
label: Émissions de particules fines @fr
label: Astuithe ábhar cáithníneach @ga
label: Emisije lebdećih čestica @hr
label: Szálló por kibocsátása @hu
label: Emissioni di particolato @it
label: Kietųjų dalelių emisijos @lt
label: Cieto daļiņu emisijas @lv
label: Emissjonijiet ta' materja partikulata @mt
label: Fijnstofemissies @nl
label: Emisje pyłów zawieszonych @pl
label: Emissões de partículas @pt
label: Emisii de particule @ro
label: Emisie tuhých častíc @sk
label: Emisije trdnih delcev @sl
unit: DiseaseIncidence
governed by: EN 15804:2012+A2:2019
sub property of: Indicator
domain: EPDBlock
range: ImpactValues
comment: Particulate matter emissions
comment: Емисии на фини прахови частици @bg
comment: Emise částic @cs
comment: Partikelemissioner @da
comment: Feinstaubemissionen @de
comment: Εκπομπές αιωρούμενων σωματιδίων @el
comment: Emisiones de material particulado @es
comment: Tahkete osakeste heide @et
comment: Hiukkaspäästöt @fi
comment: Émissions de particules fines @fr
comment: Astuithe ábhar cáithníneach @ga
comment: Emisije lebdećih čestica @hr
comment: Szálló por kibocsátása @hu
comment: Emissioni di particolato @it
comment: Kietųjų dalelių emisijos @lt
comment: Cieto daļiņu emisijas @lv
comment: Emissjonijiet ta' materja partikulata @mt
comment: Fijnstofemissies @nl
comment: Emisje pyłów zawieszonych @pl
comment: Emissões de partículas @pt
comment: Emisii de particule @ro
comment: Emisie tuhých častíc @sk
comment: Emisije trdnih delcev @sl

Ionising radiation, human health
type: ObjectProperty
label: Йонизиращо лъчение, човешко здраве @bg
label: Ionizující záření, lidské zdraví @cs
label: Ioniserende stråling, menneskers sundhed @da
label: Ionisierende Strahlung, menschliche Gesundheit @de
label: Ιοντίζουσα ακτινοβολία, ανθρώπινη υγεία @el
label: Radiación ionizante, salud humana @es
label: Ioniseeriv kiirgus, inimeste tervis @et
label: Ionisoiva säteily, ihmisten terveys @fi
label: Rayonnement ionisant, santé humaine @fr
label: Radaíocht ianaíoch, sláinte an duine @ga
label: Ionizirajuće zračenje, ljudsko zdravlje @hr
label: Ionizáló sugárzás, emberi egészség @hu
label: Radiazioni ionizzanti, salute umana @it
label: Jonizuojančioji spinduliuotė, žmonių sveikata @lt
label: Jonizējošais starojums, cilvēku veselība @lv
label: Radjazzjoni jonizzanti, saħħa tal-bniedem @mt
label: Ioniserende straling, menselijke gezondheid @nl
label: Promieniowanie jonizujące, zdrowie ludzkie @pl
label: Radiação ionizante, saúde humana @pt
label: Radiații ionizante, sănătatea umană @ro
label: Ionizujúce žiarenie, ľudské zdravie @sk
label: Ionizirajoče sevanje, zdravje ljudi @sl
label: Joniserande strålning, människors hälsa @sv
unit: KilobecquerelU235Equivalent
governed by: EN 15804:2012+A2:2019
sub property of: Indicator
domain: EPDBlock
range: ImpactValues
comment: Ionising radiation, human health
comment: Йонизиращо лъчение, човешко здраве @bg
comment: Ionizující záření, lidské zdraví @cs
comment: Ioniserende stråling, menneskers sundhed @da
comment: Ionisierende Strahlung, menschliche Gesundheit @de
comment: Ιοντίζουσα ακτινοβολία, ανθρώπινη υγεία @el
comment: Radiación ionizante, salud humana @es
comment: Ioniseeriv kiirgus, inimeste tervis @et
comment: Ionisoiva säteily, ihmisten terveys @fi
comment: Rayonnement ionisant, santé humaine @fr
comment: Radaíocht ianaíoch, sláinte an duine @ga
comment: Ionizirajuće zračenje, ljudsko zdravlje @hr
comment: Ionizáló sugárzás, emberi egészség @hu
comment: Radiazioni ionizzanti, salute umana @it
comment: Jonizuojančioji spinduliuotė, žmonių sveikata @lt
comment: Jonizējošais starojums, cilvēku veselība @lv
comment: Radjazzjoni jonizzanti, saħħa tal-bniedem @mt
comment: Ioniserende straling, menselijke gezondheid @nl
comment: Promieniowanie jonizujące, zdrowie ludzkie @pl
comment: Radiação ionizante, saúde humana @pt
comment: Radiații ionizante, sănătatea umană @ro
comment: Ionizujúce žiarenie, ľudské zdravie @sk
comment: Ionizirajoče sevanje, zdravje ljudi @sl
comment: Joniserande strålning, människors hälsa @sv

Ecotoxicity, freshwater
type: ObjectProperty
label: Екотоксичност, сладки води @bg
label: Ekotoxicita, sladká voda @cs
label: Økotoksicitet, ferskvand @da
label: Ökotoxizität, Süßwasser @de
label: Οικοτοξικότητα, γλυκά ύδατα @el
label: Ecotoxicidad, agua dulce @es
label: Ökotoksilisus, magevesi @et
label: Ekotoksisuus, makea vesi @fi
label: Écotoxicité, eau douce @fr
label: Éiceathocsaineacht, fionnuisce @ga
label: Ekotoksičnost, slatka voda @hr
label: Ökotoxicitás, édesvíz @hu
label: Ecotossicità, acqua dolce @it
label: Ekotoksiškumas, gėlas vanduo @lt
label: Ekotoksicitāte, saldūdens @lv
label: Ekotossiċità, ilma ħelu @mt
label: Ecotoxiciteit, zoetwater @nl
label: Ekotoksyczność, wody słodkie @pl
label: Ecotoxicidade, água doce @pt
label: Ecotoxicitate, apă dulce @ro
label: Ekotoksičnost, sladka voda @sl
label: Ekotoxicitet, sötvatten @sv
unit: ComparativeToxicUnitForEcosystems
governed by: EN 15804:2012+A2:2019
sub property of: Indicator
domain: EPDBlock
range: ImpactValues
comment: Ecotoxicity, freshwater
comment: Екотоксичност, сладки води @bg
comment: Ekotoxicita, sladká voda @cs
comment: Økotoksicitet, ferskvand @da
comment: Ökotoxizität, Süßwasser @de
comment: Οικοτοξικότητα, γλυκά ύδατα @el
comment: Ecotoxicidad, agua dulce @es
comment: Ökotoksilisus, magevesi @et
comment: Ekotoksisuus, makea vesi @fi
comment: Écotoxicité, eau douce @fr
comment: Éiceathocsaineacht, fionnuisce @ga
comment: Ekotoksičnost, slatka voda @hr
comment: Ökotoxicitás, édesvíz @hu
comment: Ecotossicità, acqua dolce @it
comment: Ekotoksiškumas, gėlas vanduo @lt
comment: Ekotoksicitāte, saldūdens @lv
comment: Ekotossiċità, ilma ħelu @mt
comment: Ecotoxiciteit, zoetwater @nl
comment: Ekotoksyczność, wody słodkie @pl
comment: Ecotoxicidade, água doce @pt
comment: Ecotoxicitate, apă dulce @ro
comment: Ekotoksičnost, sladka voda @sl
comment: Ekotoxicitet, sötvatten @sv

Human toxicity, cancer
type: ObjectProperty
label: Токсичност за човека, рак @bg
label: Lidská toxicita, rakovina @cs
label: Human toksicitet, kræft @da
label: Humantoxizität, Krebs @de
label: Τοξικότητα για τον άνθρωπο, καρκίνος @el
label: Toxicidad humana, cáncer @es
label: Inimtoksilisus, vähk @et
label: Ihmistoksisuus, syöpä @fi
label: Toxicité humaine, cancer @fr
label: Tocsaineacht don duine, ailse @ga
label: Toksičnost za ljude, rak @hr
label: Humán toxicitás, rák @hu
label: Tossicità umana, cancro @it
label: Toksiškumas žmonėms, vėžys @lt
label: Toksicitāte cilvēkiem, vēzis @lv
label: Tossiċità għall-bniedem, kanċer @mt
label: Humane toxiciteit, kanker @nl
label: Toksyczność dla ludzi, rak @pl
label: Toxicidade humana, cancro @pt
label: Toxicitate umană, cancer @ro
label: Ľudská toxicita, rakovina @sk
label: Toksičnost za ljudi, rak @sl
label: Humantoxicitet, cancer @sv
unit: ComparativeToxicUnitForHumanToxicity
governed by: EN 15804:2012+A2:2019
sub property of: Indicator
domain: EPDBlock
range: ImpactValues
comment: Human toxicity, cancer
comment: Токсичност за човека, рак @bg
comment: Lidská toxicita, rakovina @cs
comment: Human toksicitet, kræft @da
comment: Humantoxizität, Krebs @de
comment: Τοξικότητα για τον άνθρωπο, καρκίνος @el
comment: Toxicidad humana, cáncer @es
comment: Inimtoksilisus, vähk @et
comment: Ihmistoksisuus, syöpä @fi
comment: Toxicité humaine, cancer @fr
comment: Tocsaineacht don duine, ailse @ga
comment: Toksičnost za ljude, rak @hr
comment: Humán toxicitás, rák @hu
comment: Tossicità umana, cancro @it
comment: Toksiškumas žmonėms, vėžys @lt
comment: Toksicitāte cilvēkiem, vēzis @lv
comment: Tossiċità għall-bniedem, kanċer @mt
comment: Humane toxiciteit, kanker @nl
comment: Toksyczność dla ludzi, rak @pl
comment: Toxicidade humana, cancro @pt
comment: Toxicitate umană, cancer @ro
comment: Ľudská toxicita, rakovina @sk
comment: Toksičnost za ljudi, rak @sl
comment: Humantoxicitet, cancer @sv

Human toxicity, non-cancer
type: ObjectProperty
label: Токсичност за човека, без рак @bg
label: Lidská toxicita, bez rakoviny @cs
label: Human toksicitet, ikke-kræft @da
label: Humantoxizität, Nicht-Krebs @de
label: Τοξικότητα για τον άνθρωπο, μη καρκινικές επιπτώσεις @el
label: Toxicidad humana, no cáncer @es
label: Inimtoksilisus, mitte-vähk @et
label: Ihmistoksisuus, ei-syöpä @fi
label: Toxicité humaine, effets non cancérigènes @fr
label: Tocsaineacht don duine, neamh-ailse @ga
label: Toksičnost za ljude, osim raka @hr
label: Humán toxicitás, nem rák @hu
label: Tossicità umana, non cancro @it
label: Toksiškumas žmonėms, ne vėžys @lt
label: Toksicitāte cilvēkiem, bez vēža @lv
label: Tossiċità għall-bniedem, mhux kanċer @mt
label: Humane toxiciteit, niet-kanker @nl
label: Toksyczność dla ludzi, efekty nienowotworowe @pl
label: Toxicidade humana, não-cancro @pt
label: Toxicitate umană, efecte non-cancerigene @ro
label: Ľudská toxicita, bez rakoviny @sk
label: Toksičnost za ljudi, brez raka @sl
label: Humantoxicitet, icke-cancer @sv
unit: ComparativeToxicUnitForHumanToxicity
governed by: EN 15804:2012+A2:2019
sub property of: Indicator
domain: EPDBlock
range: ImpactValues
comment: Human toxicity, non-cancer
comment: Токсичност за човека, без рак @bg
comment: Lidská toxicita, bez rakoviny @cs
comment: Human toksicitet, ikke-kræft @da
comment: Humantoxizität, Nicht-Krebs @de
comment: Τοξικότητα για τον άνθρωπο, μη καρκινικές επιπτώσεις @el
comment: Toxicidad humana, no cáncer @es
comment: Inimtoksilisus, mitte-vähk @et
comment: Ihmistoksisuus, ei-syöpä @fi
comment: Toxicité humaine, effets non cancérigènes @fr
comment: Tocsaineacht don duine, neamh-ailse @ga
comment: Toksičnost za ljude, osim raka @hr
comment: Humán toxicitás, nem rák @hu
comment: Tossicità umana, non cancro @it
comment: Toksiškumas žmonėms, ne vėžys @lt
comment: Toksicitāte cilvēkiem, bez vēža @lv
comment: Tossiċità għall-bniedem, mhux kanċer @mt
comment: Humane toxiciteit, niet-kanker @nl
comment: Toksyczność dla ludzi, efekty nienowotworowe @pl
comment: Toxicidade humana, não-cancro @pt
comment: Toxicitate umană, efecte non-cancerigene @ro
comment: Ľudská toxicita, bez rakoviny @sk
comment: Toksičnost za ljudi, brez raka @sl
comment: Humantoxicitet, icke-cancer @sv

Land use related impacts
type: ObjectProperty
label: Въздействия, свързани с използването на земята @bg
label: Dopady spojené s využíváním půdy @cs
label: Arealanvendelsesrelaterede påvirkninger @da
label: Auswirkungen im Zusammenhang mit der Landnutzung @de
label: Επιπτώσεις σχετικές με τη χρήση γης @el
label: Impactos relacionados con el uso del suelo @es
label: Maakasutusega seotud mõjud @et
label: Maankäyttöön liittyvät vaikutukset @fi
label: Impacts liés à l'utilisation des terres @fr
label: Tionchair a bhaineann le húsáid talún @ga
label: Utjecaji povezani s uporabom zemljišta @hr
label: Földhasználattal kapcsolatos hatások @hu
label: Impatti legati all'uso del suolo @it
label: Su žemės naudojimu susijęs poveikis @lt
label: Ar zemes izmantošanu saistītā ietekme @lv
label: Impatti relatati mal-użu tal-art @mt
label: Effecten gerelateerd aan landgebruik @nl
label: Wpływ związany z użytkowaniem gruntów @pl
label: Impactos relacionados com o uso do solo @pt
label: Impacturi legate de utilizarea terenurilor @ro
label: Dopady spojené s využívaním pôdy @sk
label: Vplivi, povezani z rabo tal @sl
label: Markanvändningsrelaterade effekter @sv
unit: Unitless
governed by: EN 15804:2012+A2:2019
sub property of: Indicator
domain: EPDBlock
range: ImpactValues
comment: Land use related impacts
comment: Въздействия, свързани с използването на земята @bg
comment: Dopady spojené s využíváním půdy @cs
comment: Arealanvendelsesrelaterede påvirkninger @da
comment: Auswirkungen im Zusammenhang mit der Landnutzung @de
comment: Επιπτώσεις σχετικές με τη χρήση γης @el
comment: Impactos relacionados con el uso del suelo @es
comment: Maakasutusega seotud mõjud @et
comment: Maankäyttöön liittyvät vaikutukset @fi
comment: Impacts liés à l'utilisation des terres @fr
comment: Tionchair a bhaineann le húsáid talún @ga
comment: Utjecaji povezani s uporabom zemljišta @hr
comment: Földhasználattal kapcsolatos hatások @hu
comment: Impatti legati all'uso del suolo @it
comment: Su žemės naudojimu susijęs poveikis @lt
comment: Ar zemes izmantošanu saistītā ietekme @lv
comment: Impatti relatati mal-użu tal-art @mt
comment: Effecten gerelateerd aan landgebruik @nl
comment: Wpływ związany z użytkowaniem gruntów @pl
comment: Impactos relacionados com o uso do solo @pt
comment: Impacturi legate de utilizarea terenurilor @ro
comment: Dopady spojené s využívaním pôdy @sk
comment: Vplivi, povezani z rabo tal @sl
comment: Markanvändningsrelaterade effekter @sv

Use of renewable primary energy excl. raw materials
type: ObjectProperty
label: Използване на възобновяема първична енергия без суровини @bg
label: Využití obnovitelné primární energie bez surovin @cs
label: Brug af vedvarende primær energi ekskl. råmaterialer @da
label: Einsatz von erneuerbarer Primärenergie ohne Rohstoffe @de
label: Χρήση ανανεώσιμης πρωτογενούς ενέργειας εκτός των πρώτων υλών @el
label: Uso de energía primaria renovable excluyendo materias primas @es
label: Taastuva primaarenergia kasutamine, v.a toorained @et
label: Uusiutuvan primäärienergian käyttö pl. raaka-aineet @fi
label: Utilisation de l'énergie primaire renouvelable à l'exclusion des matières premières @fr
label: Úsáid fuinnimh phríomhúil in-athnuaite seachas amhábhair @ga
label: Uporaba obnovljive primarne energije, isključujući sirovine @hr
label: Megújuló primer energia felhasználása, a nyersanyagok kivételével @hu
label: Uso di energia primaria rinnovabile escluse le materie prime @it
label: Atsinaujinančios pirminės energijos naudojimas, išskyrus žaliavas @lt
label: Atjaunojamās primārās enerģijas izmantošana, izņemot izejvielas @lv
label: Użu ta' enerġija primarja rinnovabbli minbarra l-materja prima @mt
label: Gebruik van hernieuwbare primaire energie excl. grondstoffen @nl
label: Zużycie odnawialnej energii pierwotnej, z wyłączeniem surowców @pl
label: Uso de energia primária renovável, excluindo matérias-primas @pt
label: Utilizarea energiei primare regenerabile, cu excepția materiilor prime @ro
label: Využitie obnoviteľnej primárnej energie okrem surovín @sk
label: Raba obnovljive primarne energije, razen surovin @sl
label: Användning av förnybar primärenergi exkl. råmaterial @sv
unit: Megajoule
governed by: EN 15804:2012+A2:2019
sub property of: Indicator
domain: EPDBlock
range: ImpactValues
comment: Use of renewable primary energy excl. raw materials
comment: Използване на възобновяема първична енергия без суровини @bg
comment: Využití obnovitelné primární energie bez surovin @cs
comment: Brug af vedvarende primær energi ekskl. råmaterialer @da
comment: Einsatz von erneuerbarer Primärenergie ohne Rohstoffe @de
comment: Χρήση ανανεώσιμης πρωτογενούς ενέργειας εκτός των πρώτων υλών @el
comment: Uso de energía primaria renovable excluyendo materias primas @es
comment: Taastuva primaarenergia kasutamine, v.a toorained @et
comment: Uusiutuvan primäärienergian käyttö pl. raaka-aineet @fi
comment: Utilisation de l'énergie primaire renouvelable à l'exclusion des matières premières @fr
comment: Úsáid fuinnimh phríomhúil in-athnuaite seachas amhábhair @ga
comment: Uporaba obnovljive primarne energije, isključujući sirovine @hr
comment: Megújuló primer energia felhasználása, a nyersanyagok kivételével @hu
comment: Uso di energia primaria rinnovabile escluse le materie prime @it
comment: Atsinaujinančios pirminės energijos naudojimas, išskyrus žaliavas @lt
comment: Atjaunojamās primārās enerģijas izmantošana, izņemot izejvielas @lv
comment: Użu ta' enerġija primarja rinnovabbli minbarra l-materja prima @mt
comment: Gebruik van hernieuwbare primaire energie excl. grondstoffen @nl
comment: Zużycie odnawialnej energii pierwotnej, z wyłączeniem surowców @pl
comment: Uso de energia primária renovável, excluindo matérias-primas @pt
comment: Utilizarea energiei primare regenerabile, cu excepția materiilor prime @ro
comment: Využitie obnoviteľnej primárnej energie okrem surovín @sk
comment: Raba obnovljive primarne energije, razen surovin @sl
comment: Användning av förnybar primärenergi exkl. råmaterial @sv

Use of renewable primary energy used as raw materials
type: ObjectProperty
label: Използване на възобновяема първична енергия като суровини @bg
label: Využití obnovitelné primární energie jako surovin @cs
label: Brug af vedvarende primær energi anvendt som råmaterialer @da
label: Einsatz von erneuerbarer Primärenergie als Rohstoffe @de
label: Χρήση ανανεώσιμης πρωτογενούς ενέργειας ως πρώτων υλών @el
label: Uso de energía primaria renovable como materias primas @es
label: Taastuva primaarenergia kasutamine toorainetena @et
label: Raaka-aineina käytetyn uusiutuvan primäärienergian käyttö @fi
label: Utilisation de l'énergie primaire renouvelable comme matières premières @fr
label: Úsáid fuinnimh phríomhúil in-athnuaite mar amhábhair @ga
label: Uporaba obnovljive primarne energije kao sirovina @hr
label: Nyersanyagként felhasznált megújuló primer energia felhasználása @hu
label: Uso di energia primaria rinnovabile come materie prime @it
label: Kaip žaliavų naudojamos atsinaujinančios pirminės energijos naudojimas @lt
label: Kā izejvielu izmantotās atjaunojamās primārās enerģijas izmantošana @lv
label: Użu ta' enerġija primarja rinnovabbli użata bħala materja prima @mt
label: Gebruik van hernieuwbare primaire energie als grondstoffen @nl
label: Zużycie odnawialnej energii pierwotnej wykorzystywanej jako surowce @pl
label: Uso de energia primária renovável como matérias-primas @pt
label: Utilizarea energiei primare regenerabile ca materii prime @ro
label: Využitie obnoviteľnej primárnej energie ako surovín @sk
label: Raba obnovljive primarne energije, uporabljene kot surovine @sl
label: Användning av förnybar primärenergi som råmaterial @sv
unit: Megajoule
governed by: EN 15804:2012+A2:2019
sub property of: Indicator
domain: EPDBlock
range: ImpactValues
comment: Use of renewable primary energy used as raw materials
comment: Използване на възобновяема първична енергия като суровини @bg
comment: Využití obnovitelné primární energie jako surovin @cs
comment: Brug af vedvarende primær energi anvendt som råmaterialer @da
comment: Einsatz von erneuerbarer Primärenergie als Rohstoffe @de
comment: Χρήση ανανεώσιμης πρωτογενούς ενέργειας ως πρώτων υλών @el
comment: Uso de energía primaria renovable como materias primas @es
comment: Taastuva primaarenergia kasutamine toorainetena @et
comment: Raaka-aineina käytetyn uusiutuvan primäärienergian käyttö @fi
comment: Utilisation de l'énergie primaire renouvelable comme matières premières @fr
comment: Úsáid fuinnimh phríomhúil in-athnuaite mar amhábhair @ga
comment: Uporaba obnovljive primarne energije kao sirovina @hr
comment: Nyersanyagként felhasznált megújuló primer energia felhasználása @hu
comment: Uso di energia primaria rinnovabile come materie prime @it
comment: Kaip žaliavų naudojamos atsinaujinančios pirminės energijos naudojimas @lt
comment: Kā izejvielu izmantotās atjaunojamās primārās enerģijas izmantošana @lv
comment: Użu ta' enerġija primarja rinnovabbli użata bħala materja prima @mt
comment: Gebruik van hernieuwbare primaire energie als grondstoffen @nl
comment: Zużycie odnawialnej energii pierwotnej wykorzystywanej jako surowce @pl
comment: Uso de energia primária renovável como matérias-primas @pt
comment: Utilizarea energiei primare regenerabile ca materii prime @ro
comment: Využitie obnoviteľnej primárnej energie ako surovín @sk
comment: Raba obnovljive primarne energije, uporabljene kot surovine @sl
comment: Användning av förnybar primärenergi som råmaterial @sv

Total use of renewable primary energy
type: ObjectProperty
label: Общо използване на възобновяема първична енергия @bg
label: Celkové využití obnovitelné primární energie @cs
label: Samlet brug af vedvarende primær energi @da
label: Gesamteinsatz erneuerbarer Primärenergie @de
label: Συνολική χρήση ανανεώσιμης πρωτογενούς ενέργειας @el
label: Uso total de energía primaria renovable @es
label: Taastuva primaarenergia kogukasutus @et
label: Uusiutuvan primäärienergian kokonaiskäyttö @fi
label: Utilisation totale d'énergie primaire renouvelable @fr
label: Úsáid iomlán fuinnimh phríomhúil in-athnuaite @ga
label: Ukupna uporaba obnovljive primarne energije @hr
label: Megújuló primer energia teljes felhasználása @hu
label: Uso totale di energia primaria rinnovabile @it
label: Bendras atsinaujinančios pirminės energijos naudojimas @lt
label: Kopējā atjaunojamās primārās enerģijas izmantošana @lv
label: Użu totali ta' enerġija primarja rinnovabbli @mt
label: Totaal gebruik van hernieuwbare primaire energie @nl
label: Całkowite zużycie odnawialnej energii pierwotnej @pl
label: Uso total de energia primária renovável @pt
label: Utilizarea totală a energiei primare regenerabile @ro
label: Celkové využitie obnoviteľnej primárnej energie @sk
label: Skupna raba obnovljive primarne energije @sl
label: Total användning av förnybar primärenergi @sv
unit: Megajoule
governed by: EN 15804:2012+A2:2019
sub property of: Indicator
domain: EPDBlock
range: ImpactValues
comment: Total use of renewable primary energy
comment: Общо използване на възобновяема първична енергия @bg
comment: Celkové využití obnovitelné primární energie @cs
comment: Samlet brug af vedvarende primær energi @da
comment: Gesamteinsatz erneuerbarer Primärenergie @de
comment: Συνολική χρήση ανανεώσιμης πρωτογενούς ενέργειας @el
comment: Uso total de energía primaria renovable @es
comment: Taastuva primaarenergia kogukasutus @et
comment: Uusiutuvan primäärienergian kokonaiskäyttö @fi
comment: Utilisation totale d'énergie primaire renouvelable @fr
comment: Úsáid iomlán fuinnimh phríomhúil in-athnuaite @ga
comment: Ukupna uporaba obnovljive primarne energije @hr
comment: Megújuló primer energia teljes felhasználása @hu
comment: Uso totale di energia primaria rinnovabile @it
comment: Bendras atsinaujinančios pirminės energijos naudojimas @lt
comment: Kopējā atjaunojamās primārās enerģijas izmantošana @lv
comment: Użu totali ta' enerġija primarja rinnovabbli @mt
comment: Totaal gebruik van hernieuwbare primaire energie @nl
comment: Całkowite zużycie odnawialnej energii pierwotnej @pl
comment: Uso total de energia primária renovável @pt
comment: Utilizarea totală a energiei primare regenerabile @ro
comment: Celkové využitie obnoviteľnej primárnej energie @sk
comment: Skupna raba obnovljive primarne energije @sl
comment: Total användning av förnybar primärenergi @sv

Use of non-renewable primary energy excl. raw materials
type: ObjectProperty
label: Използване на невъзобновяема първична енергия без суровини @bg
label: Využití neobnovitelné primární energie bez surovin @cs
label: Brug af ikke-vedvarende primær energi ekskl. råmaterialer @da
label: Einsatz von nicht erneuerbarer Primärenergie ohne Rohstoffe @de
label: Χρήση μη ανανεώσιμης πρωτογενούς ενέργειας εκτός των πρώτων υλών @el
label: Uso de energía primaria no renovable excluyendo materias primas @es
label: Taastumatu primaarenergia kasutamine, v.a toorained @et
label: Uusiutumattoman primäärienergian käyttö pl. raaka-aineet @fi
label: Utilisation de l'énergie primaire non renouvelable à l'exclusion des matières premières @fr
label: Úsáid fuinnimh phríomhúil neamh-inathnuaite seachas amhábhair @ga
label: Uporaba neobnovljive primarne energije, isključujući sirovine @hr
label: Nem megújuló primer energia felhasználása, a nyersanyagok kivételével @hu
label: Uso di energia primaria non rinnovabile escluse le materie prime @it
label: Neatsinaujinančios pirminės energijos naudojimas, išskyrus žaliavas @lt
label: Neatjaunojamās primārās enerģijas izmantošana, izņemot izejvielas @lv
label: Użu ta' enerġija primarja mhux rinnovabbli minbarra l-materja prima @mt
label: Gebruik van niet-hernieuwbare primaire energie excl. grondstoffen @nl
label: Zużycie nieodnawialnej energii pierwotnej, z wyłączeniem surowców @pl
label: Uso de energia primária não renovável, excluindo matérias-primas @pt
label: Utilizarea energiei primare neregenerabile, cu excepția materiilor prime @ro
label: Využitie neobnoviteľnej primárnej energie okrem surovín @sk
label: Raba neobnovljive primarne energije, razen surovin @sl
label: Användning av icke-förnybar primärenergi exkl. råmaterial @sv
unit: Megajoule
governed by: EN 15804:2012+A2:2019
sub property of: Indicator
domain: EPDBlock
range: ImpactValues
comment: Use of non-renewable primary energy excl. raw materials
comment: Използване на невъзобновяема първична енергия без суровини @bg
comment: Využití neobnovitelné primární energie bez surovin @cs
comment: Brug af ikke-vedvarende primær energi ekskl. råmaterialer @da
comment: Einsatz von nicht erneuerbarer Primärenergie ohne Rohstoffe @de
comment: Χρήση μη ανανεώσιμης πρωτογενούς ενέργειας εκτός των πρώτων υλών @el
comment: Uso de energía primaria no renovable excluyendo materias primas @es
comment: Taastumatu primaarenergia kasutamine, v.a toorained @et
comment: Uusiutumattoman primäärienergian käyttö pl. raaka-aineet @fi
comment: Utilisation de l'énergie primaire non renouvelable à l'exclusion des matières premières @fr
comment: Úsáid fuinnimh phríomhúil neamh-inathnuaite seachas amhábhair @ga
comment: Uporaba neobnovljive primarne energije, isključujući sirovine @hr
comment: Nem megújuló primer energia felhasználása, a nyersanyagok kivételével @hu
comment: Uso di energia primaria non rinnovabile escluse le materie prime @it
comment: Neatsinaujinančios pirminės energijos naudojimas, išskyrus žaliavas @lt
comment: Neatjaunojamās primārās enerģijas izmantošana, izņemot izejvielas @lv
comment: Użu ta' enerġija primarja mhux rinnovabbli minbarra l-materja prima @mt
comment: Gebruik van niet-hernieuwbare primaire energie excl. grondstoffen @nl
comment: Zużycie nieodnawialnej energii pierwotnej, z wyłączeniem surowców @pl
comment: Uso de energia primária não renovável, excluindo matérias-primas @pt
comment: Utilizarea energiei primare neregenerabile, cu excepția materiilor prime @ro
comment: Využitie neobnoviteľnej primárnej energie okrem surovín @sk
comment: Raba neobnovljive primarne energije, razen surovin @sl
comment: Användning av icke-förnybar primärenergi exkl. råmaterial @sv

Use of non-renewable primary energy used as raw materials
type: ObjectProperty
label: Използване на невъзобновяема първична енергия като суровини @bg
label: Využití neobnovitelné primární energie jako surovin @cs
label: Brug af ikke-vedvarende primær energi anvendt som råmaterialer @da
label: Einsatz von nicht erneuerbarer Primärenergie als Rohstoffe @de
label: Χρήση μη ανανεώσιμης πρωτογενούς ενέργειας ως πρώτων υλών @el
label: Uso de energía primaria no renovable como materias primas @es
label: Taastumatu primaarenergia kasutamine toorainetena @et
label: Raaka-aineina käytetyn uusiutumattoman primäärienergian käyttö @fi
label: Utilisation de l'énergie primaire non renouvelable comme matières premières @fr
label: Úsáid fuinnimh phríomhúil neamh-inathnuaite mar amhábhair @ga
label: Uporaba neobnovljive primarne energije kao sirovina @hr
label: Nyersanyagként felhasznált nem megújuló primer energia felhasználása @hu
label: Uso di energia primaria non rinnovabile come materie prime @it
label: Kaip žaliavų naudojamos neatsinaujinančios pirminės energijos naudojimas @lt
label: Kā izejvielu izmantotās neatjaunojamās primārās enerģijas izmantošana @lv
label: Użu ta' enerġija primarja mhux rinnovabbli użata bħala materja prima @mt
label: Gebruik van niet-hernieuwbare primaire energie als grondstoffen @nl
label: Zużycie nieodnawialnej energii pierwotnej wykorzystywanej jako surowce @pl
label: Uso de energia primária não renovável como matérias-primas @pt
label: Utilizarea energiei primare neregenerabile ca materii prime @ro
label: Využitie neobnoviteľnej primárnej energie ako surovín @sk
label: Raba neobnovljive primarne energije, uporabljene kot surovine @sl
label: Användning av icke-förnybar primärenergi som råmaterial @sv
unit: Megajoule
governed by: EN 15804:2012+A2:2019
sub property of: Indicator
domain: EPDBlock
range: ImpactValues
comment: Use of non-renewable primary energy used as raw materials
comment: Използване на невъзобновяема първична енергия като суровини @bg
comment: Využití neobnovitelné primární energie jako surovin @cs
comment: Brug af ikke-vedvarende primær energi anvendt som råmaterialer @da
comment: Einsatz von nicht erneuerbarer Primärenergie als Rohstoffe @de
comment: Χρήση μη ανανεώσιμης πρωτογενούς ενέργειας ως πρώτων υλών @el
comment: Uso de energía primaria no renovable como materias primas @es
comment: Taastumatu primaarenergia kasutamine toorainetena @et
comment: Raaka-aineina käytetyn uusiutumattoman primäärienergian käyttö @fi
comment: Utilisation de l'énergie primaire non renouvelable comme matières premières @fr
comment: Úsáid fuinnimh phríomhúil neamh-inathnuaite mar amhábhair @ga
comment: Uporaba neobnovljive primarne energije kao sirovina @hr
comment: Nyersanyagként felhasznált nem megújuló primer energia felhasználása @hu
comment: Uso di energia primaria non rinnovabile come materie prime @it
comment: Kaip žaliavų naudojamos neatsinaujinančios pirminės energijos naudojimas @lt
comment: Kā izejvielu izmantotās neatjaunojamās primārās enerģijas izmantošana @lv
comment: Użu ta' enerġija primarja mhux rinnovabbli użata bħala materja prima @mt
comment: Gebruik van niet-hernieuwbare primaire energie als grondstoffen @nl
comment: Zużycie nieodnawialnej energii pierwotnej wykorzystywanej jako surowce @pl
comment: Uso de energia primária não renovável como matérias-primas @pt
comment: Utilizarea energiei primare neregenerabile ca materii prime @ro
comment: Využitie neobnoviteľnej primárnej energie ako surovín @sk
comment: Raba neobnovljive primarne energije, uporabljene kot surovine @sl
comment: Användning av icke-förnybar primärenergi som råmaterial @sv

Total use of non-renewable primary energy
type: ObjectProperty
label: Общо използване на невъзобновяема първична енергия @bg
label: Celkové využití neobnovitelné primární energie @cs
label: Samlet brug af ikke-vedvarende primær energi @da
label: Gesamteinsatz nicht erneuerbarer Primärenergie @de
label: Συνολική χρήση μη ανανεώσιμης πρωτογενούς ενέργειας @el
label: Uso total de energía primaria no renovable @es
label: Taastumatu primaarenergia kogukasutus @et
label: Uusiutumattoman primäärienergian kokonaiskäyttö @fi
label: Utilisation totale d'énergie primaire non renouvelable @fr
label: Úsáid iomlán fuinnimh phríomhúil neamh-inathnuaite @ga
label: Ukupna uporaba neobnovljive primarne energije @hr
label: Nem megújuló primer energia teljes felhasználása @hu
label: Uso totale di energia primaria non rinnovabile @it
label: Bendras neatsinaujinančios pirminės energijos naudojimas @lt
label: Kopējā neatjaunojamās primārās enerģijas izmantošana @lv
label: Użu totali ta' enerġija primarja mhux rinnovabbli @mt
label: Totaal gebruik van niet-hernieuwbare primaire energie @nl
label: Całkowite zużycie nieodnawialnej energii pierwotnej @pl
label: Uso total de energia primária não renovável @pt
label: Utilizarea totală a energiei primare neregenerabile @ro
label: Celkové využitie neobnoviteľnej primárnej energie @sk
label: Skupna raba neobnovljive primarne energije @sl
label: Total användning av icke-förnybar primärenergi @sv
unit: Megajoule
governed by: EN 15804:2012+A2:2019
sub property of: Indicator
domain: EPDBlock
range: ImpactValues
comment: Total use of non-renewable primary energy
comment: Общо използване на невъзобновяема първична енергия @bg
comment: Celkové využití neobnovitelné primární energie @cs
comment: Samlet brug af ikke-vedvarende primær energi @da
comment: Gesamteinsatz nicht erneuerbarer Primärenergie @de
comment: Συνολική χρήση μη ανανεώσιμης πρωτογενούς ενέργειας @el
comment: Uso total de energía primaria no renovable @es
comment: Taastumatu primaarenergia kogukasutus @et
comment: Uusiutumattoman primäärienergian kokonaiskäyttö @fi
comment: Utilisation totale d'énergie primaire non renouvelable @fr
comment: Úsáid iomlán fuinnimh phríomhúil neamh-inathnuaite @ga
comment: Ukupna uporaba neobnovljive primarne energije @hr
comment: Nem megújuló primer energia teljes felhasználása @hu
comment: Uso totale di energia primaria non rinnovabile @it
comment: Bendras neatsinaujinančios pirminės energijos naudojimas @lt
comment: Kopējā neatjaunojamās primārās enerģijas izmantošana @lv
comment: Użu totali ta' enerġija primarja mhux rinnovabbli @mt
comment: Totaal gebruik van niet-hernieuwbare primaire energie @nl
comment: Całkowite zużycie nieodnawialnej energii pierwotnej @pl
comment: Uso total de energia primária não renovável @pt
comment: Utilizarea totală a energiei primare neregenerabile @ro
comment: Celkové využitie neobnoviteľnej primárnej energie @sk
comment: Skupna raba neobnovljive primarne energije @sl
comment: Total användning av icke-förnybar primärenergi @sv

Use of secondary material
type: ObjectProperty
label: Използване на вторични материали @bg
label: Využití druhotných surovin @cs
label: Brug af sekundære materialer @da
label: Einsatz von Sekundärstoffen @de
label: Χρήση δευτερογενών υλικών @el
label: Uso de materiales secundarios @es
label: Teiseste materjalide kasutamine @et
label: Uusiomateriaalien käyttö @fi
label: Utilisation de matériaux secondaires @fr
label: Úsáid ábhar tánaisteach @ga
label: Uporaba sekundarnih materijala @hr
label: Másodlagos anyagok felhasználása @hu
label: Uso di materiali secondari @it
label: Antrinių medžiagų naudojimas @lt
label: Otrreizējo materiālu izmantošana @lv
label: Użu ta' materjal sekondarju @mt
label: Gebruik van secundaire materialen @nl
label: Zużycie materiałów wtórnych @pl
label: Uso de materiais secundários @pt
label: Utilizarea materialelor secundare @ro
label: Využitie druhotných surovín @sk
label: Raba sekundarnih materialov @sl
label: Användning av sekundära material @sv
unit: Kilogram
governed by: EN 15804:2012+A2:2019
sub property of: Indicator
domain: EPDBlock
range: ImpactValues
comment: Use of secondary material
comment: Използване на вторични материали @bg
comment: Využití druhotných surovin @cs
comment: Brug af sekundære materialer @da
comment: Einsatz von Sekundärstoffen @de
comment: Χρήση δευτερογενών υλικών @el
comment: Uso de materiales secundarios @es
comment: Teiseste materjalide kasutamine @et
comment: Uusiomateriaalien käyttö @fi
comment: Utilisation de matériaux secondaires @fr
comment: Úsáid ábhar tánaisteach @ga
comment: Uporaba sekundarnih materijala @hr
comment: Másodlagos anyagok felhasználása @hu
comment: Uso di materiali secondari @it
comment: Antrinių medžiagų naudojimas @lt
comment: Otrreizējo materiālu izmantošana @lv
comment: Użu ta' materjal sekondarju @mt
comment: Gebruik van secundaire materialen @nl
comment: Zużycie materiałów wtórnych @pl
comment: Uso de materiais secundários @pt
comment: Utilizarea materialelor secundare @ro
comment: Využitie druhotných surovín @sk
comment: Raba sekundarnih materialov @sl
comment: Användning av sekundära material @sv

Use of renewable secondary fuels
type: ObjectProperty
label: Използване на възобновяеми вторични горива @bg
label: Využití obnovitelných druhotných paliv @cs
label: Brug af vedvarende sekundære brændstoffer @da
label: Einsatz von erneuerbaren Sekundärbrennstoffen @de
label: Χρήση ανανεώσιμων δευτερογενών καυσίμων @el
label: Uso de combustibles secundarios renovables @es
label: Taastuvate teisese kütuste kasutamine @et
label: Uusiutuvien uusiopolttoaineiden käyttö @fi
label: Utilisation de combustibles secondaires renouvelables @fr
label: Úsáid breoslaí tánaisteacha in-athnuaite @ga
label: Uporaba obnovljivih sekundarnih goriva @hr
label: Megújuló másodlagos tüzelőanyagok felhasználása @hu
label: Uso di combustibili secondari rinnovabili @it
label: Atsinaujinančio antrinio kuro naudojimas @lt
label: Atjaunojamo otrreizējo kurināmo izmantošana @lv
label: Użu ta' fjuwils sekondarji rinnovabbli @mt
label: Gebruik van hernieuwbare secundaire brandstoffen @nl
label: Zużycie odnawialnych paliw wtórnych @pl
label: Uso de combustíveis secundários renováveis @pt
label: Utilizarea combustibililor secundari regenerabili @ro
label: Využitie obnoviteľných druhotných palív @sk
label: Raba obnovljivih sekundarnih goriv @sl
label: Användning av förnybara sekundära bränslen @sv
unit: Megajoule
governed by: EN 15804:2012+A2:2019
sub property of: Indicator
domain: EPDBlock
range: ImpactValues
comment: Use of renewable secondary fuels
comment: Използване на възобновяеми вторични горива @bg
comment: Využití obnovitelných druhotných paliv @cs
comment: Brug af vedvarende sekundære brændstoffer @da
comment: Einsatz von erneuerbaren Sekundärbrennstoffen @de
comment: Χρήση ανανεώσιμων δευτερογενών καυσίμων @el
comment: Uso de combustibles secundarios renovables @es
comment: Taastuvate teisese kütuste kasutamine @et
comment: Uusiutuvien uusiopolttoaineiden käyttö @fi
comment: Utilisation de combustibles secondaires renouvelables @fr
comment: Úsáid breoslaí tánaisteacha in-athnuaite @ga
comment: Uporaba obnovljivih sekundarnih goriva @hr
comment: Megújuló másodlagos tüzelőanyagok felhasználása @hu
comment: Uso di combustibili secondari rinnovabili @it
comment: Atsinaujinančio antrinio kuro naudojimas @lt
comment: Atjaunojamo otrreizējo kurināmo izmantošana @lv
comment: Użu ta' fjuwils sekondarji rinnovabbli @mt
comment: Gebruik van hernieuwbare secundaire brandstoffen @nl
comment: Zużycie odnawialnych paliw wtórnych @pl
comment: Uso de combustíveis secundários renováveis @pt
comment: Utilizarea combustibililor secundari regenerabili @ro
comment: Využitie obnoviteľných druhotných palív @sk
comment: Raba obnovljivih sekundarnih goriv @sl
comment: Användning av förnybara sekundära bränslen @sv

Use of non-renewable secondary fuels
type: ObjectProperty
label: Използване на невъзобновяеми вторични горива @bg
label: Využití neobnovitelných druhotných paliv @cs
label: Brug af ikke-vedvarende sekundære brændstoffer @da
label: Einsatz von nicht erneuerbaren Sekundärbrennstoffen @de
label: Χρήση μη ανανεώσιμων δευτερογενών καυσίμων @el
label: Uso de combustibles secundarios no renovables @es
label: Taastumatute teisese kütuste kasutamine @et
label: Uusiutumattomien uusiopolttoaineiden käyttö @fi
label: Utilisation de combustibles secondaires non renouvelables @fr
label: Úsáid breoslaí tánaisteacha neamh-inathnuaite @ga
label: Uporaba neobnovljivih sekundarnih goriva @hr
label: Nem megújuló másodlagos tüzelőanyagok felhasználása @hu
label: Uso di combustibili secondari non rinnovabili @it
label: Neatsinaujinančio antrinio kuro naudojimas @lt
label: Neatjaunojamo otrreizējo kurināmo izmantošana @lv
label: Użu ta' fjuwils sekondarji mhux rinnovabbli @mt
label: Gebruik van niet-hernieuwbare secundaire brandstoffen @nl
label: Zużycie nieodnawialnych paliw wtórnych @pl
label: Uso de combustíveis secundários não renováveis @pt
label: Utilizarea combustibililor secundari neregenerabili @ro
label: Využitie neobnoviteľných druhotných palív @sk
label: Raba neobnovljivih sekundarnih goriv @sl
label: Användning av icke-förnybara sekundära bränslen @sv
unit: Megajoule
governed by: EN 15804:2012+A2:2019
sub property of: Indicator
domain: EPDBlock
range: ImpactValues
comment: Use of non-renewable secondary fuels
comment: Използване на невъзобновяеми вторични горива @bg
comment: Využití neobnovitelných druhotných paliv @cs
comment: Brug af ikke-vedvarende sekundære brændstoffer @da
comment: Einsatz von nicht erneuerbaren Sekundärbrennstoffen @de
comment: Χρήση μη ανανεώσιμων δευτερογενών καυσίμων @el
comment: Uso de combustibles secundarios no renovables @es
comment: Taastumatute teisese kütuste kasutamine @et
comment: Uusiutumattomien uusiopolttoaineiden käyttö @fi
comment: Utilisation de combustibles secondaires non renouvelables @fr
comment: Úsáid breoslaí tánaisteacha neamh-inathnuaite @ga
comment: Uporaba neobnovljivih sekundarnih goriva @hr
comment: Nem megújuló másodlagos tüzelőanyagok felhasználása @hu
comment: Uso di combustibili secondari non rinnovabili @it
comment: Neatsinaujinančio antrinio kuro naudojimas @lt
comment: Neatjaunojamo otrreizējo kurināmo izmantošana @lv
comment: Użu ta' fjuwils sekondarji mhux rinnovabbli @mt
comment: Gebruik van niet-hernieuwbare secundaire brandstoffen @nl
comment: Zużycie nieodnawialnych paliw wtórnych @pl
comment: Uso de combustíveis secundários não renováveis @pt
comment: Utilizarea combustibililor secundari neregenerabili @ro
comment: Využitie neobnoviteľných druhotných palív @sk
comment: Raba neobnovljivih sekundarnih goriv @sl
comment: Användning av icke-förnybara sekundära bränslen @sv

Net use of fresh water
type: ObjectProperty
label: Нетно използване на сладка вода @bg
label: Čisté použití sladké vody @cs
label: Nettoforbrug af ferskvand @da
label: Nettoeinsatz von Süßwasserressourcen @de
label: Καθαρή χρήση γλυκού νερού @el
label: Uso neto de agua dulce @es
label: Magevee netokasutus @et
label: Makean veden nettokäyttö @fi
label: Utilisation nette d'eau douce @fr
label: Glanúsáid fíoruisce @ga
label: Neto upotreba slatke vode @hr
label: Nettó édesvíz-felhasználás @hu
label: Uso netto di acqua dolce @it
label: Grynoji gėlo vandens dalis @lt
label: Saldūdens neto izmantojums @lv
label: Użu nett ta' ilma ħelu @mt
label: Netto gebruik van zoet water @nl
label: Zużycie netto słodkiej wody @pl
label: Uso líquido de água doce @pt
label: Utilizarea netă a apei dulci @ro
label: Čisté použitie sladkej vody @sk
label: Neto uporaba sladke vode @sl
label: Nettoanvändning av sötvatten @sv
unit: CubicMeter
governed by: EN 15804:2012+A2:2019
sub property of: Indicator
domain: EPDBlock
range: ImpactValues
comment: Net use of fresh water
comment: Нетно използване на сладка вода @bg
comment: Čisté použití sladké vody @cs
comment: Nettoforbrug af ferskvand @da
comment: Nettoeinsatz von Süßwasserressourcen @de
comment: Καθαρή χρήση γλυκού νερού @el
comment: Uso neto de agua dulce @es
comment: Magevee netokasutus @et
comment: Makean veden nettokäyttö @fi
comment: Utilisation nette d'eau douce @fr
comment: Glanúsáid fíoruisce @ga
comment: Neto upotreba slatke vode @hr
comment: Nettó édesvíz-felhasználás @hu
comment: Uso netto di acqua dolce @it
comment: Grynoji gėlo vandens dalis @lt
comment: Saldūdens neto izmantojums @lv
comment: Użu nett ta' ilma ħelu @mt
comment: Netto gebruik van zoet water @nl
comment: Zużycie netto słodkiej wody @pl
comment: Uso líquido de água doce @pt
comment: Utilizarea netă a apei dulci @ro
comment: Čisté použitie sladkej vody @sk
comment: Neto uporaba sladke vode @sl
comment: Nettoanvändning av sötvatten @sv

Hazardous waste disposed
type: ObjectProperty
label: Обезвредени опасни отпадъци @bg
label: Odstraněný nebezpečný odpad @cs
label: Bortskaffet farligt affald @da
label: Gefährlicher Abfall zur Deponie @de
label: Διατιθέμενα επικίνδυνα απόβλητα @el
label: Residuos peligrosos eliminados @es
label: Kõrvaldatud ohtlikud jäätmed @et
label: Hävitetyt vaaralliset jätteet @fi
label: Déchets dangereux éliminés @fr
label: Dramhaíl ghuaiseach dhiúscartha @ga
label: Zbrinuti opasni otpad @hr
label: Ártalmatlanított veszélyes hulladék @hu
label: Rifiuti pericolosi smaltiti @it
label: Šalintos pavojingosios atliekos @lt
label: Apglabātie bīstamie atkritumi @lv
label: Skart perikoluż mormi @mt
label: Gevaarlijk afval verwijderd @nl
label: Unieszkodliwione odpady niebezpieczne @pl
label: Resíduos perigosos eliminados @pt
label: Deșeuri periculoase eliminate @ro
label: Zneškodnený nebezpečný odpad @sk
label: Odstranjeni nevarni odpadki @sl
label: Bortskaffat farligt avfall @sv
unit: Kilogram
governed by: EN 15804:2012+A2:2019
sub property of: Indicator
domain: EPDBlock
range: ImpactValues
comment: Hazardous waste disposed
comment: Обезвредени опасни отпадъци @bg
comment: Odstraněný nebezpečný odpad @cs
comment: Bortskaffet farligt affald @da
comment: Gefährlicher Abfall zur Deponie @de
comment: Διατιθέμενα επικίνδυνα απόβλητα @el
comment: Residuos peligrosos eliminados @es
comment: Kõrvaldatud ohtlikud jäätmed @et
comment: Hävitetyt vaaralliset jätteet @fi
comment: Déchets dangereux éliminés @fr
comment: Dramhaíl ghuaiseach dhiúscartha @ga
comment: Zbrinuti opasni otpad @hr
comment: Ártalmatlanított veszélyes hulladék @hu
comment: Rifiuti pericolosi smaltiti @it
comment: Šalintos pavojingosios atliekos @lt
comment: Apglabātie bīstamie atkritumi @lv
comment: Skart perikoluż mormi @mt
comment: Gevaarlijk afval verwijderd @nl
comment: Unieszkodliwione odpady niebezpieczne @pl
comment: Resíduos perigosos eliminados @pt
comment: Deșeuri periculoase eliminate @ro
comment: Zneškodnený nebezpečný odpad @sk
comment: Odstranjeni nevarni odpadki @sl
comment: Bortskaffat farligt avfall @sv

Non-hazardous waste disposed
type: ObjectProperty
label: Обезвредени неопасни отпадъци @bg
label: Odstraněný ostatní odpad @cs
label: Bortskaffet ikke-farligt affald @da
label: Entsorgter nicht gefährlicher Abfall @de
label: Διατιθέμενα μη επικίνδυνα απόβλητα @el
label: Residuos no peligrosos eliminados @es
label: Kõrvaldatud tavajäätmed @et
label: Hävitetyt vaarattomat jätteet @fi
label: Déchets non dangereux éliminés @fr
label: Dramhaíl neamhghuaiseach dhiúscartha @ga
label: Zbrinuti neopasni otpad @hr
label: Ártalmatlanított nem veszélyes hulladék @hu
label: Rifiuti non pericolosi smaltiti @it
label: Šalintos nepavojingosios atliekos @lt
label: Apglabātie nebīstamie atkritumi @lv
label: Skart mhux perikoluż mormi @mt
label: Niet-gevaarlijk afval verwijderd @nl
label: Unieszkodliwione odpady inne niż niebezpieczne @pl
label: Resíduos não perigosos eliminados @pt
label: Deșeuri nepericuloase eliminate @ro
label: Zneškodnený ostatný odpad @sk
label: Odstranjeni nenevarni odpadki @sl
label: Bortskaffat icke-farligt avfall @sv
unit: Kilogram
governed by: EN 15804:2012+A2:2019
sub property of: Indicator
domain: EPDBlock
range: ImpactValues
comment: Non-hazardous waste disposed
comment: Обезвредени неопасни отпадъци @bg
comment: Odstraněný ostatní odpad @cs
comment: Bortskaffet ikke-farligt affald @da
comment: Entsorgter nicht gefährlicher Abfall @de
comment: Διατιθέμενα μη επικίνδυνα απόβλητα @el
comment: Residuos no peligrosos eliminados @es
comment: Kõrvaldatud tavajäätmed @et
comment: Hävitetyt vaarattomat jätteet @fi
comment: Déchets non dangereux éliminés @fr
comment: Dramhaíl neamhghuaiseach dhiúscartha @ga
comment: Zbrinuti neopasni otpad @hr
comment: Ártalmatlanított nem veszélyes hulladék @hu
comment: Rifiuti non pericolosi smaltiti @it
comment: Šalintos nepavojingosios atliekos @lt
comment: Apglabātie nebīstamie atkritumi @lv
comment: Skart mhux perikoluż mormi @mt
comment: Niet-gevaarlijk afval verwijderd @nl
comment: Unieszkodliwione odpady inne niż niebezpieczne @pl
comment: Resíduos não perigosos eliminados @pt
comment: Deșeuri nepericuloase eliminate @ro
comment: Zneškodnený ostatný odpad @sk
comment: Odstranjeni nenevarni odpadki @sl
comment: Bortskaffat icke-farligt avfall @sv

Radioactive waste disposed
type: ObjectProperty
label: Обезвредени радиоактивни отпадъци @bg
label: Odstraněný radioaktivní odpad @cs
label: Bortskaffet radioaktivt affald @da
label: Entsorgter radioaktiver Abfall @de
label: Διατιθέμενα ραδιενεργά απόβλητα @el
label: Residuos radiactivos eliminados @es
label: Kõrvaldatud radioaktiivsed jäätmed @et
label: Hävitetyt radioaktiiviset jätteet @fi
label: Déchets radioactifs éliminés @fr
label: Dramhaíl radaighníomhach dhiúscartha @ga
label: Zbrinuti radioaktivni otpad @hr
label: Ártalmatlanított radioaktív hulladék @hu
label: Rifiuti radioattivi smaltiti @it
label: Šalintos radioaktyviosios atliekos @lt
label: Apglabātie radioaktīvie atkritumi @lv
label: Skart radjuattiv mormi @mt
label: Radioactief afval verwijderd @nl
label: Unieszkodliwione odpady promieniotwórcze @pl
label: Resíduos radioativos eliminados @pt
label: Deșeuri radioactive eliminate @ro
label: Zneškodnený rádioaktívny odpad @sk
label: Odstranjeni radioaktivni odpadki @sl
label: Bortskaffat radioaktivt avfall @sv
unit: Kilogram
governed by: EN 15804:2012+A2:2019
sub property of: Indicator
domain: EPDBlock
range: ImpactValues
comment: Radioactive waste disposed
comment: Обезвредени радиоактивни отпадъци @bg
comment: Odstraněný radioaktivní odpad @cs
comment: Bortskaffet radioaktivt affald @da
comment: Entsorgter radioaktiver Abfall @de
comment: Διατιθέμενα ραδιενεργά απόβλητα @el
comment: Residuos radiactivos eliminados @es
comment: Kõrvaldatud radioaktiivsed jäätmed @et
comment: Hävitetyt radioaktiiviset jätteet @fi
comment: Déchets radioactifs éliminés @fr
comment: Dramhaíl radaighníomhach dhiúscartha @ga
comment: Zbrinuti radioaktivni otpad @hr
comment: Ártalmatlanított radioaktív hulladék @hu
comment: Rifiuti radioattivi smaltiti @it
comment: Šalintos radioaktyviosios atliekos @lt
comment: Apglabātie radioaktīvie atkritumi @lv
comment: Skart radjuattiv mormi @mt
comment: Radioactief afval verwijderd @nl
comment: Unieszkodliwione odpady promieniotwórcze @pl
comment: Resíduos radioativos eliminados @pt
comment: Deșeuri radioactive eliminate @ro
comment: Zneškodnený rádioaktívny odpad @sk
comment: Odstranjeni radioaktivni odpadki @sl
comment: Bortskaffat radioaktivt avfall @sv

Components for re-use
type: ObjectProperty
label: Компоненти за повторна употреба @bg
label: Komponenty pro opětovné použití @cs
label: Komponenter til genbrug @da
label: Komponenten für die Wiederverwendung @de
label: Εξαρτήματα για επαναχρησιμοποίηση @el
label: Componentes para su reutilización @es
label: Komponendid korduskasutuseks @et
label: Komponentit uudelleenkäyttöön @fi
label: Composants destinés à la réutilisation @fr
label: Comhpháirteanna le hathúsáid @ga
label: Komponente za ponovnu uporabu @hr
label: Újrahasználatra szánt alkatrészek @hu
label: Componenti per il riutilizzo @it
label: Komponentai pakartotiniam naudojimui @lt
label: Komponenti atkārtotai izmantošanai @lv
label: Komponenti għall-użu mill-ġdid @mt
label: Componenten voor hergebruik @nl
label: Komponenty do ponownego użycia @pl
label: Componentes para reutilização @pt
label: Componente pentru reutilizare @ro
label: Komponenty na opätovné použitie @sk
label: Komponente za ponovno uporabo @sl
label: Komponenter för återanvändning @sv
unit: Kilogram
governed by: EN 15804:2012+A2:2019
sub property of: Indicator
domain: EPDBlock
range: ImpactValues
comment: Components for re-use
comment: Компоненти за повторна употреба @bg
comment: Komponenty pro opětovné použití @cs
comment: Komponenter til genbrug @da
comment: Komponenten für die Wiederverwendung @de
comment: Εξαρτήματα για επαναχρησιμοποίηση @el
comment: Componentes para su reutilización @es
comment: Komponendid korduskasutuseks @et
comment: Komponentit uudelleenkäyttöön @fi
comment: Composants destinés à la réutilisation @fr
comment: Comhpháirteanna le hathúsáid @ga
comment: Komponente za ponovnu uporabu @hr
comment: Újrahasználatra szánt alkatrészek @hu
comment: Componenti per il riutilizzo @it
comment: Komponentai pakartotiniam naudojimui @lt
comment: Komponenti atkārtotai izmantošanai @lv
comment: Komponenti għall-użu mill-ġdid @mt
comment: Componenten voor hergebruik @nl
comment: Komponenty do ponownego użycia @pl
comment: Componentes para reutilização @pt
comment: Componente pentru reutilizare @ro
comment: Komponenty na opätovné použitie @sk
comment: Komponente za ponovno uporabo @sl
comment: Komponenter för återanvändning @sv

Materials for recycling
type: ObjectProperty
label: Материали за рециклиране @bg
label: Materiály k recyklaci @cs
label: Materialer til genanvendelse @da
label: Stoffe für das Recycling @de
label: Υλικά για ανακύκλωση @el
label: Materiales para el reciclaje @es
label: Materjalid ringlussevõtuks @et
label: Materiaalit kierrätykseen @fi
label: Matériaux destinés au recyclage @fr
label: Ábhair le hathchúrsáil @ga
label: Materijali za recikliranje @hr
label: Újrafeldolgozásra szánt anyagok @hu
label: Materiali per il riciclaggio @it
label: Medžiagos perdirbimui @lt
label: Materiāli pārstrādei @lv
label: Materjali għar-riċiklaġġ @mt
label: Materialen voor recycling @nl
label: Materiały do recyklingu @pl
label: Materiais para reciclagem @pt
label: Materiale pentru reciclare @ro
label: Materiály na recykláciu @sk
label: Materiali za recikliranje @sl
label: Material för materialåtervinning @sv
unit: Kilogram
governed by: EN 15804:2012+A2:2019
sub property of: Indicator
domain: EPDBlock
range: ImpactValues
comment: Materials for recycling
comment: Материали за рециклиране @bg
comment: Materiály k recyklaci @cs
comment: Materialer til genanvendelse @da
comment: Stoffe für das Recycling @de
comment: Υλικά για ανακύκλωση @el
comment: Materiales para el reciclaje @es
comment: Materjalid ringlussevõtuks @et
comment: Materiaalit kierrätykseen @fi
comment: Matériaux destinés au recyclage @fr
comment: Ábhair le hathchúrsáil @ga
comment: Materijali za recikliranje @hr
comment: Újrafeldolgozásra szánt anyagok @hu
comment: Materiali per il riciclaggio @it
comment: Medžiagos perdirbimui @lt
comment: Materiāli pārstrādei @lv
comment: Materjali għar-riċiklaġġ @mt
comment: Materialen voor recycling @nl
comment: Materiały do recyklingu @pl
comment: Materiais para reciclagem @pt
comment: Materiale pentru reciclare @ro
comment: Materiály na recykláciu @sk
comment: Materiali za recikliranje @sl
comment: Material för materialåtervinning @sv

Materials for energy recovery
type: ObjectProperty
label: Материали за оползотворяване на енергия @bg
label: Materiály pro energetické využití @cs
label: Materialer til energiudnyttelse @da
label: Stoffe für die Energierückgewinnung @de
label: Υλικά για ανάκτηση ενέργειας @el
label: Materiales para la valorización energética @es
label: Materjalid energia taaskasutamiseks @et
label: Materiaalit energian talteenottoon @fi
label: Matériaux destinés à la récupération d'énergie @fr
label: Ábhair d'aisghabháil fuinnimh @ga
label: Materijali za energetsku oporabu @hr
label: Energetikai hasznosításra szánt anyagok @hu
label: Materiali per il recupero energetico @it
label: Medžiagos energijai gauti @lt
label: Materiāli enerģijas reģenerācijai @lv
label: Materjali għall-irkupru tal-enerġija @mt
label: Materialen voor energieterugwinning @nl
label: Materiały do odzysku energii @pl
label: Materiais para valorização energética @pt
label: Materiale pentru recuperarea energiei @ro
label: Materiály na energetické zhodnotenie @sk
label: Materiali za energetsko predelavo @sl
label: Material för energiåtervinning @sv
unit: Kilogram
governed by: EN 15804:2012+A2:2019
sub property of: Indicator
domain: EPDBlock
range: ImpactValues
comment: Materials for energy recovery
comment: Материали за оползотворяване на енергия @bg
comment: Materiály pro energetické využití @cs
comment: Materialer til energiudnyttelse @da
comment: Stoffe für die Energierückgewinnung @de
comment: Υλικά για ανάκτηση ενέργειας @el
comment: Materiales para la valorización energética @es
comment: Materjalid energia taaskasutamiseks @et
comment: Materiaalit energian talteenottoon @fi
comment: Matériaux destinés à la récupération d'énergie @fr
comment: Ábhair d'aisghabháil fuinnimh @ga
comment: Materijali za energetsku oporabu @hr
comment: Energetikai hasznosításra szánt anyagok @hu
comment: Materiali per il recupero energetico @it
comment: Medžiagos energijai gauti @lt
comment: Materiāli enerģijas reģenerācijai @lv
comment: Materjali għall-irkupru tal-enerġija @mt
comment: Materialen voor energieterugwinning @nl
comment: Materiały do odzysku energii @pl
comment: Materiais para valorização energética @pt
comment: Materiale pentru recuperarea energiei @ro
comment: Materiály na energetické zhodnotenie @sk
comment: Materiali za energetsko predelavo @sl
comment: Material för energiåtervinning @sv

Exported energy
type: ObjectProperty
label: Изнесена енергия @bg
label: Exportovaná energie @cs
label: Eksporteret energi @da
label: Exportierte Energie @de
label: Εξαγόμενη ενέργεια @el
label: Energía exportada @es
label: Eksporditud energia @et
label: Viemäenergia @fi
label: Énergie exportée @fr
label: Fuinneamh onnmhairithe @ga
label: Izvezena energija @hr
label: Exportált energia @hu
label: Energia esportata @it
label: Eksportuota energija @lt
label: Eksportētā enerģija @lv
label: Enerġija esportata @mt
label: Geëxporteerde energie @nl
label: Wysłana energia @pl
label: Energia exportada @pt
label: Energie exportată @ro
label: Exportovaná energia @sk
label: Izvožena energija @sl
label: Exporterad energi @sv
unit: Megajoule
governed by: EN 15804:2012+A2:2019
sub property of: Indicator
domain: EPDBlock
range: ImpactValues
comment: Exported energy
comment: Изнесена енергия @bg
comment: Exportovaná energie @cs
comment: Eksporteret energi @da
comment: Exportierte Energie @de
comment: Εξαγόμενη ενέργεια @el
comment: Energía exportada @es
comment: Eksporditud energia @et
comment: Viemäenergia @fi
comment: Énergie exportée @fr
comment: Fuinneamh onnmhairithe @ga
comment: Izvezena energija @hr
comment: Exportált energia @hu
comment: Energia esportata @it
comment: Eksportuota energija @lt
comment: Eksportētā enerģija @lv
comment: Enerġija esportata @mt
comment: Geëxporteerde energie @nl
comment: Wysłana energia @pl
comment: Energia exportada @pt
comment: Energie exportată @ro
comment: Exportovaná energia @sk
comment: Izvožena energija @sl
comment: Exporterad energi @sv